{"text_format":"1","workbook":"xlsx","n_sheets":11,"sheets":["Info","Ny NPC","Secondary","Bonuses","Items","Spells","Rasbonus","Diverse","Levelbonus","AllaSkills","2nd"],"not_rendered":{"charts":0,"images":2,"macros":1,"external_links":0,"defined_names":20,"comments":3,"pivot_tables":0},"unopened":[],"bounds":{"document_bytes":16777216,"sheet_cells":100000,"rows_first":2000,"rows_last":500,"rows_between":2000,"halvings":0,"cell_chars":16384,"cell_head_chars":4096},"cells_cut":0,"cells_raw":0,"read":"whole","date_system":"1900"}

{"sheet":"Info","index":0,"n_rows":24,"n_cols":1,"rows_kept":24,"cut":false,"hidden":false,"merged":[[9,0,11,0],[23,0,24,0],[3,0,5,0]]}
[]
[]
["Character generator, ver 1.0 Middle-Earth edition"]
["Jag tog den av Charlie och förädlade den. Välkommen till 2011, nu kan vi göra rollpersoner i datan. Jag har ändrat och lagt till mycket och glömt bort att skriva versioninfo tyvärr, så ja…  men allt funkar. Tror jag."]
[]
[]
[]
[]
["NPC-generator, ver 0.6 Georgetown edition"]
["Är du less på att göra NPCs och försöka klura ut en rimlig OB? Det hoppas jag att du slipper. Den här kalkylen genererar en NPC utan namn, de NPC som har namn bör göras lika noggrant som en vanlig karaktär."]
[]
[]
[]
["Vad behöver du?"]
["Ett kalkylprogram kompatibelt med Excel 97. OpenOffice.org är tyvärr inte det ännu…"]
["Aktivera makron (eller nöj dig med att göra bara en NPC)."]
["Troligtvis behöver du ha spelat RoleMaster i Spelföreningen Stonehenge också…"]
["En skärmupplösning som är 1024 x 768 eller ett fönster som är så stort…"]
[]
[]
["Hjälp, jag fattar ingenting av det här!"]
[]
[]
[{"$f":"OFFSET(Diverse!K1,Diverse!L1-1,0)","v":"Svar på tal, din jävla tattare… du med så sparsam intellektuell begåvning ska passa dig noga!"}]

{"sheet":"Ny NPC","index":1,"n_rows":73,"n_cols":29,"rows_kept":73,"cut":false,"hidden":false,"merged":[[61,10,62,14],[10,18,13,18],[16,18,17,18],[19,36,19,37],[71,16,71,18],[62,16,62,18],[67,16,67,18],[68,16,68,18],[69,16,69,18],[70,16,70,18],[63,16,63,18],[64,16,64,18],[65,16,65,18],[66,16,66,18]]}
[]
[1,"Cost",1,"Hur ofta sätter du ut kryss?","Rank","Cost1","Cost2","Cost",null,"Skill","Stat","Lvl","Ras","Armor","Special","Item","Total",null,"Character Name",null,null,"Temp","Dev","Pot","Stat","Ras","B.O","Spec","Tot"]
["AM Balance",{"$f":"VLOOKUP(A3,AllaSkills!$A$3:$BV$319,$A$2+3,FALSE)","v":"6"},0,{"$f":"INDEX(Diverse!$H$1:$H$5,$C3+1)","v":"Nada"},{"$f":"ROUND(Level*(C3/2),0)+VLOOKUP($A3,Rasbonus!$A$29:$AM$59,MATCH(Ras,Rasbonus!$A$1:$AM$1,0),FALSE)","v":0},{"$f":"IF(LEN(B3)=3,LEFT(B3,1),IF(LEN(B3)<3,B3,99))","v":"6"},{"$f":"IF(RIGHT(B3,1)=\"*\",LEFT(B3,1),IF(LEN(B3)=3,RIGHT(B3,1),IF(LEN(B3)<3,B3,RIGHT(B3,2))))","v":"6"},{"$f":"IF(D3=\"Ett varannan level\",F3+F3-F3,IF(D3=\"Ett varje level\",2*F3,IF(D3=\"Tre på två levlar\",F3+G3+F3,IF(D3=\"Nada\",0,F3+G3+F3+G3))))","v":0},{"$f":"HLOOKUP(Yrke,Levelbonus!$B$1:$CR$20,6,0)","v":0},{"$f":"IF(E3<1,-25,IF(E3>30,80+((E3-30)*0.5),IF(E3>20,70+(E3-20),IF(E3>10,50+((E3-10)*2),E3*5))))","v":-25},{"$f":"ROUND((AG+SD)/2,0)","v":5},{"$f":"IF(Level<21,Level*I3,IF(I3>2,60+(Level-20),IF(I3=2,40+((Level-20)*0.5),IF(Level=0,0,IF(I3=0,0,20)))))","v":0},{"$f":"IF(ISNUMBER(VLOOKUP($A3,Rasbonus!$A$61:$AM$295,MATCH(Ras,Rasbonus!$A$1:$AM$1,0),FALSE)),VLOOKUP($A3,Rasbonus!$A$61:$AM$295,MATCH(Ras,Rasbonus!$A$1:$AM$1,0),FALSE),0)","v":0},{"$f":"IF($AC$58>16,$Q$23,IF($AC$58>12,$Q$22, IF($AC$58>8,$Q$21,IF($AC$58>4,$Q$20,\"0\"))))","v":"0"},null,null,{"$f":"SUM(J3:P3)","v":-20},null,"Yrke",null,"Constitution",75,{"$f":"VLOOKUP(V3,Diverse!$A$2:$C$131,3,0)","v":7},null,{"$f":"VLOOKUP(V3,Diverse!$A$2:$B$131,2,0)","v":5},{"$f":"HLOOKUP(Ras,Rasbonus!$B$1:$AM$12,2,0)","v":15},null,null,{"$f":"SUM(Y3:AB3)","v":20}]
["AM Landing",{"$f":"VLOOKUP(A4,AllaSkills!$A$3:$BV$319,$A$2+3,FALSE)","v":"6"},0,{"$f":"INDEX(Diverse!$H$1:$H$5,$C4+1)","v":"Nada"},{"$f":"ROUND(Level*(C4/2),0)","v":0},{"$f":"IF(LEN(B4)=3,LEFT(B4,1),IF(LEN(B4)<3,B4,99))","v":"6"},"6",{"$f":"IF(D4=\"Ett varannan level\",F4+F4-F4,IF(D4=\"Ett varje level\",2*F4,IF(D4=\"Tre på två levlar\",F4+G4+F4,IF(D4=\"Nada\",0,F4+G4+F4+G4))))","v":0},{"$f":"HLOOKUP(Yrke,Levelbonus!$B$1:$CR$20,6,0)","v":0},{"$f":"IF(E4<1,-25,IF(E4>30,80+((E4-30)*0.5),IF(E4>20,70+(E4-20),IF(E4>10,50+((E4-10)*2),E4*5))))","v":-25},{"$f":"ROUND((AG+SD)/2,0)","v":5},0,{"$f":"IF(ISNUMBER(VLOOKUP($A4,Rasbonus!$A$61:$AM$295,MATCH(Ras,Rasbonus!$A$1:$AM$1,0),FALSE)),VLOOKUP($A4,Rasbonus!$A$61:$AM$295,MATCH(Ras,Rasbonus!$A$1:$AM$1,0),FALSE),0)","v":0},{"$f":"IF($AC$58>16,$Q$23,IF($AC$58>12,$Q$22, IF($AC$58>8,$Q$21,IF($AC$58>4,$Q$20,\"0\"))))","v":"0"},null,null,-20,null,null,null,"Agility",75,{"$f":"VLOOKUP(V4,Diverse!$A$2:$C$131,3,0)","v":7},null,{"$f":"VLOOKUP(V4,Diverse!$A$2:$B$131,2,0)","v":5},{"$f":"HLOOKUP(Ras,Rasbonus!$B$1:$AM$12,3,0)","v":0},null,null,{"$f":"SUM(Y4:AB4)","v":5}]
["AM Leaping",{"$f":"VLOOKUP(A5,AllaSkills!$A$3:$BV$319,$A$2+3,FALSE)","v":"6"},0,{"$f":"INDEX(Diverse!$H$1:$H$5,$C5+1)","v":"Nada"},{"$f":"ROUND(Level*(C5/2),0)","v":0},{"$f":"IF(LEN(B5)=3,LEFT(B5,1),IF(LEN(B5)<3,B5,99))","v":"6"},"6",{"$f":"IF(D5=\"Ett varannan level\",F5+F5-F5,IF(D5=\"Ett varje level\",2*F5,IF(D5=\"Tre på två levlar\",F5+G5+F5,IF(D5=\"Nada\",0,F5+G5+F5+G5))))","v":0},{"$f":"HLOOKUP(Yrke,Levelbonus!$B$1:$CR$20,6,0)","v":0},{"$f":"IF(E5<1,-25,IF(E5>30,80+((E5-30)*0.5),IF(E5>20,70+(E5-20),IF(E5>10,50+((E5-10)*2),E5*5))))","v":-25},{"$f":"ROUND((AG+SD)/2,0)","v":5},0,{"$f":"IF(ISNUMBER(VLOOKUP($A5,Rasbonus!$A$61:$AM$295,MATCH(Ras,Rasbonus!$A$1:$AM$1,0),FALSE)),VLOOKUP($A5,Rasbonus!$A$61:$AM$295,MATCH(Ras,Rasbonus!$A$1:$AM$1,0),FALSE),0)","v":0},{"$f":"IF($AC$58>16,$Q$23,IF($AC$58>12,$Q$22, IF($AC$58>8,$Q$21,IF($AC$58>4,$Q$20,\"0\"))))","v":"0"},null,null,-20,null,null,null,"Self Discipline",75,{"$f":"VLOOKUP(V5,Diverse!$A$2:$C$131,3,0)","v":7},null,{"$f":"VLOOKUP(V5,Diverse!$A$2:$B$131,2,0)","v":5},{"$f":"HLOOKUP(Ras,Rasbonus!$B$1:$AM$12,4,0)","v":0},null,null,{"$f":"SUM(Y5:AB5)","v":5}]
["AM Speed",{"$f":"VLOOKUP(A6,AllaSkills!$A$3:$BV$319,$A$2+3,FALSE)","v":"6"},0,{"$f":"INDEX(Diverse!$H$1:$H$5,$C6+1)","v":"Nada"},{"$f":"ROUND(Level*(C6/2),0)+VLOOKUP($A6,Rasbonus!$A$29:$AM$59,MATCH(Ras,Rasbonus!$A$1:$AM$1,0),FALSE)","v":0},"6","6",0,{"$f":"HLOOKUP(Yrke,Levelbonus!$B$1:$CR$20,6,0)","v":0},-25,{"$f":"ROUND((AG+SD)/2,0)","v":5},0,{"$f":"IF(ISNUMBER(VLOOKUP($A6,Rasbonus!$A$61:$AM$295,MATCH(Ras,Rasbonus!$A$1:$AM$1,0),FALSE)),VLOOKUP($A6,Rasbonus!$A$61:$AM$295,MATCH(Ras,Rasbonus!$A$1:$AM$1,0),FALSE),0)","v":0},{"$f":"IF($AC$58>16,$Q$23,IF($AC$58>12,$Q$22, IF($AC$58>8,$Q$21,IF($AC$58>4,$Q$20,\"0\"))))","v":"0"},null,null,-20,null,"Ras",null,"Reasoning",75,{"$f":"VLOOKUP(V6,Diverse!$A$2:$C$131,3,0)","v":7},null,{"$f":"VLOOKUP(V6,Diverse!$A$2:$B$131,2,0)","v":5},{"$f":"HLOOKUP(Ras,Rasbonus!$B$1:$AM$12,5,0)","v":0},null,null,5]
["AM Strength",{"$f":"VLOOKUP(A7,AllaSkills!$A$3:$BV$319,$A$2+3,FALSE)","v":"6"},0,{"$f":"INDEX(Diverse!$H$1:$H$5,$C7+1)","v":"Nada"},{"$f":"ROUND(Level*(C7/2),0)+VLOOKUP($A7,Rasbonus!$A$29:$AM$59,MATCH(Ras,Rasbonus!$A$1:$AM$1,0),FALSE)","v":2},"6","6",0,{"$f":"HLOOKUP(Yrke,Levelbonus!$B$1:$CR$20,6,0)","v":0},10,{"$f":"ROUND((ST+SD)/2,0)","v":13},0,{"$f":"IF(ISNUMBER(VLOOKUP($A7,Rasbonus!$A$61:$AM$295,MATCH(Ras,Rasbonus!$A$1:$AM$1,0),FALSE)),VLOOKUP($A7,Rasbonus!$A$61:$AM$295,MATCH(Ras,Rasbonus!$A$1:$AM$1,0),FALSE),0)","v":0},null,null,null,23,null,null,null,"Eloquence",75,{"$f":"VLOOKUP(V7,Diverse!$A$2:$C$131,3,0)","v":7},null,{"$f":"VLOOKUP(V7,Diverse!$A$2:$B$131,2,0)","v":5},{"$f":"HLOOKUP(Ras,Rasbonus!$B$1:$AM$12,6,0)","v":0},null,null,5]
["Adrenal Defense",{"$f":"VLOOKUP(A8,AllaSkills!$A$3:$BV$319,$A$2+3,FALSE)","v":"20"},0,{"$f":"INDEX(Diverse!$H$1:$H$5,$C8+1)","v":"Nada"},{"$f":"ROUND(Level*(C8/2),0)","v":0},"20","20",0,{"$f":"HLOOKUP(Yrke,Levelbonus!$B$1:$CR$20,6,0)","v":0},-25,null,0,{"$f":"IF(ISNUMBER(VLOOKUP($A8,Rasbonus!$A$61:$AM$295,MATCH(Ras,Rasbonus!$A$1:$AM$1,0),FALSE)),VLOOKUP($A8,Rasbonus!$A$61:$AM$295,MATCH(Ras,Rasbonus!$A$1:$AM$1,0),FALSE),0)","v":0},{"$f":"IF($AC$58>16,$Q$23,IF($AC$58>12,$Q$22, IF($AC$58>8,$Q$21,IF($AC$58>4,$Q$20,\"0\"))))","v":"0"},null,null,-25,null,null,null,"Strength",75,{"$f":"VLOOKUP(V8,Diverse!$A$2:$C$131,3,0)","v":7},null,{"$f":"VLOOKUP(V8,Diverse!$A$2:$B$131,2,0)","v":5},{"$f":"HLOOKUP(Ras,Rasbonus!$B$1:$AM$12,7,0)","v":15},null,null,20]
["Armored AD",{"$f":"VLOOKUP(A9,AllaSkills!$A$3:$BV$319,$A$2+3,FALSE)","v":"20"},0,{"$f":"INDEX(Diverse!$H$1:$H$5,$C9+1)","v":"Nada"},0,"20","20",0,{"$f":"HLOOKUP(Yrke,Levelbonus!$B$1:$CR$20,6,0)","v":0},-25,null,0,{"$f":"IF(ISNUMBER(VLOOKUP($A9,Rasbonus!$A$61:$AM$295,MATCH(Ras,Rasbonus!$A$1:$AM$1,0),FALSE)),VLOOKUP($A9,Rasbonus!$A$61:$AM$295,MATCH(Ras,Rasbonus!$A$1:$AM$1,0),FALSE),0)","v":0},{"$f":"IF($AC$58>16,$Q$23,IF($AC$58>12,$Q$22, IF($AC$58>8,$Q$21,IF($AC$58>4,$Q$20,\"0\"))))","v":"0"},null,null,-25,null,{"$f":"CONCATENATE(\"Level:      \",Level)","v":"Level:      1"},null,"Quickness",75,{"$f":"VLOOKUP(V9,Diverse!$A$2:$C$131,3,0)","v":7},null,{"$f":"VLOOKUP(V9,Diverse!$A$2:$B$131,2,0)","v":5},{"$f":"HLOOKUP(Ras,Rasbonus!$B$1:$AM$12,8,0)","v":-5},null,null,0]
["Ambush",{"$f":"VLOOKUP(A10,AllaSkills!$A$3:$BV$319,$A$2+3,FALSE)","v":"9"},0,{"$f":"INDEX(Diverse!$H$1:$H$5,$C10+1)","v":"Nada"},{"$f":"ROUND(Level*(C10/2),0)+VLOOKUP($A10,Rasbonus!$A$29:$AM$59,MATCH(Ras,Rasbonus!$A$1:$AM$1,0),FALSE)","v":0},"9","9",0,{"$f":"HLOOKUP(Yrke,Levelbonus!$B$1:$CR$20,7,0)","v":0},-25,null,0,{"$f":"IF(ISNUMBER(VLOOKUP($A10,Rasbonus!$A$61:$AM$295,MATCH(Ras,Rasbonus!$A$1:$AM$1,0),FALSE)),VLOOKUP($A10,Rasbonus!$A$61:$AM$295,MATCH(Ras,Rasbonus!$A$1:$AM$1,0),FALSE),0)","v":0},null,null,null,-25,null,null,null,"Presence",75,{"$f":"VLOOKUP(V10,Diverse!$A$2:$C$131,3,0)","v":7},null,{"$f":"VLOOKUP(V10,Diverse!$A$2:$B$131,2,0)","v":5},{"$f":"HLOOKUP(Ras,Rasbonus!$B$1:$AM$12,9,0)","v":5},null,null,10]
["Sniping",{"$f":"VLOOKUP(A11,AllaSkills!$A$3:$BV$319,$A$2+3,FALSE)","v":"9"},0,{"$f":"INDEX(Diverse!$H$1:$H$5,$C11+1)","v":"Nada"},0,"9","9",0,{"$f":"HLOOKUP(Yrke,Levelbonus!$B$1:$CR$20,7,0)","v":0},-25,null,0,{"$f":"IF(ISNUMBER(VLOOKUP($A11,Rasbonus!$A$61:$AM$295,MATCH(Ras,Rasbonus!$A$1:$AM$1,0),FALSE)),VLOOKUP($A11,Rasbonus!$A$61:$AM$295,MATCH(Ras,Rasbonus!$A$1:$AM$1,0),FALSE),0)","v":0},null,null,null,-25,null,{"$f":"CONCATENATE(\"Din ras slår hits med en \",HLOOKUP(Ras,Rasbonus!$B$1:$AM$13,13,FALSE),\" vilket ger ett medel mellan 1 och \",MID(HLOOKUP(Ras,Rasbonus!$B$1:$AM$13,13,FALSE),2,2),\". Hur mycket har du slagit?\")","v":"Din ras slår hits med en D10 vilket ger ett medel mellan 1 och 10. Hur mycket har du slagit?"},null,"Intuition",75,{"$f":"VLOOKUP(V11,Diverse!$A$2:$C$131,3,0)","v":7},null,{"$f":"VLOOKUP(V11,Diverse!$A$2:$B$131,2,0)","v":5},{"$f":"HLOOKUP(Ras,Rasbonus!$B$1:$AM$12,10,0)","v":0},null,null,5]
["Body Development",{"$f":"VLOOKUP(A12,AllaSkills!$A$3:$BV$319,$A$2+3,FALSE)","v":"6"},0,{"$f":"INDEX(Diverse!$H$1:$H$5,$C12+1)","v":"Nada"},{"$f":"ROUND(Level*(C12/2),0)+VLOOKUP($A12,Rasbonus!$A$29:$AM$59,MATCH(Ras,Rasbonus!$A$1:$AM$1,0),FALSE)","v":3},"6","6",0,{"$f":"HLOOKUP(Yrke,Levelbonus!$B$1:$CR$20,19,0)","v":0},{"$f":"E12*Medelhits","v":13.5},{"$f":"ROUND(V3,0)/10","v":7.5},0,{"$f":"IF(ISNUMBER(VLOOKUP($A12,Rasbonus!$A$61:$AM$295,MATCH(Ras,Rasbonus!$A$1:$AM$1,0),FALSE)),VLOOKUP($A12,Rasbonus!$A$61:$AM$295,MATCH(Ras,Rasbonus!$A$1:$AM$1,0),FALSE),0)","v":0},null,null,null,21,null,null,null,"Empathy",75,{"$f":"VLOOKUP(V12,Diverse!$A$2:$C$131,3,0)","v":7},null,{"$f":"VLOOKUP(V12,Diverse!$A$2:$B$131,2,0)","v":5},{"$f":"HLOOKUP(Ras,Rasbonus!$B$1:$AM$12,11,0)","v":0},null,null,5]
["Channeling",{"$f":"VLOOKUP(A13,AllaSkills!$A$3:$BV$319,$A$2+3,FALSE)","v":"4/8"},0,{"$f":"INDEX(Diverse!$H$1:$H$5,$C13+1)","v":"Nada"},0,"4","8",0,{"$f":"HLOOKUP(Yrke,Levelbonus!$B$1:$CR$20,12,0)","v":3},-25,{"$f":"IN","v":5},3,{"$f":"IF(ISNUMBER(VLOOKUP($A13,Rasbonus!$A$61:$AM$295,MATCH(Ras,Rasbonus!$A$1:$AM$1,0),FALSE)),VLOOKUP($A13,Rasbonus!$A$61:$AM$295,MATCH(Ras,Rasbonus!$A$1:$AM$1,0),FALSE),0)","v":0},null,null,null,-17,null,null,null,"Appearance",75,null,null,{"$f":"VLOOKUP(V13,Diverse!$A$2:$B$131,2,0)","v":5},{"$f":"HLOOKUP(Ras,Rasbonus!$B$1:$AM$12,12,0)","v":0},null,null,{"$f":"SUM(Y13:AB13)","v":5}]
["Climbing",{"$f":"VLOOKUP(A14,AllaSkills!$A$3:$BV$319,$A$2+3,FALSE)","v":"7"},0,{"$f":"INDEX(Diverse!$H$1:$H$5,$C14+1)","v":"Nada"},{"$f":"ROUND(Level*(C14/2),0)+VLOOKUP($A14,Rasbonus!$A$29:$AM$59,MATCH(Ras,Rasbonus!$A$1:$AM$1,0),FALSE)","v":2},"7","7",0,{"$f":"HLOOKUP(Yrke,Levelbonus!$B$1:$CR$20,4,0)","v":0},10,{"$f":"AG","v":5},0,{"$f":"IF(ISNUMBER(VLOOKUP($A14,Rasbonus!$A$61:$AM$295,MATCH(Ras,Rasbonus!$A$1:$AM$1,0),FALSE)),VLOOKUP($A14,Rasbonus!$A$61:$AM$295,MATCH(Ras,Rasbonus!$A$1:$AM$1,0),FALSE),0)","v":0},{"$f":"IF($AC$58>16,$Q$23,IF($AC$58>12,$Q$22, IF($AC$58>8,$Q$21,IF($AC$58>4,$Q$20,\"0\"))))","v":"0"},null,null,15,null,null,null,null,{"$f":"SUM(V3:V13)","v":825},null,null,{"$f":"SUM(Y3:Y13)","v":55},{"$f":"SUM(Z3:Z13)","v":30},{"$f":"SUM(AA3:AA13)","v":0},{"$f":"SUM(AB3:AB13)","v":0},{"$f":"SUM(AC3:AC13)","v":85}]
["Directed Spells",{"$f":"VLOOKUP(A15,AllaSkills!$A$3:$BV$319,$A$2+3,FALSE)","v":"2/7"},0,{"$f":"INDEX(Diverse!$H$1:$H$5,$C15+1)","v":"Nada"},{"$f":"ROUND(Level*(C15/2),0)","v":0},"2","7",0,{"$f":"HLOOKUP(Yrke,Levelbonus!$B$1:$CR$20,17,0)","v":0},-25,{"$f":"AG","v":5},0,{"$f":"IF(ISNUMBER(VLOOKUP($A15,Rasbonus!$A$61:$AM$295,MATCH(Ras,Rasbonus!$A$1:$AM$1,0),FALSE)),VLOOKUP($A15,Rasbonus!$A$61:$AM$295,MATCH(Ras,Rasbonus!$A$1:$AM$1,0),FALSE),0)","v":0},null,null,null,-20,null,{"$f":"CONCATENATE(\"Eh jag slog..    ca \",Medelhits)","v":"Eh jag slog..    ca 4,5"}]
["Disarm Traps",{"$f":"VLOOKUP(A16,AllaSkills!$A$3:$BV$319,$A$2+3,FALSE)","v":"4"},0,{"$f":"INDEX(Diverse!$H$1:$H$5,$C16+1)","v":"Nada"},{"$f":"ROUND(Level*(C16/2),0)+VLOOKUP($A16,Rasbonus!$A$29:$AM$59,MATCH(Ras,Rasbonus!$A$1:$AM$1,0),FALSE)","v":0},"4","4",0,{"$f":"HLOOKUP(Yrke,Levelbonus!$B$1:$CR$20,16,0)","v":0},-25,{"$f":"ROUND((IN+AG)/2,0)","v":5},0,{"$f":"IF(ISNUMBER(VLOOKUP($A16,Rasbonus!$A$61:$AM$295,MATCH(Ras,Rasbonus!$A$1:$AM$1,0),FALSE)),VLOOKUP($A16,Rasbonus!$A$61:$AM$295,MATCH(Ras,Rasbonus!$A$1:$AM$1,0),FALSE),0)","v":0},null,null,null,-20,null,null,null,"Spell lists Aqcuisition",null,null,null,null,null,null,null,"Cost"]
["General Perception",{"$f":"VLOOKUP(A17,AllaSkills!$A$3:$BV$319,$A$2+3,FALSE)","v":"3"},0,{"$f":"INDEX(Diverse!$H$1:$H$5,$C17+1)","v":"Nada"},{"$f":"ROUND(Level*(C17/2),0)+VLOOKUP($A17,Rasbonus!$A$29:$AM$59,MATCH(Ras,Rasbonus!$A$1:$AM$1,0),FALSE)","v":1},"3","3",0,{"$f":"HLOOKUP(Yrke,Levelbonus!$B$1:$CR$20,14,0)","v":1},5,{"$f":"ROUND((IN+RE)/2,0)","v":5},1,{"$f":"IF(ISNUMBER(VLOOKUP($A17,Rasbonus!$A$61:$AM$295,MATCH(Ras,Rasbonus!$A$1:$AM$1,0),FALSE)),VLOOKUP($A17,Rasbonus!$A$61:$AM$295,MATCH(Ras,Rasbonus!$A$1:$AM$1,0),FALSE),0)","v":0},null,null,null,11,null,{"$f":"CONCATENATE(\"Du har spenderat \",SUM(H3:H36)/2,\" av dina \",Dev.pts_primary,\" dev.pts.\")","v":"Du har spenderat 0 av dina 35 dev.pts."},null,"SL (closed, A)",null,null,null,null,null,null,null,{"$f":"VLOOKUP(U17,AllaSkills!$A$3:$BV$319,$A$2+3,FALSE)","v":"N/A"}]
["MA Strikes",{"$f":"VLOOKUP(A18,AllaSkills!$A$3:$BV$319,$A$2+3,FALSE)","v":"9"},0,{"$f":"INDEX(Diverse!$H$1:$H$5,$C18+1)","v":"Nada"},{"$f":"ROUND(Level*(C18/2),0)+VLOOKUP($A18,Rasbonus!$A$29:$AM$59,MATCH(Ras,Rasbonus!$A$1:$AM$1,0),FALSE)","v":2},{"$f":"IF(LEN(B18)=3,LEFT(B18,1),IF(LEN(B18)<3,B18,99))","v":"9"},{"$f":"IF(RIGHT(B18,1)=\"*\",LEFT(B18,1),IF(LEN(B18)=3,RIGHT(B18,1),IF(LEN(B18)<3,B18,RIGHT(B18,2))))","v":"9"},{"$f":"IF(D18=\"Ett varannan level\",F18+F18-F18,IF(D18=\"Ett varje level\",2*F18,IF(D18=\"Tre på två levlar\",F18+G18+F18,IF(D18=\"Nada\",0,F18+G18+F18+G18))))","v":0},{"$f":"HLOOKUP(Yrke,Levelbonus!$B$1:$CR$20,5,0)","v":0},{"$f":"IF(E18<1,-25,IF(E18>30,80+((E18-30)*0.5),IF(E18>20,70+(E18-20),IF(E18>10,50+((E18-10)*2),E18*5))))","v":10},{"$f":"ROUND((ST+ST+AG)/3,0)","v":15},0,{"$f":"IF(ISNUMBER(VLOOKUP($A18,Rasbonus!$A$61:$AM$295,MATCH(Ras,Rasbonus!$A$1:$AM$1,0),FALSE)),VLOOKUP($A18,Rasbonus!$A$61:$AM$295,MATCH(Ras,Rasbonus!$A$1:$AM$1,0),FALSE),0)","v":0},null,null,null,25,null,null,null,"SL (closed, B)",null,null,null,null,null,null,null,{"$f":"VLOOKUP(U18,AllaSkills!$A$3:$BV$319,$A$2+3,FALSE)","v":"1/*"}]
["MA Sweeps",{"$f":"VLOOKUP(A19,AllaSkills!$A$3:$BV$319,$A$2+3,FALSE)","v":"9"},0,{"$f":"INDEX(Diverse!$H$1:$H$5,$C19+1)","v":"Nada"},{"$f":"ROUND(Level*(C19/2),0)+VLOOKUP($A19,Rasbonus!$A$29:$AM$59,MATCH(Ras,Rasbonus!$A$1:$AM$1,0),FALSE)","v":0},{"$f":"IF(LEN(B19)=3,LEFT(B19,1),IF(LEN(B19)<3,B19,99))","v":"9"},{"$f":"IF(RIGHT(B19,1)=\"*\",LEFT(B19,1),IF(LEN(B19)=3,RIGHT(B19,1),IF(LEN(B19)<3,B19,RIGHT(B19,2))))","v":"9"},0,{"$f":"HLOOKUP(Yrke,Levelbonus!$B$1:$CR$20,5,0)","v":0},{"$f":"IF(E19<1,-25,IF(E19>30,80+((E19-30)*0.5),IF(E19>20,70+(E19-20),IF(E19>10,50+((E19-10)*2),E19*5))))","v":-25},{"$f":"ROUND((AG+AG+ST)/3,0)","v":10},0,{"$f":"IF(ISNUMBER(VLOOKUP($A19,Rasbonus!$A$61:$AM$295,MATCH(Ras,Rasbonus!$A$1:$AM$1,0),FALSE)),VLOOKUP($A19,Rasbonus!$A$61:$AM$295,MATCH(Ras,Rasbonus!$A$1:$AM$1,0),FALSE),0)","v":0},null,null,null,-15,null,null,null,"SL (closed, C)",null,null,null,null,null,null,null,{"$f":"VLOOKUP(U19,AllaSkills!$A$3:$BV$319,$A$2+3,FALSE)","v":"N/A"}]
["Man. Soft L",{"$f":"VLOOKUP(A20,AllaSkills!$A$3:$BV$319,$A$2+3,FALSE)","v":9},0,{"$f":"INDEX(Diverse!$H$1:$H$5,$C20+1)","v":"Nada"},{"$f":"ROUND(Level*(C20/2),0)+VLOOKUP($A20,Rasbonus!$A$29:$AM$59,MATCH(Ras,Rasbonus!$A$1:$AM$1,0),FALSE)","v":1},{"$f":"IF(LEN(B20)=3,LEFT(B20,1),IF(LEN(B20)<3,B20,99))","v":9},{"$f":"IF(RIGHT(B20,1)=\"*\",LEFT(B20,1),IF(LEN(B20)=3,RIGHT(B20,1),IF(LEN(B20)<3,B20,RIGHT(B20,2))))","v":9},0,{"$f":"HLOOKUP(Yrke,Levelbonus!$B$1:$CR$20,5,0)","v":0},{"$f":"IF(E20<1,-25,E20*5)","v":5},{"$f":"AG","v":5},0,{"$f":"IF(ISNUMBER(VLOOKUP($A20,Rasbonus!$A$61:$AM$295,MATCH(Ras,Rasbonus!$A$1:$AM$1,0),FALSE)),VLOOKUP($A20,Rasbonus!$A$61:$AM$295,MATCH(Ras,Rasbonus!$A$1:$AM$1,0),FALSE),0)","v":0},{"$f":"IF(AND($AC$58>4,$AC$58<9),$AC$59,\"\")","v":""},null,null,{"$f":"IF((SUM(J20:P20)>=AC60),AC60,(SUM(J20:P20)))","v":0},null,"Primär vapentyp",null,"SL (closed, D)",null,null,null,null,null,null,null,{"$f":"VLOOKUP(U20,AllaSkills!$A$3:$BV$319,$A$2+3,FALSE)","v":"1/*"}]
["Man. Rigid L",{"$f":"VLOOKUP(A21,AllaSkills!$A$3:$BV$319,$A$2+3,FALSE)","v":9},0,{"$f":"INDEX(Diverse!$H$1:$H$5,$C21+1)","v":"Nada"},{"$f":"ROUND(Level*(C21/2),0)+VLOOKUP($A21,Rasbonus!$A$29:$AM$59,MATCH(Ras,Rasbonus!$A$1:$AM$1,0),FALSE)","v":0},{"$f":"IF(LEN(B21)=3,LEFT(B21,1),IF(LEN(B21)<3,B21,99))","v":9},{"$f":"IF(RIGHT(B21,1)=\"*\",LEFT(B21,1),IF(LEN(B21)=3,RIGHT(B21,1),IF(LEN(B21)<3,B21,RIGHT(B21,2))))","v":9},0,{"$f":"HLOOKUP(Yrke,Levelbonus!$B$1:$CR$20,5,0)","v":0},{"$f":"IF(E21<1,-25,E21*5)","v":-25},{"$f":"AG","v":5},0,{"$f":"IF(ISNUMBER(VLOOKUP($A21,Rasbonus!$A$61:$AM$295,MATCH(Ras,Rasbonus!$A$1:$AM$1,0),FALSE)),VLOOKUP($A21,Rasbonus!$A$61:$AM$295,MATCH(Ras,Rasbonus!$A$1:$AM$1,0),FALSE),0)","v":0},{"$f":"IF(AND($AC$58>8,$AC$58<13),$AC$59,\"\")","v":""},null,null,{"$f":"IF((SUM(J21:P21)>=AC60),AC60,(SUM(J21:P21)))","v":-20},null,null,null,"SL (closed, E)",null,null,null,null,null,null,null,{"$f":"VLOOKUP(U21,AllaSkills!$A$3:$BV$319,$A$2+3,FALSE)","v":"3/*"}]
["Man. Chain",{"$f":"VLOOKUP(A22,AllaSkills!$A$3:$BV$319,$A$2+3,FALSE)","v":10},0,{"$f":"INDEX(Diverse!$H$1:$H$5,$C22+1)","v":"Nada"},{"$f":"ROUND(Level*(C22/2),0)+VLOOKUP($A22,Rasbonus!$A$29:$AM$59,MATCH(Ras,Rasbonus!$A$1:$AM$1,0),FALSE)","v":0},{"$f":"IF(LEN(B22)=3,LEFT(B22,1),IF(LEN(B22)<3,B22,99))","v":10},10,0,{"$f":"HLOOKUP(Yrke,Levelbonus!$B$1:$CR$20,5,0)","v":0},{"$f":"IF(E22<1,-25,E22*5)","v":-25},{"$f":"ST","v":20},0,{"$f":"IF(ISNUMBER(VLOOKUP($A22,Rasbonus!$A$61:$AM$295,MATCH(Ras,Rasbonus!$A$1:$AM$1,0),FALSE)),VLOOKUP($A22,Rasbonus!$A$61:$AM$295,MATCH(Ras,Rasbonus!$A$1:$AM$1,0),FALSE),0)","v":0},{"$f":"IF(AND($AC$58>12,$AC$58<17),$AC$59,\"\")","v":""},null,null,{"$f":"IF((SUM(J22:P22)>=AC60),AC60,(SUM(J22:P22)))","v":-5},null,null,null,"SL (open, A)",null,null,null,null,null,null,null,{"$f":"VLOOKUP(U22,AllaSkills!$A$3:$BV$319,$A$2+3,FALSE)","v":"N/A"}]
["Man. Plate",{"$f":"VLOOKUP(A23,AllaSkills!$A$3:$BV$319,$A$2+3,FALSE)","v":11},0,{"$f":"INDEX(Diverse!$H$1:$H$5,$C23+1)","v":"Nada"},{"$f":"ROUND(Level*(C23/2),0)+VLOOKUP($A23,Rasbonus!$A$29:$AM$59,MATCH(Ras,Rasbonus!$A$1:$AM$1,0),FALSE)","v":0},{"$f":"IF(LEN(B23)=3,LEFT(B23,1),IF(LEN(B23)<3,B23,99))","v":11},11,0,{"$f":"HLOOKUP(Yrke,Levelbonus!$B$1:$CR$20,5,0)","v":0},{"$f":"IF(E23<1,-25,E23*5)","v":-25},{"$f":"ST","v":20},0,{"$f":"IF(ISNUMBER(VLOOKUP($A23,Rasbonus!$A$61:$AM$295,MATCH(Ras,Rasbonus!$A$1:$AM$1,0),FALSE)),VLOOKUP($A23,Rasbonus!$A$61:$AM$295,MATCH(Ras,Rasbonus!$A$1:$AM$1,0),FALSE),0)","v":0},{"$f":"IF(AND($AC$58>16,$AC$58<21),$AC$59,\"\")","v":""},null,null,{"$f":"IF((SUM(J23:P23)>=AC60),AC60,(SUM(J23:P23)))","v":-5},null,"Sekundär vapentyp",null,"SL (open, B)",null,null,null,null,null,null,null,{"$f":"VLOOKUP(U23,AllaSkills!$A$3:$BV$319,$A$2+3,FALSE)","v":"1/*"}]
["Pick locks",{"$f":"VLOOKUP(A24,AllaSkills!$A$3:$BV$319,$A$2+3,FALSE)","v":"4"},0,{"$f":"INDEX(Diverse!$H$1:$H$5,$C24+1)","v":"Nada"},{"$f":"ROUND(Level*(C24/2),0)+VLOOKUP($A24,Rasbonus!$A$29:$AM$59,MATCH(Ras,Rasbonus!$A$1:$AM$1,0),FALSE)","v":0},"4","4",0,{"$f":"HLOOKUP(Yrke,Levelbonus!$B$1:$CR$20,16,0)","v":0},{"$f":"IF(E24<1,-25,IF(E24>30,80+((E24-30)*0.5),IF(E24>20,70+(E24-20),IF(E24>10,50+((E24-10)*2),E24*5))))","v":-25},{"$f":"ROUND((IN+RE+AG)/3,0)","v":5},0,{"$f":"IF(ISNUMBER(VLOOKUP($A24,Rasbonus!$A$61:$AM$295,MATCH(Ras,Rasbonus!$A$1:$AM$1,0),FALSE)),VLOOKUP($A24,Rasbonus!$A$61:$AM$295,MATCH(Ras,Rasbonus!$A$1:$AM$1,0),FALSE),0)","v":0},null,null,null,{"$f":"SUM(J24:P24)","v":-20},null,null,null,"SL (open, C)",null,null,null,null,null,null,null,{"$f":"VLOOKUP(U24,AllaSkills!$A$3:$BV$319,$A$2+3,FALSE)","v":"N/A"}]
["Riding",{"$f":"VLOOKUP(A25,AllaSkills!$A$3:$BV$319,$A$2+3,FALSE)","v":"3"},0,{"$f":"INDEX(Diverse!$H$1:$H$5,$C25+1)","v":"Nada"},{"$f":"ROUND(Level*(C25/2),0)+VLOOKUP($A25,Rasbonus!$A$29:$AM$59,MATCH(Ras,Rasbonus!$A$1:$AM$1,0),FALSE)","v":0},"3","3",0,{"$f":"HLOOKUP(Yrke,Levelbonus!$B$1:$CR$20,3,0)","v":0},-25,{"$f":"ROUND((EM+AG)/2,0)","v":5},0,{"$f":"IF(ISNUMBER(VLOOKUP($A25,Rasbonus!$A$61:$AM$295,MATCH(Ras,Rasbonus!$A$1:$AM$1,0),FALSE)),VLOOKUP($A25,Rasbonus!$A$61:$AM$295,MATCH(Ras,Rasbonus!$A$1:$AM$1,0),FALSE),0)","v":0},null,null,null,-20,null,null,null,"SL (open, D)",null,null,null,null,null,null,null,{"$f":"VLOOKUP(U25,AllaSkills!$A$3:$BV$319,$A$2+3,FALSE)","v":"1/*"}]
["Runes",{"$f":"VLOOKUP(A26,AllaSkills!$A$3:$BV$319,$A$2+3,FALSE)","v":"1/3"},0,{"$f":"INDEX(Diverse!$H$1:$H$5,$C26+1)","v":"Nada"},{"$f":"ROUND(Level*(C26/2),0)+VLOOKUP($A26,Rasbonus!$A$29:$AM$59,MATCH(Ras,Rasbonus!$A$1:$AM$1,0),FALSE)","v":0},"1","3",0,{"$f":"HLOOKUP(Yrke,Levelbonus!$B$1:$CR$20,12,0)","v":3},-25,{"$f":"ROUND((IN+EM)/2,0)","v":5},3,{"$f":"IF(ISNUMBER(VLOOKUP($A26,Rasbonus!$A$61:$AM$295,MATCH(Ras,Rasbonus!$A$1:$AM$1,0),FALSE)),VLOOKUP($A26,Rasbonus!$A$61:$AM$295,MATCH(Ras,Rasbonus!$A$1:$AM$1,0),FALSE),0)","v":0},null,null,null,-17,null,"Tertiär vapentyp",null,"SL (open, E)",null,null,null,null,null,null,null,{"$f":"VLOOKUP(U26,AllaSkills!$A$3:$BV$319,$A$2+3,FALSE)","v":"1/*"}]
["Staves & Wands",{"$f":"VLOOKUP(A27,AllaSkills!$A$3:$BV$319,$A$2+3,FALSE)","v":"1/3"},0,{"$f":"INDEX(Diverse!$H$1:$H$5,$C27+1)","v":"Nada"},{"$f":"ROUND(Level*(C27/2),0)+VLOOKUP($A27,Rasbonus!$A$29:$AM$59,MATCH(Ras,Rasbonus!$A$1:$AM$1,0),FALSE)","v":0},"1","3",0,{"$f":"HLOOKUP(Yrke,Levelbonus!$B$1:$CR$20,12,0)","v":3},-25,{"$f":"ROUND((IN+EM)/2,0)","v":5},3,{"$f":"IF(ISNUMBER(VLOOKUP($A27,Rasbonus!$A$61:$AM$295,MATCH(Ras,Rasbonus!$A$1:$AM$1,0),FALSE)),VLOOKUP($A27,Rasbonus!$A$61:$AM$295,MATCH(Ras,Rasbonus!$A$1:$AM$1,0),FALSE),0)","v":0},null,null,null,-17,null,null,null,"SL (oth realm, base, A)",null,null,null,null,null,null,null,{"$f":"VLOOKUP(U27,AllaSkills!$A$3:$BV$319,$A$2+3,FALSE)","v":"10"}]
["Stalk & Hide",{"$f":"VLOOKUP(A28,AllaSkills!$A$3:$BV$319,$A$2+3,FALSE)","v":"6"},0,{"$f":"INDEX(Diverse!$H$1:$H$5,$C28+1)","v":"Nada"},{"$f":"ROUND(Level*(C28/2),0)+VLOOKUP($A28,Rasbonus!$A$29:$AM$59,MATCH(Ras,Rasbonus!$A$1:$AM$1,0),FALSE)","v":4},"6","6",0,{"$f":"HLOOKUP(Yrke,Levelbonus!$B$1:$CR$20,16,0)","v":0},20,{"$f":"ROUND((AG+SD)/2,0)","v":5},0,{"$f":"IF(ISNUMBER(VLOOKUP($A28,Rasbonus!$A$61:$AM$295,MATCH(Ras,Rasbonus!$A$1:$AM$1,0),FALSE)),VLOOKUP($A28,Rasbonus!$A$61:$AM$295,MATCH(Ras,Rasbonus!$A$1:$AM$1,0),FALSE),0)","v":0},{"$f":"IF($AC$58>16,$Q$23,IF($AC$58>12,$Q$22, IF($AC$58>8,$Q$21,IF($AC$58>4,$Q$20,\"0\"))))","v":"0"},null,null,25,null,null,null,"SL (oth realm, cl, A)",null,null,null,null,null,null,null,{"$f":"VLOOKUP(U28,AllaSkills!$A$3:$BV$319,$A$2+3,FALSE)","v":"5"}]
["Swimming",{"$f":"VLOOKUP(A29,AllaSkills!$A$3:$BV$319,$A$2+3,FALSE)","v":"3"},0,{"$f":"INDEX(Diverse!$H$1:$H$5,$C29+1)","v":"Nada"},{"$f":"ROUND(Level*(C29/2),0)+VLOOKUP($A29,Rasbonus!$A$29:$AM$59,MATCH(Ras,Rasbonus!$A$1:$AM$1,0),FALSE)","v":2},"3",{"$f":"IF(RIGHT(B29,1)=\"*\",LEFT(B29,1),IF(LEN(B29)=3,RIGHT(B29,1),IF(LEN(B29)<3,B29,RIGHT(B29,2))))","v":"3"},0,{"$f":"HLOOKUP(Yrke,Levelbonus!$B$1:$CR$20,4,0)","v":0},10,{"$f":"ROUND((AG+SD)/2,0)","v":5},0,{"$f":"IF(ISNUMBER(VLOOKUP($A29,Rasbonus!$A$61:$AM$295,MATCH(Ras,Rasbonus!$A$1:$AM$1,0),FALSE)),VLOOKUP($A29,Rasbonus!$A$61:$AM$295,MATCH(Ras,Rasbonus!$A$1:$AM$1,0),FALSE),0)","v":0},{"$f":"IF($AC$58>16,$Q$23,IF($AC$58>12,$Q$22, IF($AC$58>8,$Q$21,IF($AC$58>4,$Q$20,\"0\"))))","v":"0"},null,null,15,null,"Fjärde vapentyp",null,"SL (oth realm, cl, B)",null,null,null,null,null,null,null,{"$f":"VLOOKUP(U29,AllaSkills!$A$3:$BV$319,$A$2+3,FALSE)","v":"10"}]
[{"$f":"OFFSET(Diverse!$G$14,Diverse!H26,0)","v":"2 Handed"},{"$f":"VLOOKUP(\"Weapon #1\",AllaSkills!$A$3:$BV$319,$A$2+3,FALSE)","v":"9"},0,{"$f":"INDEX(Diverse!$H$1:$H$5,$C30+1)","v":"Nada"},{"$f":"ROUND(Level*(C30/2),0)+IF(ISNUMBER(VLOOKUP($A30,Rasbonus!$A$29:$AM$59,MATCH(Ras,Rasbonus!$A$1:$AM$1,0),FALSE)),VLOOKUP($A30,Rasbonus!$A$29:$AM$59,MATCH(Ras,Rasbonus!$A$1:$AM$1,0),FALSE),0)","v":2},"9","9",0,{"$f":"HLOOKUP(Yrke,Levelbonus!$B$1:$CR$20,5,0)","v":0},10,{"$f":"OFFSET(Diverse!$H$14,Diverse!H26,0)","v":15},0,{"$f":"IF(ISNUMBER(VLOOKUP($A30,Rasbonus!$A$61:$AM$295,MATCH(Ras,Rasbonus!$A$1:$AM$1,0),FALSE)),VLOOKUP($A30,Rasbonus!$A$61:$AM$295,MATCH(Ras,Rasbonus!$A$1:$AM$1,0),FALSE),0)","v":0},{"$f":"IF(OR($A$30=\"Bow\", $A$30=\"Thrown\"),$AC$62,\"\")","v":""},null,null,25,null,null,null,"SL (oth realm, op, A)",null,null,null,null,null,null,null,{"$f":"VLOOKUP(U30,AllaSkills!$A$3:$BV$319,$A$2+3,FALSE)","v":"4/*"}]
[{"$f":"OFFSET(Diverse!$G$14,Diverse!H27,0)","v":"Polearm"},{"$f":"VLOOKUP(\"Weapon #2\",AllaSkills!$A$3:$BV$319,$A$2+3,FALSE)","v":"20"},0,{"$f":"INDEX(Diverse!$H$1:$H$5,$C31+1)","v":"Nada"},{"$f":"ROUND(Level*(C31/2),0)+IF(ISNUMBER(VLOOKUP($A31,Rasbonus!$A$29:$AM$59,MATCH(Ras,Rasbonus!$A$1:$AM$1,0),FALSE)),VLOOKUP($A31,Rasbonus!$A$29:$AM$59,MATCH(Ras,Rasbonus!$A$1:$AM$1,0),FALSE),0)","v":2},"20","20",0,{"$f":"HLOOKUP(Yrke,Levelbonus!$B$1:$CR$20,5,0)","v":0},10,{"$f":"OFFSET(Diverse!$H$14,Diverse!H27,0)","v":12.5},0,{"$f":"IF(ISNUMBER(VLOOKUP($A31,Rasbonus!$A$61:$AM$295,MATCH(Ras,Rasbonus!$A$1:$AM$1,0),FALSE)),VLOOKUP($A31,Rasbonus!$A$61:$AM$295,MATCH(Ras,Rasbonus!$A$1:$AM$1,0),FALSE),0)","v":0},{"$f":"IF(OR($A$31=\"Bow\", $A$31=\"Thrown\"),$AC$62,\"\")","v":""},null,null,22.5,null,null,null,"SL (oth realm, op, C)",null,null,null,null,null,null,null,{"$f":"VLOOKUP(U31,AllaSkills!$A$3:$BV$319,$A$2+3,FALSE)","v":"8"}]
[{"$f":"OFFSET(Diverse!$G$14,Diverse!H28,0)","v":"Thrown"},{"$f":"VLOOKUP(\"Weapon #3\",AllaSkills!$A$3:$BV$319,$A$2+3,FALSE)","v":"20"},0,{"$f":"INDEX(Diverse!$H$1:$H$5,$C32+1)","v":"Nada"},{"$f":"ROUND(Level*(C32/2),0)+IF(ISNUMBER(VLOOKUP($A32,Rasbonus!$A$29:$AM$59,MATCH(Ras,Rasbonus!$A$1:$AM$1,0),FALSE)),VLOOKUP($A32,Rasbonus!$A$29:$AM$59,MATCH(Ras,Rasbonus!$A$1:$AM$1,0),FALSE),0)","v":1},"20","20",0,{"$f":"HLOOKUP(Yrke,Levelbonus!$B$1:$CR$20,5,0)","v":0},5,{"$f":"OFFSET(Diverse!$H$14,Diverse!H28,0)","v":12.5},0,{"$f":"IF(ISNUMBER(VLOOKUP($A32,Rasbonus!$A$61:$AM$295,MATCH(Ras,Rasbonus!$A$1:$AM$1,0),FALSE)),VLOOKUP($A32,Rasbonus!$A$61:$AM$295,MATCH(Ras,Rasbonus!$A$1:$AM$1,0),FALSE),0)","v":0},{"$f":"IF(OR($A$32=\"Bow\", $A$32=\"Thrown\"),$AC$62,\"\")","v":0},null,null,17.5,null,"Femte vapentyp",null,"SL (oth realm, op, D)",null,null,null,null,null,null,null,{"$f":"VLOOKUP(U32,AllaSkills!$A$3:$BV$319,$A$2+3,FALSE)","v":"10"}]
[{"$f":"OFFSET(Diverse!$G$14,Diverse!H29,0)","v":"1H Slash"},{"$f":"VLOOKUP(\"Weapon #4\",AllaSkills!$A$3:$BV$319,$A$2+3,FALSE)","v":"20"},0,{"$f":"INDEX(Diverse!$H$1:$H$5,$C33+1)","v":"Nada"},{"$f":"ROUND(Level*(C33/2),0)+IF(ISNUMBER(VLOOKUP($A33,Rasbonus!$A$29:$AM$59,MATCH(Ras,Rasbonus!$A$1:$AM$1,0),FALSE)),VLOOKUP($A33,Rasbonus!$A$29:$AM$59,MATCH(Ras,Rasbonus!$A$1:$AM$1,0),FALSE),0)","v":0},{"$f":"IF(LEN(B33)=3,LEFT(B33,1),IF(LEN(B33)<3,B33,99))","v":"20"},"20",{"$f":"IF(D33=\"Ett varannan level\",F33+F33-F33,IF(D33=\"Ett varje level\",2*F33,IF(D33=\"Tre på två levlar\",F33+G33+F33,IF(D33=\"Nada\",0,F33+G33+F33+G33))))","v":0},{"$f":"HLOOKUP(Yrke,Levelbonus!$B$1:$CR$20,5,0)","v":0},{"$f":"IF(E33<1,-25,IF(E33>30,80+((E33-30)*0.5),IF(E33>20,70+(E33-20),IF(E33>10,50+((E33-10)*2),E33*5))))","v":-25},{"$f":"OFFSET(Diverse!$H$14,Diverse!H29,0)","v":12.5},0,{"$f":"IF(ISNUMBER(VLOOKUP($A33,Rasbonus!$A$61:$AM$295,MATCH(Ras,Rasbonus!$A$1:$AM$1,0),FALSE)),VLOOKUP($A33,Rasbonus!$A$61:$AM$295,MATCH(Ras,Rasbonus!$A$1:$AM$1,0),FALSE),0)","v":0},{"$f":"IF(OR($A$33=\"Bow\", $A$33=\"Thrown\"),$AC$62,\"\")","v":""},null,null,-12.5,null,null,null,"SL (other base, A)",null,null,null,null,null,null,null,{"$f":"VLOOKUP(U33,AllaSkills!$A$3:$BV$319,$A$2+3,FALSE)","v":"3/*"}]
[{"$f":"OFFSET(Diverse!$G$14,Diverse!H30,0)","v":"1H Thrust"},{"$f":"VLOOKUP(\"Weapon #5\",AllaSkills!$A$3:$BV$319,$A$2+3,FALSE)","v":"20"},0,{"$f":"INDEX(Diverse!$H$1:$H$5,$C34+1)","v":"Nada"},{"$f":"ROUND(Level*(C34/2),0)+IF(ISNUMBER(VLOOKUP($A34,Rasbonus!$A$29:$AM$59,MATCH(Ras,Rasbonus!$A$1:$AM$1,0),FALSE)),VLOOKUP($A34,Rasbonus!$A$29:$AM$59,MATCH(Ras,Rasbonus!$A$1:$AM$1,0),FALSE),0)","v":0},{"$f":"IF(LEN(B34)=3,LEFT(B34,1),IF(LEN(B34)<3,B34,99))","v":"20"},"20",{"$f":"IF(D34=\"Ett varannan level\",F34+F34-F34,IF(D34=\"Ett varje level\",2*F34,IF(D34=\"Tre på två levlar\",F34+G34+F34,IF(D34=\"Nada\",0,F34+G34+F34+G34))))","v":0},{"$f":"HLOOKUP(Yrke,Levelbonus!$B$1:$CR$20,5,0)","v":0},{"$f":"IF(E34<1,-25,IF(E34>30,80+((E34-30)*0.5),IF(E34>20,70+(E34-20),IF(E34>10,50+((E34-10)*2),E34*5))))","v":-25},{"$f":"OFFSET(Diverse!$H$14,Diverse!H30,0)","v":7.5},0,{"$f":"IF(ISNUMBER(VLOOKUP($A34,Rasbonus!$A$61:$AM$295,MATCH(Ras,Rasbonus!$A$1:$AM$1,0),FALSE)),VLOOKUP($A34,Rasbonus!$A$61:$AM$295,MATCH(Ras,Rasbonus!$A$1:$AM$1,0),FALSE),0)","v":0},{"$f":"IF(OR($A$34=\"Bow\", $A$34=\"Thrown\"),$AC$62,\"\")","v":""},null,null,-17.5,null,null,null,"SL (other base, C)",null,null,null,null,null,null,null,{"$f":"VLOOKUP(U34,AllaSkills!$A$3:$BV$319,$A$2+3,FALSE)","v":"4/*"}]
[{"$f":"OFFSET(Diverse!$G$14,Diverse!H31,0)","v":"Bow"},{"$f":"VLOOKUP(\"Weapon #6\",AllaSkills!$A$3:$BV$319,$A$2+3,FALSE)","v":"20"},0,{"$f":"INDEX(Diverse!$H$1:$H$5,$C35+1)","v":"Nada"},{"$f":"ROUND(Level*(C35/2),0)+IF(ISNUMBER(VLOOKUP($A35,Rasbonus!$A$29:$AM$59,MATCH(Ras,Rasbonus!$A$1:$AM$1,0),FALSE)),VLOOKUP($A35,Rasbonus!$A$29:$AM$59,MATCH(Ras,Rasbonus!$A$1:$AM$1,0),FALSE),0)","v":0},{"$f":"IF(LEN(B35)=3,LEFT(B35,1),IF(LEN(B35)<3,B35,99))","v":"20"},"20",{"$f":"IF(D35=\"Ett varannan level\",F35+F35-F35,IF(D35=\"Ett varje level\",2*F35,IF(D35=\"Tre på två levlar\",F35+G35+F35,IF(D35=\"Nada\",0,F35+G35+F35+G35))))","v":0},{"$f":"HLOOKUP(Yrke,Levelbonus!$B$1:$CR$20,5,0)","v":0},{"$f":"IF(E35<1,-25,IF(E35>30,80+((E35-30)*0.5),IF(E35>20,70+(E35-20),IF(E35>10,50+((E35-10)*2),E35*5))))","v":-25},{"$f":"OFFSET(Diverse!$H$14,Diverse!H31,0)","v":10},0,{"$f":"IF(ISNUMBER(VLOOKUP($A35,Rasbonus!$A$61:$AM$295,MATCH(Ras,Rasbonus!$A$1:$AM$1,0),FALSE)),VLOOKUP($A35,Rasbonus!$A$61:$AM$295,MATCH(Ras,Rasbonus!$A$1:$AM$1,0),FALSE),0)","v":0},{"$f":"IF(OR($A$35=\"Bow\", $A$35=\"Thrown\"),$AC$62,\"\")","v":0},null,null,-15,null,"Sjätte vapentyp",null,"SL (other base, D)",null,null,null,null,null,null,null,{"$f":"VLOOKUP(U35,AllaSkills!$A$3:$BV$319,$A$2+3,FALSE)","v":"5"}]
["Shield",{"$f":"VLOOKUP(\"Shield Skill\",AllaSkills!$A$3:$BV$319,$A$2+3,FALSE)","v":"20"},0,{"$f":"INDEX(Diverse!$H$1:$H$5,$C36+1)","v":"Nada"},{"$f":"ROUND(Level*(C36/2),0)+IF(ISNUMBER(VLOOKUP($A36,Rasbonus!$A$29:$AM$59,MATCH(Ras,Rasbonus!$A$1:$AM$1,0),FALSE)),VLOOKUP($A36,Rasbonus!$A$29:$AM$59,MATCH(Ras,Rasbonus!$A$1:$AM$1,0),FALSE),0)","v":0},{"$f":"IF(LEN(B36)=3,LEFT(B36,1),IF(LEN(B36)<3,B36,99))","v":"20"},"20",{"$f":"IF(D36=\"Ett varannan level\",F36+F36-F36,IF(D36=\"Ett varje level\",2*F36,IF(D36=\"Tre på två levlar\",F36+G36+F36,IF(D36=\"Nada\",0,F36+G36+F36+G36))))","v":0},null,{"$f":"IF(E36<1,0,IF(E36>30,46+((E36-50)*0.5),IF(E36>10,26+(E36-10),IF(E36>6,20+((E36-6)*1.5),IF(E36>2,10+((E36-2)*2.5),E36*5)))))","v":0},0,null,{"$f":"IF(ISNUMBER(VLOOKUP($A36,Rasbonus!$A$61:$AM$295,MATCH(Ras,Rasbonus!$A$1:$AM$1,0),FALSE)),VLOOKUP($A36,Rasbonus!$A$61:$AM$295,MATCH(Ras,Rasbonus!$A$1:$AM$1,0),FALSE),0)","v":0},{"$f":"SUM(Secondary!AK99+15)","v":15},null,null,15,null,null,null,"SL (other base, E)",null,null,null,null,null,null,null,{"$f":"VLOOKUP(U36,AllaSkills!$A$3:$BV$319,$A$2+3,FALSE)","v":"10"}]
[]
["Defensive Bonus",null,null,null,null,null,null,null,null,null,"Power Points",null,null,null,null,null,"Background Options",null,null,null,"General Information"]
[null,"w/shield",null,"w/other",null,null,null,null,null,null,"Developed",null,null,null,{"$f":"Secondary!AK185","v":5},null,null,null,null,null,"Namn:"]
["Shield skill",{"$f":"IF($Q$36<0,0,$Q$36)","v":15},null,null,null,null,null,null,null,null,"Added",null,null,null,null,null,null,null,null,null,"Yrke:",{"$f":"Yrke","v":"Alchemist"}]
["Magic shield",0,null,null,null,null,null,null,null,null,"Multiplier",null,null,null,1,null,null,null,null,null,"Ras:",{"$f":"Ras","v":"Beorning"}]
["Quickness",{"$f":"MIN($AB$71,IF($AC$9+$AC$61<1,0,($AC$9+$AC$61)))","v":0},null,{"$f":"SUM(B42)","v":0},null,null,null,null,null,null,"Total",null,null,null,{"$f":"SUM(O39:O40)*(O41)","v":5},null,null,null,null,null,"Level:",{"$f":"Level","v":1}]
[null,null,null,null,null,null,null,null,null,null,"Spent",null,null,null,null,null,null,null,null,null,"Total hits:",{"$f":"IF(Q12>(HLOOKUP(Ras,Rasbonus!$B$1:$AM$16,16,FALSE)+CO),ROUND(((HLOOKUP(Ras,Rasbonus!$B$1:$AM$16,16,FALSE)+CO))*(1+(CO/100)),0),ROUND(((Q12*CO%)+Q12),0))","v":25}]
["Magical",0,null,{"$f":"SUM(B44)","v":0},null,null,null,null,null,null,"Recovery (hour)",null,null,null,{"$f":"IF(V45=1,VLOOKUP(V11,Diverse!G82:H186,2),IF(V45=2,VLOOKUP(V12,Diverse!G82:H186,2),IF(V45=3,VLOOKUP(V10,Diverse!G82:H186,2),IF(V45=4,VLOOKUP(SUM(V11:V12)*0.5,Diverse!G82:H186,2),IF(V45=5,VLOOKUP(SUM(V10:V11)*0.5,Diverse!G82:H186,2),IF(V45=6,VLOOKUP(SUM(V11:V12)*0.5,Diverse!G82:H186,2),VLOOKUP(SUM(V10:V12)*0.33,Diverse!G82:H186,2)))))))","v":2},null,null,null,null,null,"Baserate",{"$f":"VLOOKUP(V9,Diverse!$A$2:$D$131,4,0)+Z9+$O$66","v":45}]
["Adrenal Defense",{"$f":"IF($Q$8<0,0,$Q$8)","v":0},null,{"$f":"SUM(B45)","v":0},null,null,null,null,null,null,null,null,null,null,null,null,null,null,null,null,"Realm:",1]
["Def. Technique",{"$f":"IF(Secondary!$AK$80<0,0,Secondary!$AK$80)","v":0},null,{"$f":"SUM(B46)","v":0},null,null,null,null,null,null,"Character Traits",null,null,null,null,null,null,null,null,null,"XP:"]
["Def. Weaving",{"$f":"IF(Secondary!$AK$81<0,0,Secondary!$AK$81)","v":0},null,0,null,null,null,null,null,null,"Height:",null,null,165,"cm",null,null,null,null,null,"Campaign:"]
["BO",0,null,0,null,null,null,null,null,null,"Weight:",null,null,65,"kg",null,null,null,null,null,"Year of birth:"]
["Other",0,null,0,null,null,null,null,null,null,"Hair:"]
["Spells",0,null,0,null,null,null,null,null,null,"Eyes:",null,null,null,null,null,"Racial Abilities/Special bonuses"]
["Inherent",0,null,0,null,null,null,null,null,null,"Scars:"]
[]
["Total",{"$f":"SUM(B51,B50,B49,B44,B42,B41,B40)","v":15},null,{"$f":"SUM(D40:D52)","v":0},null,null,null,null,null,null,"Tattoos:"]
[]
["Resistances",null,null,"Base Spell Casting",null,null,null,null,null,null,"Other:"]
["Channeling",{"$f":"SUM(IN)+HLOOKUP(Ras,Rasbonus!$B$1:$AM$26,21,0)","v":5},null,"BAR",{"$f":"IF(Level<21,Level*I56,IF(I56>2,60+(Level-20),IF(I56=2,40+((Level-20)*0.5),IF(Level=0,0,IF(I56=0,0,20)))))","v":2},null,null,null,{"$f":"HLOOKUP(Yrke,Levelbonus!$B$1:$CR$20,18,0)","v":2}]
["Essence",{"$f":"SUM(EM)+HLOOKUP(Ras,Rasbonus!$B$1:$AM$26,20,0)","v":5},null,"Power Man.",{"$f":"IF(Secondary!AC182<31,Secondary!AC182,30)","v":0},null,null,null,null,null,null,null,null,null,null,null,null,null,null,null,"Armor Type and Weaponry"]
["Mentalism",{"$f":"SUM(PR)+HLOOKUP(Ras,Rasbonus!$B$1:$AM$26,22,0)","v":10},null,"BO",null,null,null,null,null,null,null,null,null,null,null,null,null,null,null,null,"Armor Type",null,null,null,null,null,null,null,1]
["Arcane",{"$f":"SUM(B56:B58)/3","v":6.666666666666667},null,"Other",null,null,null,null,null,null,null,null,null,null,null,null,null,null,null,null,"Max Maneuver Penalty",null,null,null,null,null,null,null,{"$f":"VLOOKUP($AC$58,Diverse!$G$34:$L$53,3,0)","v":0}]
["Poison",{"$f":"SUM(CO)+HLOOKUP(Ras,Rasbonus!$B$1:$AM$26,19,0)","v":20},null,null,null,null,null,null,null,null,null,null,null,null,null,null,null,null,null,null,"Min Maneuver Penalty",null,null,null,null,null,null,null,{"$f":"VLOOKUP($AC$58,Diverse!$G$34:$L$53,2,0)","v":0}]
["Disease",{"$f":"SUM(CO)+HLOOKUP(Ras,Rasbonus!$B$1:$AM$26,18,0)","v":20},null,null,null,null,null,null,null,null,null,null,null,null,null,null,null,null,null,null,"Quickness Penalty",null,null,null,null,null,null,null,{"$f":"VLOOKUP($AC$58,Diverse!$G$34:$L$53,5,0)","v":0}]
["Fear (Will)",{"$f":"SUM(SD)+HLOOKUP(Ras,Rasbonus!$B$1:$AM$26,17,0)","v":5},null,"Total",{"$f":"SUM(E56:E61)","v":2},null,null,null,null,null,{"$f":"(S2)","v":"Character Name"},null,null,null,null,null,"Språk",null,"Spoken/Written",null,"Missile Attack Penalty",null,null,null,null,null,null,null,{"$f":"VLOOKUP($AC$58,Diverse!$G$34:$L$53,4,0)","v":0}]
[null,null,null,null,null,null,null,null,null,null,null,null,null,null,null,null,"Westron 8/8",null,null,null,"Reverse Armor mod.",null,null,null,null,null,null,null,{"$f":"VLOOKUP($AC$58,Diverse!$G$34:$L$53,6,0)","v":0}]
[]
["Initiative",null,null,"Movement","Difficulty",null,null,null,null,null,"Movement",null,"Exhaustion",null,null,null,null,null,null,null,"Shield Type:",null,null,null,null,"Armor ESF",null,null,{"$f":"IF(V45=1,VLOOKUP(AC58,Diverse!G34:N53,7),IF(V45=3,0,IF(V45=5,VLOOKUP(AC58,Diverse!G34:N53,7),VLOOKUP(AC58,Diverse!G34:N53,8))))","v":0}]
["QU minus MMP",{"$f":"QU+N3","v":0},null,"Walk (x1)","None",null,null,null,null,null,{"$f":"($V$44)","v":45},null,"1/30 rnds",null,{"$f":"VLOOKUP('Ny NPC'!N47,Diverse!G55:H62,2,1)","v":0},null,null,null,null,null,"Helm Type:",1,null,null,null,"Helm ESF",null,null,{"$f":"IF(V45=1,VLOOKUP(V66,Diverse!K27:N30,2),IF(V45=4,VLOOKUP(V66,Diverse!K27:N30,3),IF(V45=3,VLOOKUP(V66,Diverse!K27:N30,4),VLOOKUP(V66,Diverse!K27:N30,4))))","v":0}]
["Instinctive Man.",{"$f":"(Secondary!AK93)/5","v":-4.5999999999999996},null,"Fast walk (x1,5)","Routine",null,null,null,null,null,{"$f":"($V$44)*1.5","v":67.5},null,"1/6 rnds",null,null,null,null,null,null,null,"Neck prot:",null,null,null,null,"Transcend Armor",null,null,{"$f":"IF(Secondary!$AK$192<0,0,Secondary!$AK$192/3)","v":0}]
["Other",0,null,"Run (x2)","Easy",null,null,null,null,null,{"$f":"($V$44)*2","v":90},null,"1/2 rnds",null,null,null,null,null,null,null,"Nose guard:",null,null,null,null,"Other"]
["Other",0,null,"Sprint (x3)","Light",null,null,null,null,null,{"$f":"($V$44)*3","v":135},null,"5/rnd",null,null,null,null,null,null,null,"Throat prot:",null,null,null,null,"Total ESF",null,null,{"$f":"IF((AC65+AC66-AC67-AC68<=0),0,AC65+AC66-AC67-AC68)","v":0}]
[null,null,null,"Fast sprint (x4)","Medium",null,null,null,null,null,{"$f":"($V$44)*4","v":180},null,"25/rnd"]
[null,null,null,"Dash (x5)","Hard",null,null,null,null,null,{"$f":"($V$44)*5","v":225},null,"40/rnd",null,null,null,null,null,null,null,null,null,null,null,null,"QU-Limit",null,{"$f":"IF(I73=1,Diverse!I65,IF(I73=2,Diverse!I66,IF(I73=3,Diverse!I67,IF(I73=4,Diverse!I68,IF(I73=5,Diverse!I69,IF(I73=6,Diverse!I70,IF(I73=7,Diverse!I71)))))))","v":25}]
["Total",{"$f":"IF(B67>B66,IF(B67>0,B67+B68,B66+B68),B66+B68)","v":0},null,"Movement = (Base Rate) x (Pace Multiplier) x (Maneuver Roll Result) /100"]
[null,null,null,null,null,null,null,null,7]

{"sheet":"Secondary","index":2,"n_rows":237,"n_cols":58,"rows_kept":237,"cut":false,"hidden":false,"merged":[]}
["Secondary Skills","Dev.pts per level","Cost 1","Cost 2","Grupp","Adolescence",null,"Annat","Level 1","Level 2","Level 3","Level 4","Level 5","Level 6","Level 7","Level 8","Level 9","Level 10","Level 11","Level 12","Level 13","Level 14","Level 15","Level 16","Level 17","Level 18","Level 19","Level 20","Total ranks","Skill","Stat","Levelbonus","Level","Racial","Armor mods.","Items","Total","Adolescence","Level 1","Level 2","Level 3","Level 4","Level 5","Level 6","Level 7","Level 8","Level 9","Level 10","Level 11","Level 12","Level 13","Level 14","Level 15","Level 16","Level 17","Level 18","Level 19","Level 20"]
["Academic",{"$f":"HLOOKUP(Diverse!$G$2,'2nd'!$B$1:$CR$18,2,FALSE)","v":34},null,null,null,{"$f":"SUM(AL3:AL38)","v":0},null,null,{"$f":"SUM(AM3:AM38)","v":0},0,0,0,0,0,0,0,0,0,0,0,0,0,0,0,0,0,0,0,"Rank","Skill","Stat",null,"Lvl","Race","Armor","Item","Total"]
["Administration",{"$f":"VLOOKUP(A3,AllaSkills!$A$2:$BV$319,'Ny NPC'!$A$2+3,FALSE)","v":"2/5"},{"$f":"IF(LEN(B3)=3,LEFT(B3,1),IF(LEN(B3)<3,B3,99))","v":"2"},{"$f":"IF(RIGHT(B3,1)=\"*\",LEFT(B3,1),IF(LEN(B3)=3,RIGHT(B3,1),IF(LEN(B3)<3,B3,RIGHT(B3,2))))","v":"5"},"Academic",null,null,null,null,null,null,null,null,null,null,null,null,null,null,null,null,null,null,null,null,null,null,null,{"$f":"SUM(F3:AB3)","v":0},{"$f":"IF(AC3<1,-25,IF(AC3>30,80+((AC3-30)*0.5),IF(AC3>20,70+(AC3-20),IF(AC3>10,50+((AC3-10)*2),AC3*5))))","v":-25},{"$f":"(RE+PR)/2","v":7.5},{"$f":"HLOOKUP(Yrke,Levelbonus!$B$1:$CR$20,2,FALSE)","v":3},{"$f":"AF3*Level","v":3},{"$f":"IF(ISNUMBER(VLOOKUP($A3,Rasbonus!$A$61:$AM$295,MATCH(Ras,Rasbonus!$A$1:$AM$1,0),FALSE)),VLOOKUP($A3,Rasbonus!$A$61:$AM$295,MATCH(Ras,Rasbonus!$A$1:$AM$1,0),FALSE),\"0\")","v":"0"},null,null,{"$f":"ROUND(AD3+AE3+AG3+AH3+AI3+AJ3,0)","v":-15},{"$f":"IF(F3>2,\"99\",IF(F3<1,0,IF(F3=1,$C3+$C3-$C3,IF(F3=2,$C3+$D3))))","v":0},{"$f":"IF(I3>2,\"99\",IF(I3<1,0,IF(I3=1,$C3+$C3-$C3,IF(I3=2,$C3+$D3))))","v":0},0,0,0,0,0,0,0,0,0,0,0,0,0,0,0,0,0,0,0]
["Alchemy",{"$f":"VLOOKUP(A4,AllaSkills!$A$2:$BV$319,'Ny NPC'!$A$2+3,FALSE)","v":"1/3"},"1",{"$f":"IF(RIGHT(B4,1)=\"*\",LEFT(B4,1),IF(LEN(B4)=3,RIGHT(B4,1),IF(LEN(B4)<3,B4,RIGHT(B4,2))))","v":"3"},"Academic",null,null,null,null,null,null,null,null,null,null,null,null,null,null,null,null,null,null,null,null,null,null,null,{"$f":"SUM(F4:AB4)","v":0},{"$f":"IF(AC4<1,-25,IF(AC4>30,80+((AC4-30)*0.5),IF(AC4>20,70+(AC4-20),IF(AC4>10,50+((AC4-10)*2),AC4*5))))","v":-25},{"$f":"(RE)","v":5},{"$f":"HLOOKUP(Yrke,Levelbonus!$B$1:$CR$20,2,FALSE)","v":3},3,{"$f":"IF(ISNUMBER(VLOOKUP($A4,Rasbonus!$A$61:$AM$295,MATCH(Ras,Rasbonus!$A$1:$AM$1,0),FALSE)),VLOOKUP($A4,Rasbonus!$A$61:$AM$295,MATCH(Ras,Rasbonus!$A$1:$AM$1,0),FALSE),\"0\")","v":"0"},null,null,{"$f":"ROUND(AD4+AE4+AG4+AH4+AI4+AJ4,0)","v":-17},{"$f":"IF(F4>2,\"99\",IF(F4<1,0,IF(F4=1,$C4+$C4-$C4,IF(F4=2,$C4+$D4))))","v":0},{"$f":"IF(I4>2,\"99\",IF(I4<1,0,IF(I4=1,$C4+$C4-$C4,IF(I4=2,$C4+$D4))))","v":0},{"$f":"IF(J4>2,\"99\",IF(J4<1,0,IF(J4=1,$C4+$C4-$C4,IF(J4=2,$C4+$D4))))","v":0},{"$f":"IF(K4>2,\"99\",IF(K4<1,0,IF(K4=1,$C4+$C4-$C4,IF(K4=2,$C4+$D4))))","v":0},{"$f":"IF(L4>2,\"99\",IF(L4<1,0,IF(L4=1,$C4+$C4-$C4,IF(L4=2,$C4+$D4))))","v":0},{"$f":"IF(M4>2,\"99\",IF(M4<1,0,IF(M4=1,$C4+$C4-$C4,IF(M4=2,$C4+$D4))))","v":0},{"$f":"IF(N4>2,\"99\",IF(N4<1,0,IF(N4=1,$C4+$C4-$C4,IF(N4=2,$C4+$D4))))","v":0},{"$f":"IF(O4>2,\"99\",IF(O4<1,0,IF(O4=1,$C4+$C4-$C4,IF(O4=2,$C4+$D4))))","v":0},{"$f":"IF(P4>2,\"99\",IF(P4<1,0,IF(P4=1,$C4+$C4-$C4,IF(P4=2,$C4+$D4))))","v":0},{"$f":"IF(Q4>2,\"99\",IF(Q4<1,0,IF(Q4=1,$C4+$C4-$C4,IF(Q4=2,$C4+$D4))))","v":0},{"$f":"IF(R4>2,\"99\",IF(R4<1,0,IF(R4=1,$C4+$C4-$C4,IF(R4=2,$C4+$D4))))","v":0},{"$f":"IF(S4>2,\"99\",IF(S4<1,0,IF(S4=1,$C4+$C4-$C4,IF(S4=2,$C4+$D4))))","v":0},{"$f":"IF(T4>2,\"99\",IF(T4<1,0,IF(T4=1,$C4+$C4-$C4,IF(T4=2,$C4+$D4))))","v":0},{"$f":"IF(U4>2,\"99\",IF(U4<1,0,IF(U4=1,$C4+$C4-$C4,IF(U4=2,$C4+$D4))))","v":0},{"$f":"IF(V4>2,\"99\",IF(V4<1,0,IF(V4=1,$C4+$C4-$C4,IF(V4=2,$C4+$D4))))","v":0},{"$f":"IF(W4>2,\"99\",IF(W4<1,0,IF(W4=1,$C4+$C4-$C4,IF(W4=2,$C4+$D4))))","v":0},{"$f":"IF(X4>2,\"99\",IF(X4<1,0,IF(X4=1,$C4+$C4-$C4,IF(X4=2,$C4+$D4))))","v":0},{"$f":"IF(Y4>2,\"99\",IF(Y4<1,0,IF(Y4=1,$C4+$C4-$C4,IF(Y4=2,$C4+$D4))))","v":0},{"$f":"IF(Z4>2,\"99\",IF(Z4<1,0,IF(Z4=1,$C4+$C4-$C4,IF(Z4=2,$C4+$D4))))","v":0},{"$f":"IF(AA4>2,\"99\",IF(AA4<1,0,IF(AA4=1,$C4+$C4-$C4,IF(AA4=2,$C4+$D4))))","v":0},{"$f":"IF(AB4>2,\"99\",IF(AB4<1,0,IF(AB4=1,$C4+$C4-$C4,IF(AB4=2,$C4+$D4))))","v":0}]
["Architecture",{"$f":"VLOOKUP(A5,AllaSkills!$A$2:$BV$319,'Ny NPC'!$A$2+3,FALSE)","v":"2/5"},"2","5","Academic",null,null,null,null,null,null,null,null,null,null,null,null,null,null,null,null,null,null,null,null,null,null,null,0,-25,{"$f":"(RE+EM)/2","v":5},{"$f":"HLOOKUP(Yrke,Levelbonus!$B$1:$CR$20,2,FALSE)","v":3},3,{"$f":"IF(ISNUMBER(VLOOKUP($A5,Rasbonus!$A$61:$AM$295,MATCH(Ras,Rasbonus!$A$1:$AM$1,0),FALSE)),VLOOKUP($A5,Rasbonus!$A$61:$AM$295,MATCH(Ras,Rasbonus!$A$1:$AM$1,0),FALSE),\"0\")","v":"0"},null,null,-17,0,0,0,0,0,0,0,0,0,0,0,0,0,0,0,0,0,0,0,0,0]
["Basic Mathematics",{"$f":"VLOOKUP(A6,AllaSkills!$A$2:$BV$319,'Ny NPC'!$A$2+3,FALSE)","v":"1/4"},"1","4","Academic",null,null,null,null,null,null,null,null,null,null,null,null,null,null,null,null,null,null,null,null,null,null,null,0,-25,{"$f":"(RE)","v":5},{"$f":"HLOOKUP(Yrke,Levelbonus!$B$1:$CR$20,2,FALSE)","v":3},3,{"$f":"IF(ISNUMBER(VLOOKUP($A6,Rasbonus!$A$61:$AM$295,MATCH(Ras,Rasbonus!$A$1:$AM$1,0),FALSE)),VLOOKUP($A6,Rasbonus!$A$61:$AM$295,MATCH(Ras,Rasbonus!$A$1:$AM$1,0),FALSE),\"0\")","v":"0"},null,null,-17,0,0,0,0,0,0,0,0,0,0,0,0,0,0,0,0,0,0,0,0,0]
["Biochemistry",{"$f":"VLOOKUP(A7,AllaSkills!$A$2:$BV$319,'Ny NPC'!$A$2+3,FALSE)","v":"5"},"5","5","Academic",null,null,null,null,null,null,null,null,null,null,null,null,null,null,null,null,null,null,null,null,null,null,null,0,-25,{"$f":"(IN+RE)/2","v":5},{"$f":"HLOOKUP(Yrke,Levelbonus!$B$1:$CR$20,2,FALSE)","v":3},3,{"$f":"IF(ISNUMBER(VLOOKUP($A7,Rasbonus!$A$61:$AM$295,MATCH(Ras,Rasbonus!$A$1:$AM$1,0),FALSE)),VLOOKUP($A7,Rasbonus!$A$61:$AM$295,MATCH(Ras,Rasbonus!$A$1:$AM$1,0),FALSE),\"0\")","v":"0"},null,null,-17,0,0,0,0,0,0,0,0,0,0,0,0,0,0,0,0,0,0,0,0,0]
["Boat Pilot",{"$f":"VLOOKUP(A8,AllaSkills!$A$2:$BV$319,'Ny NPC'!$A$2+3,FALSE)","v":"2/6"},"2","6","Academic",null,null,null,null,null,null,null,null,null,null,null,null,null,null,null,null,null,null,null,null,null,null,null,0,-25,{"$f":"(RE+AG)/2","v":5},{"$f":"HLOOKUP(Yrke,Levelbonus!$B$1:$CR$20,2,FALSE)","v":3},3,{"$f":"IF(ISNUMBER(VLOOKUP($A8,Rasbonus!$A$61:$AM$295,MATCH(Ras,Rasbonus!$A$1:$AM$1,0),FALSE)),VLOOKUP($A8,Rasbonus!$A$61:$AM$295,MATCH(Ras,Rasbonus!$A$1:$AM$1,0),FALSE),\"0\")","v":"0"},null,null,-17,0,0,0,0,0,0,0,0,0,0,0,0,0,0,0,0,0,0,0,0,0]
["Cryptography",{"$f":"VLOOKUP(A9,AllaSkills!$A$2:$BV$319,'Ny NPC'!$A$2+3,FALSE)","v":"2/6"},"2","6","Academic",null,null,null,null,null,null,null,null,null,null,null,null,null,null,null,null,null,null,null,null,null,null,null,0,-25,{"$f":"(IN+RE)/2","v":5},{"$f":"HLOOKUP(Yrke,Levelbonus!$B$1:$CR$20,2,FALSE)","v":3},3,{"$f":"IF(ISNUMBER(VLOOKUP($A9,Rasbonus!$A$61:$AM$295,MATCH(Ras,Rasbonus!$A$1:$AM$1,0),FALSE)),VLOOKUP($A9,Rasbonus!$A$61:$AM$295,MATCH(Ras,Rasbonus!$A$1:$AM$1,0),FALSE),\"0\")","v":"0"},null,null,-17,0,0,0,0,0,0,0,0,0,0,0,0,0,0,0,0,0,0,0,0,0]
["Demon/Devil Lore",{"$f":"VLOOKUP(A10,AllaSkills!$A$2:$BV$319,'Ny NPC'!$A$2+3,FALSE)","v":"1/3"},"1","3","Academic",null,null,null,null,null,null,null,null,null,null,null,null,null,null,null,null,null,null,null,null,null,null,null,0,-25,{"$f":"(RE)","v":5},{"$f":"HLOOKUP(Yrke,Levelbonus!$B$1:$CR$20,2,FALSE)","v":3},3,{"$f":"IF(ISNUMBER(VLOOKUP($A10,Rasbonus!$A$61:$AM$295,MATCH(Ras,Rasbonus!$A$1:$AM$1,0),FALSE)),VLOOKUP($A10,Rasbonus!$A$61:$AM$295,MATCH(Ras,Rasbonus!$A$1:$AM$1,0),FALSE),\"0\")","v":"0"},null,null,-17,0,0,0,0,0,0,0,0,0,0,0,0,0,0,0,0,0,0,0,0,0]
["Drafting",{"$f":"VLOOKUP(A11,AllaSkills!$A$2:$BV$319,'Ny NPC'!$A$2+3,FALSE)","v":"1/3"},"1","3","Academic",null,null,null,null,null,null,null,null,null,null,null,null,null,null,null,null,null,null,null,null,null,null,null,0,-25,{"$f":"(RE)","v":5},{"$f":"HLOOKUP(Yrke,Levelbonus!$B$1:$CR$20,2,FALSE)","v":3},3,{"$f":"IF(ISNUMBER(VLOOKUP($A11,Rasbonus!$A$61:$AM$295,MATCH(Ras,Rasbonus!$A$1:$AM$1,0),FALSE)),VLOOKUP($A11,Rasbonus!$A$61:$AM$295,MATCH(Ras,Rasbonus!$A$1:$AM$1,0),FALSE),\"0\")","v":"0"},null,null,-17,0,0,0,0,0,0,0,0,0,0,0,0,0,0,0,0,0,0,0,0,0]
["Dragon Lore",{"$f":"VLOOKUP(A12,AllaSkills!$A$2:$BV$319,'Ny NPC'!$A$2+3,FALSE)","v":"1/3"},"1","3","Academic",null,null,null,null,null,null,null,null,null,null,null,null,null,null,null,null,null,null,null,null,null,null,null,0,-25,{"$f":"(RE)","v":5},{"$f":"HLOOKUP(Yrke,Levelbonus!$B$1:$CR$20,2,FALSE)","v":3},3,{"$f":"IF(ISNUMBER(VLOOKUP($A12,Rasbonus!$A$61:$AM$295,MATCH(Ras,Rasbonus!$A$1:$AM$1,0),FALSE)),VLOOKUP($A12,Rasbonus!$A$61:$AM$295,MATCH(Ras,Rasbonus!$A$1:$AM$1,0),FALSE),\"0\")","v":"0"},null,null,-17,0,0,0,0,0,0,0,0,0,0,0,0,0,0,0,0,0,0,0,0,0]
["Engineering",{"$f":"VLOOKUP(A13,AllaSkills!$A$2:$BV$319,'Ny NPC'!$A$2+3,FALSE)","v":"1/2"},"1","2","Academic",null,null,null,null,null,null,null,null,null,null,null,null,null,null,null,null,null,null,null,null,null,null,null,0,-25,{"$f":"(IN+RE)/2","v":5},{"$f":"HLOOKUP(Yrke,Levelbonus!$B$1:$CR$20,2,FALSE)","v":3},3,{"$f":"IF(ISNUMBER(VLOOKUP($A13,Rasbonus!$A$61:$AM$295,MATCH(Ras,Rasbonus!$A$1:$AM$1,0),FALSE)),VLOOKUP($A13,Rasbonus!$A$61:$AM$295,MATCH(Ras,Rasbonus!$A$1:$AM$1,0),FALSE),\"0\")","v":"0"},null,null,-17,0,0,0,0,0,0,0,0,0,0,0,0,0,0,0,0,0,0,0,0,0]
["Faerie Lore",{"$f":"VLOOKUP(A14,AllaSkills!$A$2:$BV$319,'Ny NPC'!$A$2+3,FALSE)","v":"1/3"},"1","3","Academic",null,null,null,null,null,null,null,null,null,null,null,null,null,null,null,null,null,null,null,null,null,null,null,0,-25,{"$f":"(RE)","v":5},{"$f":"HLOOKUP(Yrke,Levelbonus!$B$1:$CR$20,2,FALSE)","v":3},3,{"$f":"IF(ISNUMBER(VLOOKUP($A14,Rasbonus!$A$61:$AM$295,MATCH(Ras,Rasbonus!$A$1:$AM$1,0),FALSE)),VLOOKUP($A14,Rasbonus!$A$61:$AM$295,MATCH(Ras,Rasbonus!$A$1:$AM$1,0),FALSE),\"0\")","v":"0"},null,null,-17,0,0,0,0,0,0,0,0,0,0,0,0,0,0,0,0,0,0,0,0,0]
["Fauna Lore",{"$f":"VLOOKUP(A15,AllaSkills!$A$2:$BV$319,'Ny NPC'!$A$2+3,FALSE)","v":"1/4"},"1","4","Academic",null,null,null,null,null,null,null,null,null,null,null,null,null,null,null,null,null,null,null,null,null,null,null,0,-25,5,{"$f":"HLOOKUP(Yrke,Levelbonus!$B$1:$CR$20,2,FALSE)","v":3},3,{"$f":"IF(ISNUMBER(VLOOKUP($A15,Rasbonus!$A$61:$AM$295,MATCH(Ras,Rasbonus!$A$1:$AM$1,0),FALSE)),VLOOKUP($A15,Rasbonus!$A$61:$AM$295,MATCH(Ras,Rasbonus!$A$1:$AM$1,0),FALSE),\"0\")","v":20},null,null,3,0,0,0,0,0,0,0,0,0,0,0,0,0,0,0,0,0,0,0,0,0]
["Flora Lore",{"$f":"VLOOKUP(A16,AllaSkills!$A$2:$BV$319,'Ny NPC'!$A$2+3,FALSE)","v":"1/4"},"1","4","Academic",null,null,null,null,null,null,null,null,null,null,null,null,null,null,null,null,null,null,null,null,null,null,null,0,-25,5,{"$f":"HLOOKUP(Yrke,Levelbonus!$B$1:$CR$20,2,FALSE)","v":3},3,{"$f":"IF(ISNUMBER(VLOOKUP($A16,Rasbonus!$A$61:$AM$295,MATCH(Ras,Rasbonus!$A$1:$AM$1,0),FALSE)),VLOOKUP($A16,Rasbonus!$A$61:$AM$295,MATCH(Ras,Rasbonus!$A$1:$AM$1,0),FALSE),\"0\")","v":"0"},null,null,-17,0,0,0,0,0,0,0,0,0,0,0,0,0,0,0,0,0,0,0,0,0]
["Heraldry",{"$f":"VLOOKUP(A17,AllaSkills!$A$2:$BV$319,'Ny NPC'!$A$2+3,FALSE)","v":"3/5"},"3","5","Academic",null,null,null,null,null,null,null,null,null,null,null,null,null,null,null,null,null,null,null,null,null,null,null,0,-25,5,{"$f":"HLOOKUP(Yrke,Levelbonus!$B$1:$CR$20,2,FALSE)","v":3},3,{"$f":"IF(ISNUMBER(VLOOKUP($A17,Rasbonus!$A$61:$AM$295,MATCH(Ras,Rasbonus!$A$1:$AM$1,0),FALSE)),VLOOKUP($A17,Rasbonus!$A$61:$AM$295,MATCH(Ras,Rasbonus!$A$1:$AM$1,0),FALSE),\"0\")","v":"0"},null,null,-17,0,0,0,0,0,0,0,0,0,0,0,0,0,0,0,0,0,0,0,0,0]
["Herb Lore",{"$f":"VLOOKUP(A18,AllaSkills!$A$2:$BV$319,'Ny NPC'!$A$2+3,FALSE)","v":"1/3"},"1","3","Academic",null,null,null,null,null,null,null,null,null,null,null,null,null,null,null,null,null,null,null,null,null,null,null,0,-25,5,{"$f":"HLOOKUP(Yrke,Levelbonus!$B$1:$CR$20,2,FALSE)","v":3},3,{"$f":"IF(ISNUMBER(VLOOKUP($A18,Rasbonus!$A$61:$AM$295,MATCH(Ras,Rasbonus!$A$1:$AM$1,0),FALSE)),VLOOKUP($A18,Rasbonus!$A$61:$AM$295,MATCH(Ras,Rasbonus!$A$1:$AM$1,0),FALSE),\"0\")","v":"0"},null,null,-17,0,0,0,0,0,0,0,0,0,0,0,0,0,0,0,0,0,0,0,0,0]
["Lock Lore",{"$f":"VLOOKUP(A19,AllaSkills!$A$2:$BV$319,'Ny NPC'!$A$2+3,FALSE)","v":"1/3"},"1","3","Academic",null,null,null,null,null,null,null,null,null,null,null,null,null,null,null,null,null,null,null,null,null,null,null,0,-25,5,{"$f":"HLOOKUP(Yrke,Levelbonus!$B$1:$CR$20,2,FALSE)","v":3},3,{"$f":"IF(ISNUMBER(VLOOKUP($A19,Rasbonus!$A$61:$AM$295,MATCH(Ras,Rasbonus!$A$1:$AM$1,0),FALSE)),VLOOKUP($A19,Rasbonus!$A$61:$AM$295,MATCH(Ras,Rasbonus!$A$1:$AM$1,0),FALSE),\"0\")","v":"0"},null,null,-17,0,0,0,0,0,0,0,0,0,0,0,0,0,0,0,0,0,0,0,0,0]
["Mapping",{"$f":"VLOOKUP(A20,AllaSkills!$A$2:$BV$319,'Ny NPC'!$A$2+3,FALSE)","v":"2"},"2","2","Academic",null,null,null,null,null,null,null,null,null,null,null,null,null,null,null,null,null,null,null,null,null,null,null,0,-25,5,{"$f":"HLOOKUP(Yrke,Levelbonus!$B$1:$CR$20,2,FALSE)","v":3},3,{"$f":"IF(ISNUMBER(VLOOKUP($A20,Rasbonus!$A$61:$AM$295,MATCH(Ras,Rasbonus!$A$1:$AM$1,0),FALSE)),VLOOKUP($A20,Rasbonus!$A$61:$AM$295,MATCH(Ras,Rasbonus!$A$1:$AM$1,0),FALSE),\"0\")","v":"0"},null,null,-17,0,0,0,0,0,0,0,0,0,0,0,0,0,0,0,0,0,0,0,0,0]
["Mechanition",{"$f":"VLOOKUP(A21,AllaSkills!$A$2:$BV$319,'Ny NPC'!$A$2+3,FALSE)","v":"1/2"},"1","2","Academic",null,null,null,null,null,null,null,null,null,null,null,null,null,null,null,null,null,null,null,null,null,null,null,0,-25,{"$f":"(AG+RE)/2","v":5},{"$f":"HLOOKUP(Yrke,Levelbonus!$B$1:$CR$20,2,FALSE)","v":3},3,{"$f":"IF(ISNUMBER(VLOOKUP($A21,Rasbonus!$A$61:$AM$295,MATCH(Ras,Rasbonus!$A$1:$AM$1,0),FALSE)),VLOOKUP($A21,Rasbonus!$A$61:$AM$295,MATCH(Ras,Rasbonus!$A$1:$AM$1,0),FALSE),\"0\")","v":"0"},null,null,-17,0,0,0,0,0,0,0,0,0,0,0,0,0,0,0,0,0,0,0,0,0]
["Metal Lore",{"$f":"VLOOKUP(A22,AllaSkills!$A$2:$BV$319,'Ny NPC'!$A$2+3,FALSE)","v":"1/2"},"1","2","Academic",null,null,null,null,null,null,null,null,null,null,null,null,null,null,null,null,null,null,null,null,null,null,null,0,-25,{"$f":"(RE)","v":5},{"$f":"HLOOKUP(Yrke,Levelbonus!$B$1:$CR$20,2,FALSE)","v":3},3,{"$f":"IF(ISNUMBER(VLOOKUP($A22,Rasbonus!$A$61:$AM$295,MATCH(Ras,Rasbonus!$A$1:$AM$1,0),FALSE)),VLOOKUP($A22,Rasbonus!$A$61:$AM$295,MATCH(Ras,Rasbonus!$A$1:$AM$1,0),FALSE),\"0\")","v":"0"},null,null,-17,0,0,0,0,0,0,0,0,0,0,0,0,0,0,0,0,0,0,0,0,0]
["Military Organization",{"$f":"VLOOKUP(A23,AllaSkills!$A$2:$BV$319,'Ny NPC'!$A$2+3,FALSE)","v":"3/6"},"3","6","Academic",null,null,null,null,null,null,null,null,null,null,null,null,null,null,null,null,null,null,null,null,null,null,null,0,-25,{"$f":"(PR+RE)/2","v":7.5},{"$f":"HLOOKUP(Yrke,Levelbonus!$B$1:$CR$20,2,FALSE)","v":3},3,{"$f":"IF(ISNUMBER(VLOOKUP($A23,Rasbonus!$A$61:$AM$295,MATCH(Ras,Rasbonus!$A$1:$AM$1,0),FALSE)),VLOOKUP($A23,Rasbonus!$A$61:$AM$295,MATCH(Ras,Rasbonus!$A$1:$AM$1,0),FALSE),\"0\")","v":"0"},null,null,-15,0,0,0,0,0,0,0,0,0,0,0,0,0,0,0,0,0,0,0,0,0]
["Mining",{"$f":"VLOOKUP(A24,AllaSkills!$A$2:$BV$319,'Ny NPC'!$A$2+3,FALSE)","v":"3"},"3","3","Academic",null,null,null,null,null,null,null,null,null,null,null,null,null,null,null,null,null,null,null,null,null,null,null,0,-25,{"$f":"(RE+IN)/2","v":5},{"$f":"HLOOKUP(Yrke,Levelbonus!$B$1:$CR$20,2,FALSE)","v":3},3,{"$f":"IF(ISNUMBER(VLOOKUP($A24,Rasbonus!$A$61:$AM$295,MATCH(Ras,Rasbonus!$A$1:$AM$1,0),FALSE)),VLOOKUP($A24,Rasbonus!$A$61:$AM$295,MATCH(Ras,Rasbonus!$A$1:$AM$1,0),FALSE),\"0\")","v":"0"},null,null,-17,0,0,0,0,0,0,0,0,0,0,0,0,0,0,0,0,0,0,0,0,0]
["Navigation",{"$f":"VLOOKUP(A25,AllaSkills!$A$2:$BV$319,'Ny NPC'!$A$2+3,FALSE)","v":"2/6"},"2","6","Academic",null,null,null,null,null,null,null,null,null,null,null,null,null,null,null,null,null,null,null,null,null,null,null,0,-25,{"$f":"(RE+IN)/2","v":5},{"$f":"HLOOKUP(Yrke,Levelbonus!$B$1:$CR$20,2,FALSE)","v":3},3,{"$f":"IF(ISNUMBER(VLOOKUP($A25,Rasbonus!$A$61:$AM$295,MATCH(Ras,Rasbonus!$A$1:$AM$1,0),FALSE)),VLOOKUP($A25,Rasbonus!$A$61:$AM$295,MATCH(Ras,Rasbonus!$A$1:$AM$1,0),FALSE),\"0\")","v":"0"},null,null,-17,0,0,0,0,0,0,0,0,0,0,0,0,0,0,0,0,0,0,0,0,0]
["Phil/Relig. Doctrine",{"$f":"VLOOKUP(A26,AllaSkills!$A$2:$BV$319,'Ny NPC'!$A$2+3,FALSE)","v":"1/2"},"1","2","Academic",null,null,null,null,null,null,null,null,null,null,null,null,null,null,null,null,null,null,null,null,null,null,null,0,-25,{"$f":"(IN+RE)/2","v":5},{"$f":"HLOOKUP(Yrke,Levelbonus!$B$1:$CR$20,2,FALSE)","v":3},3,{"$f":"IF(ISNUMBER(VLOOKUP($A26,Rasbonus!$A$61:$AM$295,MATCH(Ras,Rasbonus!$A$1:$AM$1,0),FALSE)),VLOOKUP($A26,Rasbonus!$A$61:$AM$295,MATCH(Ras,Rasbonus!$A$1:$AM$1,0),FALSE),\"0\")","v":"0"},null,null,-17,0,0,0,0,0,0,0,0,0,0,0,0,0,0,0,0,0,0,0,0,0]
["Poison Lore",{"$f":"VLOOKUP(A27,AllaSkills!$A$2:$BV$319,'Ny NPC'!$A$2+3,FALSE)","v":"1/3"},"1","3","Academic",null,null,null,null,null,null,null,null,null,null,null,null,null,null,null,null,null,null,null,null,null,null,null,0,-25,{"$f":"(RE)","v":5},{"$f":"HLOOKUP(Yrke,Levelbonus!$B$1:$CR$20,2,FALSE)","v":3},3,{"$f":"IF(ISNUMBER(VLOOKUP($A27,Rasbonus!$A$61:$AM$295,MATCH(Ras,Rasbonus!$A$1:$AM$1,0),FALSE)),VLOOKUP($A27,Rasbonus!$A$61:$AM$295,MATCH(Ras,Rasbonus!$A$1:$AM$1,0),FALSE),\"0\")","v":"0"},null,null,-17,0,0,0,0,0,0,0,0,0,0,0,0,0,0,0,0,0,0,0,0,0]
["Racial History",{"$f":"VLOOKUP(A28,AllaSkills!$A$2:$BV$319,'Ny NPC'!$A$2+3,FALSE)","v":"1/4"},"1",{"$f":"IF(RIGHT(B28,1)=\"*\",LEFT(B28,1),IF(LEN(B28)=3,RIGHT(B28,1),IF(LEN(B28)<3,B28,RIGHT(B28,2))))","v":"4"},"Academic",null,null,null,null,null,null,null,null,null,null,null,null,null,null,null,null,null,null,null,null,null,null,null,{"$f":"SUM(F28:AB28)","v":0},-25,{"$f":"(RE)","v":5},{"$f":"HLOOKUP(Yrke,Levelbonus!$B$1:$CR$20,2,FALSE)","v":3},3,{"$f":"IF(ISNUMBER(VLOOKUP($A28,Rasbonus!$A$61:$AM$295,MATCH(Ras,Rasbonus!$A$1:$AM$1,0),FALSE)),VLOOKUP($A28,Rasbonus!$A$61:$AM$295,MATCH(Ras,Rasbonus!$A$1:$AM$1,0),FALSE),\"0\")","v":"0"},null,null,-17,0,0,0,0,0,0,0,0,0,0,0,0,0,0,0,0,0,0,0,0,0]
[null,null,null,null,null,null,null,null,null,null,null,null,null,null,null,null,null,null,null,null,null,null,null,null,null,null,null,null,null,null,null,null,null,null,null,null,null,0,0,0,0,0,0,0,0,0,0,0,0,0,0,0,0,0,0,0,0,0]
["Sanity Healing Lore",{"$f":"VLOOKUP(A30,AllaSkills!$A$2:$BV$319,'Ny NPC'!$A$2+3,FALSE)","v":"2"},{"$f":"IF(LEN(B30)=3,LEFT(B30,1),IF(LEN(B30)<3,B30,99))","v":"2"},"2","Academic",null,null,null,null,null,null,null,null,null,null,null,null,null,null,null,null,null,null,null,null,null,null,null,0,-25,{"$f":"(EM)","v":5},{"$f":"HLOOKUP(Yrke,Levelbonus!$B$1:$CR$20,2,FALSE)","v":3},3,{"$f":"IF(ISNUMBER(VLOOKUP($A30,Rasbonus!$A$61:$AM$295,MATCH(Ras,Rasbonus!$A$1:$AM$1,0),FALSE)),VLOOKUP($A30,Rasbonus!$A$61:$AM$295,MATCH(Ras,Rasbonus!$A$1:$AM$1,0),FALSE),\"0\")","v":"0"},null,null,-17,0,0,0,0,0,0,0,0,0,0,0,0,0,0,0,0,0,0,0,0,0]
["Siege Engineer",{"$f":"VLOOKUP(A31,AllaSkills!$A$2:$BV$319,'Ny NPC'!$A$2+3,FALSE)","v":"2/4"},{"$f":"IF(LEN(B31)=3,LEFT(B31,1),IF(LEN(B31)<3,B31,99))","v":"2"},"4","Academic",null,null,null,null,null,null,null,null,null,null,null,null,null,null,null,null,null,null,null,null,null,null,null,0,-25,{"$f":"(RE+IN)/2","v":5},{"$f":"HLOOKUP(Yrke,Levelbonus!$B$1:$CR$20,2,FALSE)","v":3},3,{"$f":"IF(ISNUMBER(VLOOKUP($A31,Rasbonus!$A$61:$AM$295,MATCH(Ras,Rasbonus!$A$1:$AM$1,0),FALSE)),VLOOKUP($A31,Rasbonus!$A$61:$AM$295,MATCH(Ras,Rasbonus!$A$1:$AM$1,0),FALSE),\"0\")","v":"0"},null,null,-17,0,0,0,0,0,0,0,0,0,0,0,0,0,0,0,0,0,0,0,0,0]
["Spec. know. Lore",{"$f":"VLOOKUP(A32,AllaSkills!$A$2:$BV$319,'Ny NPC'!$A$2+3,FALSE)","v":"1/3"},{"$f":"IF(LEN(B32)=3,LEFT(B32,1),IF(LEN(B32)<3,B32,99))","v":"1"},"3","Academic",null,null,null,null,null,null,null,null,null,null,null,null,null,null,null,null,null,null,null,null,null,null,null,0,-25,{"$f":"(RE)","v":5},{"$f":"HLOOKUP(Yrke,Levelbonus!$B$1:$CR$20,2,FALSE)","v":3},3,{"$f":"IF(ISNUMBER(VLOOKUP($A32,Rasbonus!$A$61:$AM$295,MATCH(Ras,Rasbonus!$A$1:$AM$1,0),FALSE)),VLOOKUP($A32,Rasbonus!$A$61:$AM$295,MATCH(Ras,Rasbonus!$A$1:$AM$1,0),FALSE),\"0\")","v":"0"},null,null,-17,0,0,0,0,0,0,0,0,0,0,0,0,0,0,0,0,0,0,0,0,0]
[]
[]
["Stone Lore",{"$f":"VLOOKUP(A35,AllaSkills!$A$2:$BV$319,'Ny NPC'!$A$2+3,FALSE)","v":"1/2"},{"$f":"IF(LEN(B35)=3,LEFT(B35,1),IF(LEN(B35)<3,B35,99))","v":"1"},"2","Academic",null,null,null,null,null,null,null,null,null,null,null,null,null,null,null,null,null,null,null,null,null,null,null,0,-25,{"$f":"(RE)","v":5},{"$f":"HLOOKUP(Yrke,Levelbonus!$B$1:$CR$20,2,FALSE)","v":3},3,{"$f":"IF(ISNUMBER(VLOOKUP($A35,Rasbonus!$A$61:$AM$295,MATCH(Ras,Rasbonus!$A$1:$AM$1,0),FALSE)),VLOOKUP($A35,Rasbonus!$A$61:$AM$295,MATCH(Ras,Rasbonus!$A$1:$AM$1,0),FALSE),\"0\")","v":"0"},null,null,-17,0,0,0,0,0,0,0,0,0,0,0,0,0,0,0,0,0,0,0,0,0]
["Tactics",{"$f":"VLOOKUP(A36,AllaSkills!$A$2:$BV$319,'Ny NPC'!$A$2+3,FALSE)","v":"2/4"},{"$f":"IF(LEN(B36)=3,LEFT(B36,1),IF(LEN(B36)<3,B36,99))","v":"2"},"4","Academic",null,null,null,null,null,null,null,null,null,null,null,null,null,null,null,null,null,null,null,null,null,null,null,0,-25,{"$f":"(IN+RE)/2","v":5},{"$f":"HLOOKUP(Yrke,Levelbonus!$B$1:$CR$20,2,FALSE)","v":3},3,{"$f":"IF(ISNUMBER(VLOOKUP($A36,Rasbonus!$A$61:$AM$295,MATCH(Ras,Rasbonus!$A$1:$AM$1,0),FALSE)),VLOOKUP($A36,Rasbonus!$A$61:$AM$295,MATCH(Ras,Rasbonus!$A$1:$AM$1,0),FALSE),\"0\")","v":"0"},null,null,-17,0,0,0,0,0,0,0,0,0,0,0,0,0,0,0,0,0,0,0,0,0]
["Trading lore",{"$f":"VLOOKUP(A37,AllaSkills!$A$2:$BV$319,'Ny NPC'!$A$2+3,FALSE)","v":"2/6"},{"$f":"IF(LEN(B37)=3,LEFT(B37,1),IF(LEN(B37)<3,B37,99))","v":"2"},"6","Academic",null,null,null,null,null,null,null,null,null,null,null,null,null,null,null,null,null,null,null,null,null,null,null,0,-25,{"$f":"(RE)","v":5},{"$f":"HLOOKUP(Yrke,Levelbonus!$B$1:$CR$20,2,FALSE)","v":3},3,{"$f":"IF(ISNUMBER(VLOOKUP($A37,Rasbonus!$A$61:$AM$295,MATCH(Ras,Rasbonus!$A$1:$AM$1,0),FALSE)),VLOOKUP($A37,Rasbonus!$A$61:$AM$295,MATCH(Ras,Rasbonus!$A$1:$AM$1,0),FALSE),\"0\")","v":"0"},null,null,-17,0,0,0,0,0,0,0,0,0,0,0,0,0,0,0,0,0,0,0,0,0]
["Weather Watching",{"$f":"VLOOKUP(A38,AllaSkills!$A$2:$BV$319,'Ny NPC'!$A$2+3,FALSE)","v":"1/4"},{"$f":"IF(LEN(B38)=3,LEFT(B38,1),IF(LEN(B38)<3,B38,99))","v":"1"},{"$f":"IF(RIGHT(B38,1)=\"*\",LEFT(B38,1),IF(LEN(B38)=3,RIGHT(B38,1),IF(LEN(B38)<3,B38,RIGHT(B38,2))))","v":"4"},"Academic",null,null,null,null,null,null,null,null,null,null,null,null,null,null,null,null,null,null,null,null,null,null,null,{"$f":"SUM(F38:AB38)","v":0},{"$f":"IF(AC38<1,-25,IF(AC38>30,80+((AC38-30)*0.5),IF(AC38>20,70+(AC38-20),IF(AC38>10,50+((AC38-10)*2),AC38*5))))","v":-25},{"$f":"(IN+EM)/2","v":5},{"$f":"HLOOKUP(Yrke,Levelbonus!$B$1:$CR$20,2,FALSE)","v":3},{"$f":"AF38*Level","v":3},{"$f":"IF(ISNUMBER(VLOOKUP($A38,Rasbonus!$A$61:$AM$295,MATCH(Ras,Rasbonus!$A$1:$AM$1,0),FALSE)),VLOOKUP($A38,Rasbonus!$A$61:$AM$295,MATCH(Ras,Rasbonus!$A$1:$AM$1,0),FALSE),\"0\")","v":10},null,null,-7,0,0,0,0,0,0,0,0,0,0,0,0,0,0,0,0,0,0,0,0,0]
[]
["Animal & Survival",{"$f":"HLOOKUP(Diverse!$G$2,'2nd'!$B$1:$CR$18,3,FALSE)","v":2},null,null,null,{"$f":"SUM(AL41:AL52)","v":0},{"$f":"SUM(AM41:AM52)","v":0},null,{"$f":"SUM(AM41:AM52)","v":0},{"$f":"SUM(AN41:AN52)","v":0},0,0,0,0,0,0,0,0,0,0,0,0,0,0,0,0,0,0,"Rank","Skill","Stat",null,"Lvl","Race","Armor","Item","Total"]
["Animal handling",{"$f":"VLOOKUP(A41,AllaSkills!$A$3:$BV$319,'Ny NPC'!$A$2+3,FALSE)","v":"2/5"},{"$f":"IF(LEN(B41)=3,LEFT(B41,1),IF(LEN(B41)<3,B41,99))","v":"2"},"5","Animal",null,null,null,null,null,null,null,null,null,null,null,null,null,null,null,null,null,null,null,null,null,null,null,0,-25,{"$f":"(EM+PR+AP)/3","v":6.666666666666667},{"$f":"HLOOKUP(Yrke,Levelbonus!$B$1:$CR$20,3,FALSE)","v":0},0,{"$f":"IF(ISNUMBER(VLOOKUP($A41,Rasbonus!$A$61:$AM$295,MATCH(Ras,Rasbonus!$A$1:$AM$1,0),FALSE)),VLOOKUP($A41,Rasbonus!$A$61:$AM$295,MATCH(Ras,Rasbonus!$A$1:$AM$1,0),FALSE),\"0\")","v":15},null,null,-3,0,{"$f":"IF(I41>2,\"99\",IF(I41<1,0,IF(I41=1,$C41+$C41-$C41,IF(I41=2,$C41+$D41))))","v":0},0,0,0,0,0,0,0,0,0,0,0,0,0,0,0,0,0,0,0]
["Animal training",{"$f":"VLOOKUP(A42,AllaSkills!$A$3:$BV$319,'Ny NPC'!$A$2+3,FALSE)","v":"4"},"4","4","Animal",null,null,null,null,null,null,null,null,null,null,null,null,null,null,null,null,null,null,null,null,null,null,null,0,-25,{"$f":"(EM+PR+AP)/3","v":6.666666666666667},{"$f":"HLOOKUP(Yrke,Levelbonus!$B$1:$CR$20,3,FALSE)","v":0},0,{"$f":"IF(ISNUMBER(VLOOKUP($A42,Rasbonus!$A$61:$AM$295,MATCH(Ras,Rasbonus!$A$1:$AM$1,0),FALSE)),VLOOKUP($A42,Rasbonus!$A$61:$AM$295,MATCH(Ras,Rasbonus!$A$1:$AM$1,0),FALSE),\"0\")","v":15},null,null,-3,0,{"$f":"IF(I42>2,\"99\",IF(I42<1,0,IF(I42=1,$C42+$C42-$C42,IF(I42=2,$C42+$D42))))","v":0},0,0,0,0,0,0,0,0,0,{"$f":"IF(S42>2,\"99\",IF(S42<1,0,IF(S42=1,$C42+$C42-$C42,IF(S42=2,$C42+$D42))))","v":0},0,0,0,0,0,0,0,0,0]
["Beast Master",{"$f":"VLOOKUP(A43,AllaSkills!$A$3:$BV$319,'Ny NPC'!$A$2+3,FALSE)","v":"5"},"5","5","Animal",null,null,null,null,null,null,null,null,null,null,null,null,null,null,null,null,null,null,null,null,null,null,null,0,-25,{"$f":"(EM+PR)/2","v":7.5},{"$f":"HLOOKUP(Yrke,Levelbonus!$B$1:$CR$20,3,FALSE)","v":0},0,{"$f":"IF(ISNUMBER(VLOOKUP($A43,Rasbonus!$A$61:$AM$295,MATCH(Ras,Rasbonus!$A$1:$AM$1,0),FALSE)),VLOOKUP($A43,Rasbonus!$A$61:$AM$295,MATCH(Ras,Rasbonus!$A$1:$AM$1,0),FALSE),\"0\")","v":25},null,null,8,0,0,0,0,0,0,0,0,0,0,0,0,0,0,0,0,0,0,0,0,0]
["Driving",{"$f":"VLOOKUP(A44,AllaSkills!$A$3:$BV$319,'Ny NPC'!$A$2+3,FALSE)","v":"3"},"3","3","Animal",null,null,null,null,null,null,null,null,null,null,null,null,null,null,null,null,null,null,null,null,null,null,null,0,-25,{"$f":"(AG+QU)/2","v":2.5},{"$f":"HLOOKUP(Yrke,Levelbonus!$B$1:$CR$20,3,FALSE)","v":0},0,{"$f":"IF(ISNUMBER(VLOOKUP($A44,Rasbonus!$A$61:$AM$295,MATCH(Ras,Rasbonus!$A$1:$AM$1,0),FALSE)),VLOOKUP($A44,Rasbonus!$A$61:$AM$295,MATCH(Ras,Rasbonus!$A$1:$AM$1,0),FALSE),\"0\")","v":"0"},null,null,-23,0,0,0,0,0,0,0,0,0,0,0,0,0,0,0,0,0,0,0,0,0]
["Herding",{"$f":"VLOOKUP(A45,AllaSkills!$A$3:$BV$319,'Ny NPC'!$A$2+3,FALSE)","v":"2/6"},"2","6","Animal",null,null,null,null,null,null,null,null,null,null,null,null,null,null,null,null,null,null,null,null,null,null,null,0,-25,{"$f":"(EM+PR)/2","v":7.5},{"$f":"HLOOKUP(Yrke,Levelbonus!$B$1:$CR$20,3,FALSE)","v":0},0,{"$f":"IF(ISNUMBER(VLOOKUP($A45,Rasbonus!$A$61:$AM$295,MATCH(Ras,Rasbonus!$A$1:$AM$1,0),FALSE)),VLOOKUP($A45,Rasbonus!$A$61:$AM$295,MATCH(Ras,Rasbonus!$A$1:$AM$1,0),FALSE),\"0\")","v":10},null,null,-8,0,0,0,0,0,0,0,0,0,0,0,0,0,0,0,0,0,0,0,0,0]
["Loading",{"$f":"VLOOKUP(A46,AllaSkills!$A$3:$BV$319,'Ny NPC'!$A$2+3,FALSE)","v":"3"},{"$f":"IF(LEN(B46)=3,LEFT(B46,1),IF(LEN(B46)<3,B46,99))","v":"3"},{"$f":"IF(RIGHT(B46,1)=\"*\",LEFT(B46,1),IF(LEN(B46)=3,RIGHT(B46,1),IF(LEN(B46)<3,B46,RIGHT(B46,2))))","v":"3"},"Animal",null,null,null,null,null,null,null,null,null,null,null,null,null,null,null,null,null,null,null,null,null,null,null,{"$f":"SUM(F46:AB46)","v":0},{"$f":"IF(AC46<1,-25,IF(AC46>30,80+((AC46-30)*0.5),IF(AC46>20,70+(AC46-20),IF(AC46>10,50+((AC46-10)*2),AC46*5))))","v":-25},{"$f":"(EM+RE)/2","v":5},{"$f":"HLOOKUP(Yrke,Levelbonus!$B$1:$CR$20,3,FALSE)","v":0},{"$f":"AF46*Level","v":0},{"$f":"IF(ISNUMBER(VLOOKUP($A46,Rasbonus!$A$61:$AM$295,MATCH(Ras,Rasbonus!$A$1:$AM$1,0),FALSE)),VLOOKUP($A46,Rasbonus!$A$61:$AM$295,MATCH(Ras,Rasbonus!$A$1:$AM$1,0),FALSE),\"0\")","v":"0"},null,null,{"$f":"ROUND(AD46+AE46+AG46+AH46+AI46+AJ46,0)","v":-20},{"$f":"IF(F46>2,\"99\",IF(F46<1,0,IF(F46=1,$C46+$C46-$C46,IF(F46=2,$C46+$D46))))","v":0},0,0,0,0,0,0,0,0,0,0,0,0,0,0,0,0,0,0,0,0]
[]
["Caving",{"$f":"VLOOKUP(A48,AllaSkills!$A$3:$BV$319,'Ny NPC'!$A$2+3,FALSE)","v":"3"},"3","3","Survivial",null,null,null,null,null,null,null,null,null,null,null,null,null,null,null,null,null,null,null,null,null,null,null,0,-25,{"$f":"(SD+RE)/2","v":5},{"$f":"HLOOKUP(Yrke,Levelbonus!$B$1:$CR$20,20,FALSE)","v":0},0,{"$f":"IF(ISNUMBER(VLOOKUP($A48,Rasbonus!$A$61:$AM$295,MATCH(Ras,Rasbonus!$A$1:$AM$1,0),FALSE)),VLOOKUP($A48,Rasbonus!$A$61:$AM$295,MATCH(Ras,Rasbonus!$A$1:$AM$1,0),FALSE),\"0\")","v":"0"},null,null,-20,0,{"$f":"IF(I48>2,\"99\",IF(I48<1,0,IF(I48=1,$C48+$C48-$C48,IF(I48=2,$C48+$D48))))","v":0},{"$f":"IF(J48>2,\"99\",IF(J48<1,0,IF(J48=1,$C48+$C48-$C48,IF(J48=2,$C48+$D48))))","v":0},{"$f":"IF(K48>2,\"99\",IF(K48<1,0,IF(K48=1,$C48+$C48-$C48,IF(K48=2,$C48+$D48))))","v":0},{"$f":"IF(L48>2,\"99\",IF(L48<1,0,IF(L48=1,$C48+$C48-$C48,IF(L48=2,$C48+$D48))))","v":0},{"$f":"IF(M48>2,\"99\",IF(M48<1,0,IF(M48=1,$C48+$C48-$C48,IF(M48=2,$C48+$D48))))","v":0},{"$f":"IF(N48>2,\"99\",IF(N48<1,0,IF(N48=1,$C48+$C48-$C48,IF(N48=2,$C48+$D48))))","v":0},{"$f":"IF(O48>2,\"99\",IF(O48<1,0,IF(O48=1,$C48+$C48-$C48,IF(O48=2,$C48+$D48))))","v":0},{"$f":"IF(P48>2,\"99\",IF(P48<1,0,IF(P48=1,$C48+$C48-$C48,IF(P48=2,$C48+$D48))))","v":0},{"$f":"IF(Q48>2,\"99\",IF(Q48<1,0,IF(Q48=1,$C48+$C48-$C48,IF(Q48=2,$C48+$D48))))","v":0},{"$f":"IF(R48>2,\"99\",IF(R48<1,0,IF(R48=1,$C48+$C48-$C48,IF(R48=2,$C48+$D48))))","v":0},{"$f":"IF(S48>2,\"99\",IF(S48<1,0,IF(S48=1,$C48+$C48-$C48,IF(S48=2,$C48+$D48))))","v":0},{"$f":"IF(T48>2,\"99\",IF(T48<1,0,IF(T48=1,$C48+$C48-$C48,IF(T48=2,$C48+$D48))))","v":0},{"$f":"IF(U48>2,\"99\",IF(U48<1,0,IF(U48=1,$C48+$C48-$C48,IF(U48=2,$C48+$D48))))","v":0},{"$f":"IF(V48>2,\"99\",IF(V48<1,0,IF(V48=1,$C48+$C48-$C48,IF(V48=2,$C48+$D48))))","v":0},{"$f":"IF(W48>2,\"99\",IF(W48<1,0,IF(W48=1,$C48+$C48-$C48,IF(W48=2,$C48+$D48))))","v":0},{"$f":"IF(X48>2,\"99\",IF(X48<1,0,IF(X48=1,$C48+$C48-$C48,IF(X48=2,$C48+$D48))))","v":0},{"$f":"IF(Y48>2,\"99\",IF(Y48<1,0,IF(Y48=1,$C48+$C48-$C48,IF(Y48=2,$C48+$D48))))","v":0},{"$f":"IF(Z48>2,\"99\",IF(Z48<1,0,IF(Z48=1,$C48+$C48-$C48,IF(Z48=2,$C48+$D48))))","v":0},{"$f":"IF(AA48>2,\"99\",IF(AA48<1,0,IF(AA48=1,$C48+$C48-$C48,IF(AA48=2,$C48+$D48))))","v":0},{"$f":"IF(AB48>2,\"99\",IF(AB48<1,0,IF(AB48=1,$C48+$C48-$C48,IF(AB48=2,$C48+$D48))))","v":0}]
["Foraging",{"$f":"VLOOKUP(A49,AllaSkills!$A$3:$BV$319,'Ny NPC'!$A$2+3,FALSE)","v":"2/5"},"2","5","Survivial",null,null,null,null,null,null,null,null,null,null,null,null,null,null,null,null,null,null,null,null,null,null,null,0,-25,{"$f":"(IN+RE)/2","v":5},{"$f":"HLOOKUP(Yrke,Levelbonus!$B$1:$CR$20,20,FALSE)","v":0},0,{"$f":"IF(ISNUMBER(VLOOKUP($A49,Rasbonus!$A$61:$AM$295,MATCH(Ras,Rasbonus!$A$1:$AM$1,0),FALSE)),VLOOKUP($A49,Rasbonus!$A$61:$AM$295,MATCH(Ras,Rasbonus!$A$1:$AM$1,0),FALSE),\"0\")","v":"0"},null,null,-20,0,0,0,0,0,0,0,0,0,0,0,0,0,0,0,0,0,0,0,0,0]
["Hostile Environment",{"$f":"VLOOKUP(A50,AllaSkills!$A$3:$BV$319,'Ny NPC'!$A$2+3,FALSE)","v":"3"},"3","3","Survivial",null,null,null,null,null,null,null,null,null,null,null,null,null,null,null,null,null,null,null,null,null,null,null,0,-25,{"$f":"(AG+SD)/2","v":5},{"$f":"HLOOKUP(Yrke,Levelbonus!$B$1:$CR$20,20,FALSE)","v":0},0,{"$f":"IF(ISNUMBER(VLOOKUP($A50,Rasbonus!$A$61:$AM$295,MATCH(Ras,Rasbonus!$A$1:$AM$1,0),FALSE)),VLOOKUP($A50,Rasbonus!$A$61:$AM$295,MATCH(Ras,Rasbonus!$A$1:$AM$1,0),FALSE),\"0\")","v":"0"},null,null,-20,0,0,0,0,0,0,0,0,0,0,0,0,0,0,0,0,0,0,0,0,0]
["Region Lore",{"$f":"VLOOKUP(A51,AllaSkills!$A$3:$BV$319,'Ny NPC'!$A$2+3,FALSE)","v":"2/5"},"2","5","Survivial",null,null,null,null,null,null,null,null,null,null,null,null,null,null,null,null,null,null,null,null,null,null,null,0,-25,{"$f":"(RE)","v":5},{"$f":"HLOOKUP(Yrke,Levelbonus!$B$1:$CR$20,20,FALSE)","v":0},0,{"$f":"IF(ISNUMBER(VLOOKUP($A51,Rasbonus!$A$61:$AM$295,MATCH(Ras,Rasbonus!$A$1:$AM$1,0),FALSE)),VLOOKUP($A51,Rasbonus!$A$61:$AM$295,MATCH(Ras,Rasbonus!$A$1:$AM$1,0),FALSE),\"0\")","v":"0"},null,null,-20,0,0,0,0,0,0,0,0,0,0,0,0,0,0,0,0,0,0,0,0,0]
["Streetwise",{"$f":"VLOOKUP(A52,AllaSkills!$A$3:$BV$319,'Ny NPC'!$A$2+3,FALSE)","v":"2/7"},"2","7","Survivial",null,null,null,null,null,null,null,null,null,null,null,null,null,null,null,null,null,null,null,null,null,null,null,0,-25,{"$f":"(PR+IN)/2","v":7.5},{"$f":"HLOOKUP(Yrke,Levelbonus!$B$1:$CR$20,20,FALSE)","v":0},0,{"$f":"IF(ISNUMBER(VLOOKUP($A52,Rasbonus!$A$61:$AM$295,MATCH(Ras,Rasbonus!$A$1:$AM$1,0),FALSE)),VLOOKUP($A52,Rasbonus!$A$61:$AM$295,MATCH(Ras,Rasbonus!$A$1:$AM$1,0),FALSE),\"0\")","v":"0"},null,null,-18,0,0,0,0,0,0,0,0,0,0,0,0,0,0,0,0,0,0,0,0,0]
[]
["Athletic & Gymnastic",{"$f":"HLOOKUP(Diverse!$G$2,'2nd'!$B$1:$CR$18,4,FALSE)","v":0},null,null,null,{"$f":"SUM(AL55:AL76)","v":0},{"$f":"SUM(AM55:AM76)","v":0},null,{"$f":"SUM(AM55:AM76)","v":0},{"$f":"SUM(AN55:AN76)","v":0},0,0,0,0,0,0,0,0,0,0,0,0,0,0,0,0,0,0,"Rank","Skill","Stat",null,"Lvl","Race","Armor","Item","Total"]
["Athletic Games",{"$f":"VLOOKUP(A55,AllaSkills!$A$3:$BV$319,'Ny NPC'!$A$2+3,FALSE)","v":"7"},{"$f":"IF(LEN(B55)=3,LEFT(B55,1),IF(LEN(B55)<3,B55,99))","v":"7"},"7","Athletic",null,null,null,null,null,null,null,null,null,null,null,null,null,null,null,null,null,null,null,null,null,null,null,0,-25,{"$f":"(ST+AG+QU)/3","v":8.3333333333333339},{"$f":"HLOOKUP(Yrke,Levelbonus!$B$1:$CR$20,4,FALSE)","v":0},0,{"$f":"IF(ISNUMBER(VLOOKUP($A55,Rasbonus!$A$61:$AM$295,MATCH(Ras,Rasbonus!$A$1:$AM$1,0),FALSE)),VLOOKUP($A55,Rasbonus!$A$61:$AM$295,MATCH(Ras,Rasbonus!$A$1:$AM$1,0),FALSE),\"0\")","v":"0"},{"$f":"'Ny NPC'!$N$3","v":"0"},null,-17,0,{"$f":"IF(I55>2,\"99\",IF(I55<1,0,IF(I55=1,$C55+$C55-$C55,IF(I55=2,$C55+$D55))))","v":0},{"$f":"IF(J55>2,\"99\",IF(J55<1,0,IF(J55=1,$C55+$C55-$C55,IF(J55=2,$C55+$D55))))","v":0},0,0,0,0,0,0,0,0,0,0,0,0,0,0,0,0,0,0]
["Dancing",{"$f":"VLOOKUP(A56,AllaSkills!$A$3:$BV$319,'Ny NPC'!$A$2+3,FALSE)","v":"2/6"},"2","6","Athletic",null,null,null,null,null,null,null,null,null,null,null,null,null,null,null,null,null,null,null,null,null,null,null,0,-25,{"$f":"(AG+IN)/2","v":5},{"$f":"HLOOKUP(Yrke,Levelbonus!$B$1:$CR$20,4,FALSE)","v":0},0,{"$f":"IF(ISNUMBER(VLOOKUP($A56,Rasbonus!$A$61:$AM$295,MATCH(Ras,Rasbonus!$A$1:$AM$1,0),FALSE)),VLOOKUP($A56,Rasbonus!$A$61:$AM$295,MATCH(Ras,Rasbonus!$A$1:$AM$1,0),FALSE),\"0\")","v":"0"},{"$f":"'Ny NPC'!$N$3","v":"0"},null,-20,0,{"$f":"IF(I56>2,\"99\",IF(I56<1,0,IF(I56=1,$C56+$C56-$C56,IF(I56=2,$C56+$D56))))","v":0},{"$f":"IF(J56>2,\"99\",IF(J56<1,0,IF(J56=1,$C56+$C56-$C56,IF(J56=2,$C56+$D56))))","v":0},{"$f":"IF(K56>2,\"99\",IF(K56<1,0,IF(K56=1,$C56+$C56-$C56,IF(K56=2,$C56+$D56))))","v":0},{"$f":"IF(L56>2,\"99\",IF(L56<1,0,IF(L56=1,$C56+$C56-$C56,IF(L56=2,$C56+$D56))))","v":0},{"$f":"IF(M56>2,\"99\",IF(M56<1,0,IF(M56=1,$C56+$C56-$C56,IF(M56=2,$C56+$D56))))","v":0},{"$f":"IF(N56>2,\"99\",IF(N56<1,0,IF(N56=1,$C56+$C56-$C56,IF(N56=2,$C56+$D56))))","v":0},{"$f":"IF(O56>2,\"99\",IF(O56<1,0,IF(O56=1,$C56+$C56-$C56,IF(O56=2,$C56+$D56))))","v":0},{"$f":"IF(P56>2,\"99\",IF(P56<1,0,IF(P56=1,$C56+$C56-$C56,IF(P56=2,$C56+$D56))))","v":0},{"$f":"IF(Q56>2,\"99\",IF(Q56<1,0,IF(Q56=1,$C56+$C56-$C56,IF(Q56=2,$C56+$D56))))","v":0},{"$f":"IF(R56>2,\"99\",IF(R56<1,0,IF(R56=1,$C56+$C56-$C56,IF(R56=2,$C56+$D56))))","v":0},{"$f":"IF(S56>2,\"99\",IF(S56<1,0,IF(S56=1,$C56+$C56-$C56,IF(S56=2,$C56+$D56))))","v":0},{"$f":"IF(T56>2,\"99\",IF(T56<1,0,IF(T56=1,$C56+$C56-$C56,IF(T56=2,$C56+$D56))))","v":0},{"$f":"IF(U56>2,\"99\",IF(U56<1,0,IF(U56=1,$C56+$C56-$C56,IF(U56=2,$C56+$D56))))","v":0},{"$f":"IF(V56>2,\"99\",IF(V56<1,0,IF(V56=1,$C56+$C56-$C56,IF(V56=2,$C56+$D56))))","v":0},{"$f":"IF(W56>2,\"99\",IF(W56<1,0,IF(W56=1,$C56+$C56-$C56,IF(W56=2,$C56+$D56))))","v":0},{"$f":"IF(X56>2,\"99\",IF(X56<1,0,IF(X56=1,$C56+$C56-$C56,IF(X56=2,$C56+$D56))))","v":0},{"$f":"IF(Y56>2,\"99\",IF(Y56<1,0,IF(Y56=1,$C56+$C56-$C56,IF(Y56=2,$C56+$D56))))","v":0},{"$f":"IF(Z56>2,\"99\",IF(Z56<1,0,IF(Z56=1,$C56+$C56-$C56,IF(Z56=2,$C56+$D56))))","v":0},{"$f":"IF(AA56>2,\"99\",IF(AA56<1,0,IF(AA56=1,$C56+$C56-$C56,IF(AA56=2,$C56+$D56))))","v":0},{"$f":"IF(AB56>2,\"99\",IF(AB56<1,0,IF(AB56=1,$C56+$C56-$C56,IF(AB56=2,$C56+$D56))))","v":0}]
["Distance Running",{"$f":"VLOOKUP(A57,AllaSkills!$A$3:$BV$319,'Ny NPC'!$A$2+3,FALSE)","v":"3"},"3","3","Athletic",null,null,null,null,null,null,null,null,null,null,null,null,null,null,null,null,null,null,null,null,null,null,null,0,-25,{"$f":"CO","v":20},{"$f":"HLOOKUP(Yrke,Levelbonus!$B$1:$CR$20,4,FALSE)","v":0},0,{"$f":"IF(ISNUMBER(VLOOKUP($A57,Rasbonus!$A$61:$AM$295,MATCH(Ras,Rasbonus!$A$1:$AM$1,0),FALSE)),VLOOKUP($A57,Rasbonus!$A$61:$AM$295,MATCH(Ras,Rasbonus!$A$1:$AM$1,0),FALSE),\"0\")","v":15},{"$f":"'Ny NPC'!$N$3","v":"0"},null,10,0,0,0,0,0,0,0,0,0,0,0,0,0,0,0,0,0,0,0,0,0]
["Diving",{"$f":"VLOOKUP(A58,AllaSkills!$A$3:$BV$319,'Ny NPC'!$A$2+3,FALSE)","v":"3"},"3","3","Athletic",null,null,null,null,null,null,null,null,null,null,null,null,null,null,null,null,null,null,null,null,null,null,null,0,-25,{"$f":"(SD+AG)/2","v":5},{"$f":"HLOOKUP(Yrke,Levelbonus!$B$1:$CR$20,4,FALSE)","v":0},0,{"$f":"IF(ISNUMBER(VLOOKUP($A58,Rasbonus!$A$61:$AM$295,MATCH(Ras,Rasbonus!$A$1:$AM$1,0),FALSE)),VLOOKUP($A58,Rasbonus!$A$61:$AM$295,MATCH(Ras,Rasbonus!$A$1:$AM$1,0),FALSE),\"0\")","v":"0"},{"$f":"'Ny NPC'!$N$3","v":"0"},null,-20,0,0,0,0,0,0,0,0,0,0,0,0,0,0,0,0,0,0,0,0,0]
["Flying/Gliding",{"$f":"VLOOKUP(A59,AllaSkills!$A$3:$BV$319,'Ny NPC'!$A$2+3,FALSE)","v":"3"},"3","3","Athletic",null,null,null,null,null,null,null,null,null,null,null,null,null,null,null,null,null,null,null,null,null,null,null,0,-25,{"$f":"AG","v":5},{"$f":"HLOOKUP(Yrke,Levelbonus!$B$1:$CR$20,4,FALSE)","v":0},0,{"$f":"IF(ISNUMBER(VLOOKUP($A59,Rasbonus!$A$61:$AM$295,MATCH(Ras,Rasbonus!$A$1:$AM$1,0),FALSE)),VLOOKUP($A59,Rasbonus!$A$61:$AM$295,MATCH(Ras,Rasbonus!$A$1:$AM$1,0),FALSE),\"0\")","v":"0"},{"$f":"'Ny NPC'!$N$3","v":"0"},null,-20,0,0,0,0,0,0,0,0,0,0,0,0,0,0,0,0,0,0,0,0,0]
["Holding Breath",{"$f":"VLOOKUP(A60,AllaSkills!$A$3:$BV$319,'Ny NPC'!$A$2+3,FALSE)","v":"6"},"6","6","Athletic",null,null,null,null,null,null,null,null,null,null,null,null,null,null,null,null,null,null,null,null,null,null,null,0,-25,{"$f":"(CO+SD)/2","v":12.5},{"$f":"HLOOKUP(Yrke,Levelbonus!$B$1:$CR$20,4,FALSE)","v":0},0,{"$f":"IF(ISNUMBER(VLOOKUP($A60,Rasbonus!$A$61:$AM$295,MATCH(Ras,Rasbonus!$A$1:$AM$1,0),FALSE)),VLOOKUP($A60,Rasbonus!$A$61:$AM$295,MATCH(Ras,Rasbonus!$A$1:$AM$1,0),FALSE),\"0\")","v":"0"},null,null,-13,0,0,0,0,0,0,0,0,0,0,0,0,0,0,0,0,0,0,0,0,0]
["Portaging",{"$f":"VLOOKUP(A61,AllaSkills!$A$3:$BV$319,'Ny NPC'!$A$2+3,FALSE)","v":"2/4"},"2","4","Athletic",null,null,null,null,null,null,null,null,null,null,null,null,null,null,null,null,null,null,null,null,null,null,null,0,-25,null,{"$f":"HLOOKUP(Yrke,Levelbonus!$B$1:$CR$20,4,FALSE)","v":0},0,{"$f":"IF(ISNUMBER(VLOOKUP($A61,Rasbonus!$A$61:$AM$295,MATCH(Ras,Rasbonus!$A$1:$AM$1,0),FALSE)),VLOOKUP($A61,Rasbonus!$A$61:$AM$295,MATCH(Ras,Rasbonus!$A$1:$AM$1,0),FALSE),\"0\")","v":10},{"$f":"'Ny NPC'!$N$3","v":"0"},null,-15,0,0,0,0,0,0,0,0,0,0,0,0,0,0,0,0,0,0,0,0,0]
["Rappelling",{"$f":"VLOOKUP(A62,AllaSkills!$A$3:$BV$319,'Ny NPC'!$A$2+3,FALSE)","v":"7"},"7","7","Athletic",null,null,null,null,null,null,null,null,null,null,null,null,null,null,null,null,null,null,null,null,null,null,null,0,-25,{"$f":"AG","v":5},{"$f":"HLOOKUP(Yrke,Levelbonus!$B$1:$CR$20,4,FALSE)","v":0},0,{"$f":"IF(ISNUMBER(VLOOKUP($A62,Rasbonus!$A$61:$AM$295,MATCH(Ras,Rasbonus!$A$1:$AM$1,0),FALSE)),VLOOKUP($A62,Rasbonus!$A$61:$AM$295,MATCH(Ras,Rasbonus!$A$1:$AM$1,0),FALSE),\"0\")","v":"0"},{"$f":"'Ny NPC'!$N$3","v":"0"},null,-20,0,0,0,0,0,0,0,0,0,0,0,0,0,0,0,0,0,0,0,0,0]
["Rowing",{"$f":"VLOOKUP(A63,AllaSkills!$A$3:$BV$319,'Ny NPC'!$A$2+3,FALSE)","v":"3"},"3","3","Athletic",null,null,null,null,null,null,null,null,null,null,null,null,null,null,null,null,null,null,null,null,null,null,null,0,-25,{"$f":"(ST+SD)/2","v":12.5},{"$f":"HLOOKUP(Yrke,Levelbonus!$B$1:$CR$20,4,FALSE)","v":0},0,{"$f":"IF(ISNUMBER(VLOOKUP($A63,Rasbonus!$A$61:$AM$295,MATCH(Ras,Rasbonus!$A$1:$AM$1,0),FALSE)),VLOOKUP($A63,Rasbonus!$A$61:$AM$295,MATCH(Ras,Rasbonus!$A$1:$AM$1,0),FALSE),\"0\")","v":"0"},{"$f":"'Ny NPC'!$N$3","v":"0"},null,-13,0,0,0,0,0,0,0,0,0,0,0,0,0,0,0,0,0,0,0,0,0]
["Sailing",{"$f":"VLOOKUP(A64,AllaSkills!$A$3:$BV$319,'Ny NPC'!$A$2+3,FALSE)","v":"3"},"3","3","Athletic",null,null,null,null,null,null,null,null,null,null,null,null,null,null,null,null,null,null,null,null,null,null,null,0,-25,{"$f":"(EM+IN)/2","v":5},{"$f":"HLOOKUP(Yrke,Levelbonus!$B$1:$CR$20,4,FALSE)","v":0},0,{"$f":"IF(ISNUMBER(VLOOKUP($A64,Rasbonus!$A$61:$AM$295,MATCH(Ras,Rasbonus!$A$1:$AM$1,0),FALSE)),VLOOKUP($A64,Rasbonus!$A$61:$AM$295,MATCH(Ras,Rasbonus!$A$1:$AM$1,0),FALSE),\"0\")","v":"0"},{"$f":"'Ny NPC'!$N$3","v":"0"},null,-20,0,0,0,0,0,0,0,0,0,0,0,0,0,0,0,0,0,0,0,0,0]
["Skating",{"$f":"VLOOKUP(A65,AllaSkills!$A$3:$BV$319,'Ny NPC'!$A$2+3,FALSE)","v":"3"},"3","3","Athletic",null,null,null,null,null,null,null,null,null,null,null,null,null,null,null,null,null,null,null,null,null,null,null,0,-25,{"$f":"(AG+SD)/2","v":5},{"$f":"HLOOKUP(Yrke,Levelbonus!$B$1:$CR$20,4,FALSE)","v":0},0,{"$f":"IF(ISNUMBER(VLOOKUP($A65,Rasbonus!$A$61:$AM$295,MATCH(Ras,Rasbonus!$A$1:$AM$1,0),FALSE)),VLOOKUP($A65,Rasbonus!$A$61:$AM$295,MATCH(Ras,Rasbonus!$A$1:$AM$1,0),FALSE),\"0\")","v":"0"},{"$f":"'Ny NPC'!$N$3","v":"0"},null,-20,0,0,0,0,0,0,0,0,0,0,0,0,0,0,0,0,0,0,0,0,0]
["Skiing",{"$f":"VLOOKUP(A66,AllaSkills!$A$3:$BV$319,'Ny NPC'!$A$2+3,FALSE)","v":"3"},"3","3","Athletic",null,null,null,null,null,null,null,null,null,null,null,null,null,null,null,null,null,null,null,null,null,null,null,0,-25,{"$f":"(AG+SD)/2","v":5},{"$f":"HLOOKUP(Yrke,Levelbonus!$B$1:$CR$20,4,FALSE)","v":0},0,{"$f":"IF(ISNUMBER(VLOOKUP($A66,Rasbonus!$A$61:$AM$295,MATCH(Ras,Rasbonus!$A$1:$AM$1,0),FALSE)),VLOOKUP($A66,Rasbonus!$A$61:$AM$295,MATCH(Ras,Rasbonus!$A$1:$AM$1,0),FALSE),\"0\")","v":"0"},{"$f":"'Ny NPC'!$N$3","v":"0"},null,-20,0,0,0,0,0,0,0,0,0,0,0,0,0,0,0,0,0,0,0,0,0]
["Sprinting",{"$f":"VLOOKUP(A67,AllaSkills!$A$3:$BV$319,'Ny NPC'!$A$2+3,FALSE)","v":"3"},{"$f":"IF(LEN(B67)=3,LEFT(B67,1),IF(LEN(B67)<3,B67,99))","v":"3"},{"$f":"IF(RIGHT(B67,1)=\"*\",LEFT(B67,1),IF(LEN(B67)=3,RIGHT(B67,1),IF(LEN(B67)<3,B67,RIGHT(B67,2))))","v":"3"},"Athletic",null,null,null,null,null,null,null,null,null,null,null,null,null,null,null,null,null,null,null,null,null,null,null,{"$f":"SUM(F67:AB67)","v":0},{"$f":"IF(AC67<1,-25,IF(AC67>30,80+((AC67-30)*0.5),IF(AC67>20,70+(AC67-20),IF(AC67>10,50+((AC67-10)*2),AC67*5))))","v":-25},{"$f":"QU","v":0},{"$f":"HLOOKUP(Yrke,Levelbonus!$B$1:$CR$20,4,FALSE)","v":0},{"$f":"AF67*Level","v":0},{"$f":"IF(ISNUMBER(VLOOKUP($A67,Rasbonus!$A$61:$AM$295,MATCH(Ras,Rasbonus!$A$1:$AM$1,0),FALSE)),VLOOKUP($A67,Rasbonus!$A$61:$AM$295,MATCH(Ras,Rasbonus!$A$1:$AM$1,0),FALSE),\"0\")","v":"0"},{"$f":"'Ny NPC'!$N$3","v":"0"},null,{"$f":"ROUND(AD67+AE67+AG67+AH67+AI67+AJ67,0)","v":-25},{"$f":"IF(F67>2,\"99\",IF(F67<1,0,IF(F67=1,$C67+$C67-$C67,IF(F67=2,$C67+$D67))))","v":0},{"$f":"IF(I67>2,\"99\",IF(I67<1,0,IF(I67=1,$C67+$C67-$C67,IF(I67=2,$C67+$D67))))","v":0},{"$f":"IF(J67>2,\"99\",IF(J67<1,0,IF(J67=1,$C67+$C67-$C67,IF(J67=2,$C67+$D67))))","v":0},{"$f":"IF(K67>2,\"99\",IF(K67<1,0,IF(K67=1,$C67+$C67-$C67,IF(K67=2,$C67+$D67))))","v":0},{"$f":"IF(L67>2,\"99\",IF(L67<1,0,IF(L67=1,$C67+$C67-$C67,IF(L67=2,$C67+$D67))))","v":0},{"$f":"IF(M67>2,\"99\",IF(M67<1,0,IF(M67=1,$C67+$C67-$C67,IF(M67=2,$C67+$D67))))","v":0},{"$f":"IF(N67>2,\"99\",IF(N67<1,0,IF(N67=1,$C67+$C67-$C67,IF(N67=2,$C67+$D67))))","v":0},{"$f":"IF(O67>2,\"99\",IF(O67<1,0,IF(O67=1,$C67+$C67-$C67,IF(O67=2,$C67+$D67))))","v":0},{"$f":"IF(P67>2,\"99\",IF(P67<1,0,IF(P67=1,$C67+$C67-$C67,IF(P67=2,$C67+$D67))))","v":0},{"$f":"IF(Q67>2,\"99\",IF(Q67<1,0,IF(Q67=1,$C67+$C67-$C67,IF(Q67=2,$C67+$D67))))","v":0},{"$f":"IF(R67>2,\"99\",IF(R67<1,0,IF(R67=1,$C67+$C67-$C67,IF(R67=2,$C67+$D67))))","v":0},{"$f":"IF(S67>2,\"99\",IF(S67<1,0,IF(S67=1,$C67+$C67-$C67,IF(S67=2,$C67+$D67))))","v":0},{"$f":"IF(T67>2,\"99\",IF(T67<1,0,IF(T67=1,$C67+$C67-$C67,IF(T67=2,$C67+$D67))))","v":0},{"$f":"IF(U67>2,\"99\",IF(U67<1,0,IF(U67=1,$C67+$C67-$C67,IF(U67=2,$C67+$D67))))","v":0},{"$f":"IF(V67>2,\"99\",IF(V67<1,0,IF(V67=1,$C67+$C67-$C67,IF(V67=2,$C67+$D67))))","v":0},{"$f":"IF(W67>2,\"99\",IF(W67<1,0,IF(W67=1,$C67+$C67-$C67,IF(W67=2,$C67+$D67))))","v":0},{"$f":"IF(X67>2,\"99\",IF(X67<1,0,IF(X67=1,$C67+$C67-$C67,IF(X67=2,$C67+$D67))))","v":0},{"$f":"IF(Y67>2,\"99\",IF(Y67<1,0,IF(Y67=1,$C67+$C67-$C67,IF(Y67=2,$C67+$D67))))","v":0},{"$f":"IF(Z67>2,\"99\",IF(Z67<1,0,IF(Z67=1,$C67+$C67-$C67,IF(Z67=2,$C67+$D67))))","v":0},{"$f":"IF(AA67>2,\"99\",IF(AA67<1,0,IF(AA67=1,$C67+$C67-$C67,IF(AA67=2,$C67+$D67))))","v":0},{"$f":"IF(AB67>2,\"99\",IF(AB67<1,0,IF(AB67=1,$C67+$C67-$C67,IF(AB67=2,$C67+$D67))))","v":0}]
[]
["Acrobatics",{"$f":"VLOOKUP(A69,AllaSkills!$A$3:$BV$319,'Ny NPC'!$A$2+3,FALSE)","v":"3"},"3","3","Gymnastic",null,null,null,null,null,null,null,null,null,null,null,null,null,null,null,null,null,null,null,null,null,null,null,0,-25,{"$f":"(AG+QU)/2","v":2.5},{"$f":"HLOOKUP(Yrke,Levelbonus!$B$1:$CR$20,10,FALSE)","v":0},0,{"$f":"IF(ISNUMBER(VLOOKUP($A69,Rasbonus!$A$61:$AM$295,MATCH(Ras,Rasbonus!$A$1:$AM$1,0),FALSE)),VLOOKUP($A69,Rasbonus!$A$61:$AM$295,MATCH(Ras,Rasbonus!$A$1:$AM$1,0),FALSE),\"0\")","v":"0"},{"$f":"'Ny NPC'!$N$3","v":"0"},null,-23,0,0,0,0,0,0,0,0,0,0,0,0,0,0,0,0,0,0,0,0,0]
["Contortions",{"$f":"VLOOKUP(A70,AllaSkills!$A$3:$BV$319,'Ny NPC'!$A$2+3,FALSE)","v":"5"},"5","5","Gymnastic",null,null,null,null,null,null,null,null,null,null,null,null,null,null,null,null,null,null,null,null,null,null,null,0,-25,{"$f":"(AG+SD)/2","v":5},{"$f":"HLOOKUP(Yrke,Levelbonus!$B$1:$CR$20,10,FALSE)","v":0},0,{"$f":"IF(ISNUMBER(VLOOKUP($A70,Rasbonus!$A$61:$AM$295,MATCH(Ras,Rasbonus!$A$1:$AM$1,0),FALSE)),VLOOKUP($A70,Rasbonus!$A$61:$AM$295,MATCH(Ras,Rasbonus!$A$1:$AM$1,0),FALSE),\"0\")","v":"0"},{"$f":"'Ny NPC'!$N$3","v":"0"},null,-20,0,0,0,0,0,0,0,0,0,0,0,0,0,0,0,0,0,0,0,0,0]
["Juggling",{"$f":"VLOOKUP(A71,AllaSkills!$A$3:$BV$319,'Ny NPC'!$A$2+3,FALSE)","v":"3"},"3","3","Gymnastic",null,null,null,null,null,null,null,null,null,null,null,null,null,null,null,null,null,null,null,null,null,null,null,0,-25,{"$f":"(AG+IN)/2","v":5},{"$f":"HLOOKUP(Yrke,Levelbonus!$B$1:$CR$20,10,FALSE)","v":0},0,{"$f":"IF(ISNUMBER(VLOOKUP($A71,Rasbonus!$A$61:$AM$295,MATCH(Ras,Rasbonus!$A$1:$AM$1,0),FALSE)),VLOOKUP($A71,Rasbonus!$A$61:$AM$295,MATCH(Ras,Rasbonus!$A$1:$AM$1,0),FALSE),\"0\")","v":"0"},{"$f":"'Ny NPC'!$N$3","v":"0"},null,-20,0,0,0,0,0,0,0,0,0,0,0,0,0,0,0,0,0,0,0,0,0]
["Jumping",{"$f":"VLOOKUP(A72,AllaSkills!$A$3:$BV$319,'Ny NPC'!$A$2+3,FALSE)","v":"4"},"4","4","Gymnastic",null,null,null,null,null,null,null,null,null,null,null,null,null,null,null,null,null,null,null,null,null,null,null,0,-25,{"$f":"(ST+AG)/2","v":12.5},{"$f":"HLOOKUP(Yrke,Levelbonus!$B$1:$CR$20,10,FALSE)","v":0},0,{"$f":"IF(ISNUMBER(VLOOKUP($A72,Rasbonus!$A$61:$AM$295,MATCH(Ras,Rasbonus!$A$1:$AM$1,0),FALSE)),VLOOKUP($A72,Rasbonus!$A$61:$AM$295,MATCH(Ras,Rasbonus!$A$1:$AM$1,0),FALSE),\"0\")","v":"0"},{"$f":"'Ny NPC'!$N$3","v":"0"},null,-13,0,0,0,0,0,0,0,0,0,0,0,0,0,0,0,0,0,0,0,0,0]
["Pole Vaulting",{"$f":"VLOOKUP(A73,AllaSkills!$A$3:$BV$319,'Ny NPC'!$A$2+3,FALSE)","v":"5"},"5","5","Gymnastic",null,null,null,null,null,null,null,null,null,null,null,null,null,null,null,null,null,null,null,null,null,null,null,0,-25,{"$f":"(ST+AG)/2","v":12.5},{"$f":"HLOOKUP(Yrke,Levelbonus!$B$1:$CR$20,10,FALSE)","v":0},0,{"$f":"IF(ISNUMBER(VLOOKUP($A73,Rasbonus!$A$61:$AM$295,MATCH(Ras,Rasbonus!$A$1:$AM$1,0),FALSE)),VLOOKUP($A73,Rasbonus!$A$61:$AM$295,MATCH(Ras,Rasbonus!$A$1:$AM$1,0),FALSE),\"0\")","v":"0"},{"$f":"'Ny NPC'!$N$3","v":"0"},null,-13,0,0,0,0,0,0,0,0,0,0,0,0,0,0,0,0,0,0,0,0,0]
["Stilt Walking",{"$f":"VLOOKUP(A74,AllaSkills!$A$3:$BV$319,'Ny NPC'!$A$2+3,FALSE)","v":"4"},"4","4","Gymnastic",null,null,null,null,null,null,null,null,null,null,null,null,null,null,null,null,null,null,null,null,null,null,null,0,-25,{"$f":"(ST+AG)/2","v":12.5},{"$f":"HLOOKUP(Yrke,Levelbonus!$B$1:$CR$20,10,FALSE)","v":0},0,{"$f":"IF(ISNUMBER(VLOOKUP($A74,Rasbonus!$A$61:$AM$295,MATCH(Ras,Rasbonus!$A$1:$AM$1,0),FALSE)),VLOOKUP($A74,Rasbonus!$A$61:$AM$295,MATCH(Ras,Rasbonus!$A$1:$AM$1,0),FALSE),\"0\")","v":"0"},{"$f":"'Ny NPC'!$N$3","v":"0"},null,-13,0,0,0,0,0,0,0,0,0,0,0,0,0,0,0,0,0,0,0,0,0]
["Tightrope Walking",{"$f":"VLOOKUP(A75,AllaSkills!$A$3:$BV$319,'Ny NPC'!$A$2+3,FALSE)","v":"3"},"3","3","Gymnastic",null,null,null,null,null,null,null,null,null,null,null,null,null,null,null,null,null,null,null,null,null,null,null,0,-25,{"$f":"(AG+SD)/2","v":5},{"$f":"HLOOKUP(Yrke,Levelbonus!$B$1:$CR$20,10,FALSE)","v":0},0,{"$f":"IF(ISNUMBER(VLOOKUP($A75,Rasbonus!$A$61:$AM$295,MATCH(Ras,Rasbonus!$A$1:$AM$1,0),FALSE)),VLOOKUP($A75,Rasbonus!$A$61:$AM$295,MATCH(Ras,Rasbonus!$A$1:$AM$1,0),FALSE),\"0\")","v":"0"},{"$f":"'Ny NPC'!$N$3","v":"0"},null,-20,0,0,0,0,0,0,0,0,0,0,0,0,0,0,0,0,0,0,0,0,0]
["Tumbling",{"$f":"VLOOKUP(A76,AllaSkills!$A$3:$BV$319,'Ny NPC'!$A$2+3,FALSE)","v":"3"},"3","3","Gymnastic",null,null,null,null,null,null,null,null,null,null,null,null,null,null,null,null,null,null,null,null,null,null,null,0,-25,{"$f":"(AG+QU)/2","v":2.5},{"$f":"HLOOKUP(Yrke,Levelbonus!$B$1:$CR$20,10,FALSE)","v":0},0,{"$f":"IF(ISNUMBER(VLOOKUP($A76,Rasbonus!$A$61:$AM$295,MATCH(Ras,Rasbonus!$A$1:$AM$1,0),FALSE)),VLOOKUP($A76,Rasbonus!$A$61:$AM$295,MATCH(Ras,Rasbonus!$A$1:$AM$1,0),FALSE),\"0\")","v":"0"},{"$f":"'Ny NPC'!$N$3","v":"0"},null,-23,0,0,0,0,0,0,0,0,0,0,0,0,0,0,0,0,0,0,0,0,0]
[]
["Combat & Deadly",{"$f":"HLOOKUP(Diverse!$G$2,'2nd'!$B$1:$CR$18,5,FALSE)","v":0},null,null,null,{"$f":"SUM(AL79:AL109)","v":0},{"$f":"SUM(AM79:AM109)","v":0},null,{"$f":"SUM(AM79:AM109)","v":0},{"$f":"SUM(AN79:AN109)","v":0},0,0,0,0,0,0,0,0,0,0,0,0,0,0,0,0,0,0,"Rank","Skill","Stat",null,"Lvl","Race","Armor","Item","Total"]
["Brawling",{"$f":"VLOOKUP(A79,AllaSkills!$A$3:$BV$319,'Ny NPC'!$A$2+3,FALSE)","v":"18"},{"$f":"IF(LEN(B79)=3,LEFT(B79,1),IF(LEN(B79)<3,B79,99))","v":"18"},"18","Combat",null,null,null,null,null,null,null,null,null,null,null,null,null,null,null,null,null,null,null,null,null,null,null,0,-25,{"$f":"(ST+AG+EQ)/3","v":10},{"$f":"HLOOKUP(Yrke,Levelbonus!$B$1:$CR$20,5,FALSE)","v":0},0,{"$f":"IF(ISNUMBER(VLOOKUP($A79,Rasbonus!$A$61:$AM$295,MATCH(Ras,Rasbonus!$A$1:$AM$1,0),FALSE)),VLOOKUP($A79,Rasbonus!$A$61:$AM$295,MATCH(Ras,Rasbonus!$A$1:$AM$1,0),FALSE),\"0\")","v":20},null,null,5,{"$f":"IF(F79>2,\"99\",IF(F79<1,0,IF(F79=1,$C79+$C79-$C79,IF(F79=2,$C79+$D79))))","v":0},{"$f":"IF(I79>2,\"99\",IF(I79<1,0,IF(I79=1,$C79+$C79-$C79,IF(I79=2,$C79+$D79))))","v":0},{"$f":"IF(J79>2,\"99\",IF(J79<1,0,IF(J79=1,$C79+$C79-$C79,IF(J79=2,$C79+$D79))))","v":0},{"$f":"IF(K79>2,\"99\",IF(K79<1,0,IF(K79=1,$C79+$C79-$C79,IF(K79=2,$C79+$D79))))","v":0},{"$f":"IF(L79>2,\"99\",IF(L79<1,0,IF(L79=1,$C79+$C79-$C79,IF(L79=2,$C79+$D79))))","v":0},{"$f":"IF(M79>2,\"99\",IF(M79<1,0,IF(M79=1,$C79+$C79-$C79,IF(M79=2,$C79+$D79))))","v":0},{"$f":"IF(N79>2,\"99\",IF(N79<1,0,IF(N79=1,$C79+$C79-$C79,IF(N79=2,$C79+$D79))))","v":0},{"$f":"IF(O79>2,\"99\",IF(O79<1,0,IF(O79=1,$C79+$C79-$C79,IF(O79=2,$C79+$D79))))","v":0},{"$f":"IF(P79>2,\"99\",IF(P79<1,0,IF(P79=1,$C79+$C79-$C79,IF(P79=2,$C79+$D79))))","v":0},{"$f":"IF(Q79>2,\"99\",IF(Q79<1,0,IF(Q79=1,$C79+$C79-$C79,IF(Q79=2,$C79+$D79))))","v":0},{"$f":"IF(R79>2,\"99\",IF(R79<1,0,IF(R79=1,$C79+$C79-$C79,IF(R79=2,$C79+$D79))))","v":0},{"$f":"IF(S79>2,\"99\",IF(S79<1,0,IF(S79=1,$C79+$C79-$C79,IF(S79=2,$C79+$D79))))","v":0},{"$f":"IF(T79>2,\"99\",IF(T79<1,0,IF(T79=1,$C79+$C79-$C79,IF(T79=2,$C79+$D79))))","v":0},{"$f":"IF(U79>2,\"99\",IF(U79<1,0,IF(U79=1,$C79+$C79-$C79,IF(U79=2,$C79+$D79))))","v":0},{"$f":"IF(V79>2,\"99\",IF(V79<1,0,IF(V79=1,$C79+$C79-$C79,IF(V79=2,$C79+$D79))))","v":0},{"$f":"IF(W79>2,\"99\",IF(W79<1,0,IF(W79=1,$C79+$C79-$C79,IF(W79=2,$C79+$D79))))","v":0},{"$f":"IF(X79>2,\"99\",IF(X79<1,0,IF(X79=1,$C79+$C79-$C79,IF(X79=2,$C79+$D79))))","v":0},{"$f":"IF(Y79>2,\"99\",IF(Y79<1,0,IF(Y79=1,$C79+$C79-$C79,IF(Y79=2,$C79+$D79))))","v":0},{"$f":"IF(Z79>2,\"99\",IF(Z79<1,0,IF(Z79=1,$C79+$C79-$C79,IF(Z79=2,$C79+$D79))))","v":0},{"$f":"IF(AA79>2,\"99\",IF(AA79<1,0,IF(AA79=1,$C79+$C79-$C79,IF(AA79=2,$C79+$D79))))","v":0},{"$f":"IF(AB79>2,\"99\",IF(AB79<1,0,IF(AB79=1,$C79+$C79-$C79,IF(AB79=2,$C79+$D79))))","v":0}]
["Defensive Technique",{"$f":"VLOOKUP(A80,AllaSkills!$A$3:$BV$319,'Ny NPC'!$A$2+3,FALSE)","v":"20"},{"$f":"IF(LEN(B80)=3,LEFT(B80,1),IF(LEN(B80)<3,B80,99))","v":"20"},{"$f":"IF(RIGHT(B80,1)=\"*\",LEFT(B80,1),IF(LEN(B80)=3,RIGHT(B80,1),IF(LEN(B80)<3,B80,RIGHT(B80,2))))","v":"20"},"Combat",null,null,null,null,null,null,null,null,null,null,null,null,null,null,null,null,null,null,null,null,null,null,null,0,{"$f":"IF(AC80<1,0,IF(AC80>30,60,IF(AC80>20,50+(AC80-20),IF(AC80>10,30+((AC80-10)*2),AC80*3))))","v":0},null,{"$f":"HLOOKUP(Yrke,Levelbonus!$B$1:$CR$20,5,FALSE)","v":0},null,null,null,null,0,0,0,0,0,0,0,0,0,0,0,0,0,0,0,0,0,0,0,0,0,0]
["Defensive Weaving",{"$f":"VLOOKUP(A81,AllaSkills!$A$3:$BV$319,'Ny NPC'!$A$2+3,FALSE)","v":"20"},{"$f":"IF(LEN(B81)=3,LEFT(B81,1),IF(LEN(B81)<3,B81,99))","v":"20"},{"$f":"IF(RIGHT(B81,1)=\"*\",LEFT(B81,1),IF(LEN(B81)=3,RIGHT(B81,1),IF(LEN(B81)<3,B81,RIGHT(B81,2))))","v":"20"},"Combat",null,null,null,null,null,null,null,null,null,null,null,null,null,null,null,null,null,null,null,null,null,null,null,0,{"$f":"IF(AC81<1,0,IF(AC81>30,60,IF(AC81>20,50+(AC81-20),IF(AC81>10,30+((AC81-10)*2),AC81*3))))","v":0},null,{"$f":"HLOOKUP(Yrke,Levelbonus!$B$1:$CR$20,5,FALSE)","v":0},null,null,null,null,0,0,0,0,0,0,0,0,0,0,0,0,0,0,0,0,0,0,0,0,0,0]
["Disarm, Armed",{"$f":"VLOOKUP(A82,AllaSkills!$A$3:$BV$319,'Ny NPC'!$A$2+3,FALSE)","v":"6"},{"$f":"IF(LEN(B82)=3,LEFT(B82,1),IF(LEN(B82)<3,B82,99))","v":"6"},{"$f":"IF(RIGHT(B82,1)=\"*\",LEFT(B82,1),IF(LEN(B82)=3,RIGHT(B82,1),IF(LEN(B82)<3,B82,RIGHT(B82,2))))","v":"6"},"Combat",null,null,null,null,null,null,null,null,null,null,null,null,null,null,null,null,null,null,null,null,null,null,null,{"$f":"SUM(F82:AB82)","v":0},{"$f":"IF(AC82<1,-25,IF(AC82>30,80+((AC82-30)*0.5),IF(AC82>20,70+(AC82-20),IF(AC82>10,50+((AC82-10)*2),AC82*5))))","v":-25},{"$f":"(AG+EQ)/2","v":5},{"$f":"HLOOKUP(Yrke,Levelbonus!$B$1:$CR$20,5,FALSE)","v":0},{"$f":"AF82*Level","v":0},{"$f":"IF(ISNUMBER(VLOOKUP($A82,Rasbonus!$A$61:$AM$295,MATCH(Ras,Rasbonus!$A$1:$AM$1,0),FALSE)),VLOOKUP($A82,Rasbonus!$A$61:$AM$295,MATCH(Ras,Rasbonus!$A$1:$AM$1,0),FALSE),\"0\")","v":"0"},null,null,-20,0,0,0,0,0,0,0,0,0,0,0,0,0,0,0,0,0,0,0,0,0]
["Disarm, Unarmed",{"$f":"VLOOKUP(A83,AllaSkills!$A$3:$BV$319,'Ny NPC'!$A$2+3,FALSE)","v":"9"},"9","9","Combat",null,null,null,null,null,null,null,null,null,null,null,null,null,null,null,null,null,null,null,null,null,null,null,0,-25,{"$f":"(AG+EQ)/2","v":5},{"$f":"HLOOKUP(Yrke,Levelbonus!$B$1:$CR$20,5,FALSE)","v":0},0,{"$f":"IF(ISNUMBER(VLOOKUP($A83,Rasbonus!$A$61:$AM$295,MATCH(Ras,Rasbonus!$A$1:$AM$1,0),FALSE)),VLOOKUP($A83,Rasbonus!$A$61:$AM$295,MATCH(Ras,Rasbonus!$A$1:$AM$1,0),FALSE),\"0\")","v":"0"},null,null,-20,0,0,0,0,0,0,0,0,0,0,0,0,0,0,0,0,0,0,0,0,0]
["Donning/Doffing Chain",{"$f":"VLOOKUP(A84,AllaSkills!$A$3:$BV$319,'Ny NPC'!$A$2+3,FALSE)","v":10},10,10,"Combat",null,null,null,null,null,null,null,null,null,null,null,null,null,null,null,null,null,null,null,null,null,null,null,0,-25,{"$f":"(AG+QU)/2","v":2.5},{"$f":"HLOOKUP(Yrke,Levelbonus!$B$1:$CR$20,5,FALSE)","v":0},0,{"$f":"IF(ISNUMBER(VLOOKUP($A84,Rasbonus!$A$61:$AM$295,MATCH(Ras,Rasbonus!$A$1:$AM$1,0),FALSE)),VLOOKUP($A84,Rasbonus!$A$61:$AM$295,MATCH(Ras,Rasbonus!$A$1:$AM$1,0),FALSE),\"0\")","v":"0"},null,null,-23,0,0,0,0,0,0,0,0,0,0,0,0,0,0,0,0,0,0,0,0,0]
["Donning/Doffing Plate",{"$f":"VLOOKUP(A85,AllaSkills!$A$3:$BV$319,'Ny NPC'!$A$2+3,FALSE)","v":11},11,11,"Combat",null,null,null,null,null,null,null,null,null,null,null,null,null,null,null,null,null,null,null,null,null,null,null,0,-25,{"$f":"(AG+QU)/2","v":2.5},{"$f":"HLOOKUP(Yrke,Levelbonus!$B$1:$CR$20,5,FALSE)","v":0},0,{"$f":"IF(ISNUMBER(VLOOKUP($A85,Rasbonus!$A$61:$AM$295,MATCH(Ras,Rasbonus!$A$1:$AM$1,0),FALSE)),VLOOKUP($A85,Rasbonus!$A$61:$AM$295,MATCH(Ras,Rasbonus!$A$1:$AM$1,0),FALSE),\"0\")","v":"0"},null,null,-23,0,0,0,0,0,0,0,0,0,0,0,0,0,0,0,0,0,0,0,0,0]
["Donning/Doffing RL",{"$f":"VLOOKUP(A86,AllaSkills!$A$3:$BV$319,'Ny NPC'!$A$2+3,FALSE)","v":9},9,9,"Combat",null,null,null,null,null,null,null,null,null,null,null,null,null,null,null,null,null,null,null,null,null,null,null,0,-25,{"$f":"(AG+QU)/2","v":2.5},{"$f":"HLOOKUP(Yrke,Levelbonus!$B$1:$CR$20,5,FALSE)","v":0},0,{"$f":"IF(ISNUMBER(VLOOKUP($A86,Rasbonus!$A$61:$AM$295,MATCH(Ras,Rasbonus!$A$1:$AM$1,0),FALSE)),VLOOKUP($A86,Rasbonus!$A$61:$AM$295,MATCH(Ras,Rasbonus!$A$1:$AM$1,0),FALSE),\"0\")","v":"0"},null,null,{"$f":"ROUND(AD86+AE86+AG86+AH86+AI86+AJ86,0)","v":-23},0,0,0,0,0,0,0,0,0,0,0,0,0,0,0,0,0,0,0,0,0]
["Donning/Doffing SL",{"$f":"VLOOKUP(A87,AllaSkills!$A$3:$BV$319,'Ny NPC'!$A$2+3,FALSE)","v":9},9,9,"Combat",null,null,null,null,null,null,null,null,null,null,null,null,null,null,null,null,null,null,null,null,null,null,null,0,-25,{"$f":"(AG+QU)/2","v":2.5},{"$f":"HLOOKUP(Yrke,Levelbonus!$B$1:$CR$20,5,FALSE)","v":0},0,{"$f":"IF(ISNUMBER(VLOOKUP($A87,Rasbonus!$A$61:$AM$295,MATCH(Ras,Rasbonus!$A$1:$AM$1,0),FALSE)),VLOOKUP($A87,Rasbonus!$A$61:$AM$295,MATCH(Ras,Rasbonus!$A$1:$AM$1,0),FALSE),\"0\")","v":"0"},null,null,-23,0,0,0,0,0,0,0,0,0,0,0,0,0,0,0,0,0,0,0,0,0]
["Expertise",{"$f":"VLOOKUP(A88,AllaSkills!$A$3:$BV$319,'Ny NPC'!$A$2+3,FALSE)","v":"20"},"20","20","Combat",null,null,null,null,null,null,null,null,null,null,null,null,null,null,null,null,null,null,null,null,null,null,null,0,null,null,{"$f":"HLOOKUP(Yrke,Levelbonus!$B$1:$CR$20,5,FALSE)","v":0},null,null,null,null,{"$f":"ROUND(AC88+AD88+AE88+AG88+AH88+AI88+AJ88,0)","v":0},0,0,0,0,0,0,0,0,0,0,0,0,0,0,0,0,0,0,0,0,0]
["Feinting",{"$f":"VLOOKUP(A89,AllaSkills!$A$3:$BV$319,'Ny NPC'!$A$2+3,FALSE)","v":"6"},"6","6","Combat",null,null,null,null,null,null,null,null,null,null,null,null,null,null,null,null,null,null,null,null,null,null,null,0,-25,{"$f":"(QU+PR)/2","v":5},{"$f":"HLOOKUP(Yrke,Levelbonus!$B$1:$CR$20,5,FALSE)","v":0},0,{"$f":"IF(ISNUMBER(VLOOKUP($A89,Rasbonus!$A$61:$AM$295,MATCH(Ras,Rasbonus!$A$1:$AM$1,0),FALSE)),VLOOKUP($A89,Rasbonus!$A$61:$AM$295,MATCH(Ras,Rasbonus!$A$1:$AM$1,0),FALSE),\"0\")","v":"0"},{"$f":"'Ny NPC'!$N$3","v":"0"},null,-20,0,0,0,0,0,0,0,0,0,0,0,0,0,0,0,0,0,0,0,0,0]
["Grappling Hook",{"$f":"VLOOKUP(A90,AllaSkills!$A$3:$BV$319,'Ny NPC'!$A$2+3,FALSE)","v":"3"},"3","3","Combat",null,null,null,null,null,null,null,null,null,null,null,null,null,null,null,null,null,null,null,null,null,null,null,0,-25,{"$f":"AG","v":5},{"$f":"HLOOKUP(Yrke,Levelbonus!$B$1:$CR$20,5,FALSE)","v":0},0,{"$f":"IF(ISNUMBER(VLOOKUP($A90,Rasbonus!$A$61:$AM$295,MATCH(Ras,Rasbonus!$A$1:$AM$1,0),FALSE)),VLOOKUP($A90,Rasbonus!$A$61:$AM$295,MATCH(Ras,Rasbonus!$A$1:$AM$1,0),FALSE),\"0\")","v":"0"},{"$f":"'Ny NPC'!$AC$62","v":0},null,-20,0,0,0,0,0,0,0,0,0,0,0,0,0,0,0,0,0,0,0,0,0]
["Honing",{"$f":"VLOOKUP(A91,AllaSkills!$A$3:$BV$319,'Ny NPC'!$A$2+3,FALSE)","v":"20"},"20","20","Combat",null,null,null,null,null,null,null,null,null,null,null,null,null,null,null,null,null,null,null,null,null,null,null,0,-25,{"$f":"(AG+EM)/2","v":5},{"$f":"HLOOKUP(Yrke,Levelbonus!$B$1:$CR$20,5,FALSE)","v":0},0,{"$f":"IF(ISNUMBER(VLOOKUP($A91,Rasbonus!$A$61:$AM$295,MATCH(Ras,Rasbonus!$A$1:$AM$1,0),FALSE)),VLOOKUP($A91,Rasbonus!$A$61:$AM$295,MATCH(Ras,Rasbonus!$A$1:$AM$1,0),FALSE),\"0\")","v":"0"},null,null,-20,0,0,0,0,0,0,0,0,0,0,0,0,0,0,0,0,0,0,0,0,0]
["Iai",{"$f":"VLOOKUP(A92,AllaSkills!$A$3:$BV$319,'Ny NPC'!$A$2+3,FALSE)","v":"15"},"15","15","Combat",null,null,null,null,null,null,null,null,null,null,null,null,null,null,null,null,null,null,null,null,null,null,null,0,-25,{"$f":"(QU+EQ)/2","v":2.5},{"$f":"HLOOKUP(Yrke,Levelbonus!$B$1:$CR$20,5,FALSE)","v":0},0,{"$f":"IF(ISNUMBER(VLOOKUP($A92,Rasbonus!$A$61:$AM$295,MATCH(Ras,Rasbonus!$A$1:$AM$1,0),FALSE)),VLOOKUP($A92,Rasbonus!$A$61:$AM$295,MATCH(Ras,Rasbonus!$A$1:$AM$1,0),FALSE),\"0\")","v":"0"},{"$f":"'Ny NPC'!$N$3","v":"0"},null,-23,0,0,0,0,0,0,0,0,0,0,0,0,0,0,0,0,0,0,0,0,0]
["Instinctive Maneuver",{"$f":"VLOOKUP(A93,AllaSkills!$A$3:$BV$319,'Ny NPC'!$A$2+3,FALSE)","v":"6"},"6","6","Combat",null,null,null,null,null,null,null,null,null,null,null,null,null,null,null,null,null,null,null,null,null,null,null,0,-25,{"$f":"(QU+EQ)/2","v":2.5},{"$f":"HLOOKUP(Yrke,Levelbonus!$B$1:$CR$20,5,FALSE)","v":0},0,{"$f":"IF(ISNUMBER(VLOOKUP($A93,Rasbonus!$A$61:$AM$295,MATCH(Ras,Rasbonus!$A$1:$AM$1,0),FALSE)),VLOOKUP($A93,Rasbonus!$A$61:$AM$295,MATCH(Ras,Rasbonus!$A$1:$AM$1,0),FALSE),\"0\")","v":"0"},null,null,-23,0,0,0,0,0,0,0,0,0,0,0,0,0,0,0,0,0,0,0,0,0]
["Lancing",{"$f":"VLOOKUP(A94,AllaSkills!$A$3:$BV$319,'Ny NPC'!$A$2+3,FALSE)","v":"18"},"18","18","Combat",null,null,null,null,null,null,null,null,null,null,null,null,null,null,null,null,null,null,null,null,null,null,null,0,-25,{"$f":"(ST+AG)/2","v":12.5},{"$f":"HLOOKUP(Yrke,Levelbonus!$B$1:$CR$20,5,FALSE)","v":0},0,{"$f":"IF(ISNUMBER(VLOOKUP($A94,Rasbonus!$A$61:$AM$295,MATCH(Ras,Rasbonus!$A$1:$AM$1,0),FALSE)),VLOOKUP($A94,Rasbonus!$A$61:$AM$295,MATCH(Ras,Rasbonus!$A$1:$AM$1,0),FALSE),\"0\")","v":"0"},null,null,-13,0,0,0,0,0,0,0,0,0,0,0,0,0,0,0,0,0,0,0,0,0]
["Melee Scuffle",{"$f":"VLOOKUP(A95,AllaSkills!$A$3:$BV$319,'Ny NPC'!$A$2+3,FALSE)","v":"8"},"8","8","Combat",null,null,null,null,null,null,null,null,null,null,null,null,null,null,null,null,null,null,null,null,null,null,null,0,-25,{"$f":"(ST+AG)/2","v":12.5},{"$f":"HLOOKUP(Yrke,Levelbonus!$B$1:$CR$20,5,FALSE)","v":0},0,{"$f":"IF(ISNUMBER(VLOOKUP($A95,Rasbonus!$A$61:$AM$295,MATCH(Ras,Rasbonus!$A$1:$AM$1,0),FALSE)),VLOOKUP($A95,Rasbonus!$A$61:$AM$295,MATCH(Ras,Rasbonus!$A$1:$AM$1,0),FALSE),\"0\")","v":20},{"$f":"'Ny NPC'!$AC$63","v":0},null,8,0,0,0,0,0,0,0,0,0,0,0,0,0,0,0,0,0,0,0,0,0]
["Missile Artillery",{"$f":"VLOOKUP(A96,AllaSkills!$A$3:$BV$319,'Ny NPC'!$A$2+3,FALSE)","v":"3/6"},"3","6","Combat",null,null,null,null,null,null,null,null,null,null,null,null,null,null,null,null,null,null,null,null,null,null,null,0,-25,{"$f":"(IN+AG)/2","v":5},{"$f":"HLOOKUP(Yrke,Levelbonus!$B$1:$CR$20,5,FALSE)","v":0},0,{"$f":"IF(ISNUMBER(VLOOKUP($A96,Rasbonus!$A$61:$AM$295,MATCH(Ras,Rasbonus!$A$1:$AM$1,0),FALSE)),VLOOKUP($A96,Rasbonus!$A$61:$AM$295,MATCH(Ras,Rasbonus!$A$1:$AM$1,0),FALSE),\"0\")","v":"0"},null,null,-20,0,0,0,0,0,0,0,0,0,0,0,0,0,0,0,0,0,0,0,0,0]
["SeaBorn Combat",{"$f":"VLOOKUP(A97,AllaSkills!$A$3:$BV$319,'Ny NPC'!$A$2+3,FALSE)","v":"3"},"3","3","Combat",null,null,null,null,null,null,null,null,null,null,null,null,null,null,null,null,null,null,null,null,null,null,null,0,-25,{"$f":"(AG+AG+EQ)/3","v":5},{"$f":"HLOOKUP(Yrke,Levelbonus!$B$1:$CR$20,5,FALSE)","v":0},0,{"$f":"IF(ISNUMBER(VLOOKUP($A97,Rasbonus!$A$61:$AM$295,MATCH(Ras,Rasbonus!$A$1:$AM$1,0),FALSE)),VLOOKUP($A97,Rasbonus!$A$61:$AM$295,MATCH(Ras,Rasbonus!$A$1:$AM$1,0),FALSE),\"0\")","v":"0"},{"$f":"'Ny NPC'!$N$3","v":"0"},null,-20,0,0,0,0,0,0,0,0,0,0,0,0,0,0,0,0,0,0,0,0,0]
["Shield Bash",{"$f":"VLOOKUP(A98,AllaSkills!$A$3:$BV$319,'Ny NPC'!$A$2+3,FALSE)","v":"20"},"20","20","Combat",null,null,null,null,null,null,null,null,null,null,null,null,null,null,null,null,null,null,null,null,null,null,null,0,-25,{"$f":"(ST+ST+AG)/3","v":15},{"$f":"HLOOKUP(Yrke,Levelbonus!$B$1:$CR$20,5,FALSE)","v":0},0,{"$f":"IF(ISNUMBER(VLOOKUP($A98,Rasbonus!$A$61:$AM$295,MATCH(Ras,Rasbonus!$A$1:$AM$1,0),FALSE)),VLOOKUP($A98,Rasbonus!$A$61:$AM$295,MATCH(Ras,Rasbonus!$A$1:$AM$1,0),FALSE),\"0\")","v":"0"},null,null,-10,0,0,0,0,0,0,0,0,0,0,0,0,0,0,0,0,0,0,0,0,0]
["Shield Expertise",{"$f":"VLOOKUP(A99,AllaSkills!$A$3:$BV$319,'Ny NPC'!$A$2+3,FALSE)","v":"20"},"20",{"$f":"IF(RIGHT(B99,1)=\"*\",LEFT(B99,1),IF(LEN(B99)=3,RIGHT(B99,1),IF(LEN(B99)<3,B99,RIGHT(B99,2))))","v":"20"},"Combat",null,null,null,null,null,null,null,null,null,null,null,null,null,null,null,null,null,null,null,null,null,null,null,0,null,null,{"$f":"HLOOKUP(Yrke,Levelbonus!$B$1:$CR$20,5,FALSE)","v":0},null,null,null,null,{"$f":"ROUND(AC99+AD99+AE99+AG99+AH99+AI99+AJ99,0)","v":0},0,0,0,0,0,0,0,0,0,0,0,0,0,0,0,0,0,0,0,0,0]
["Stunned Maneuver",{"$f":"VLOOKUP(A100,AllaSkills!$A$3:$BV$319,'Ny NPC'!$A$2+3,FALSE)","v":"4"},"4","4","Combat",null,null,null,null,null,null,null,null,null,null,null,null,null,null,null,null,null,null,null,null,null,null,null,0,-25,{"$f":"SD","v":5},{"$f":"HLOOKUP(Yrke,Levelbonus!$B$1:$CR$20,5,FALSE)","v":0},0,{"$f":"IF(ISNUMBER(VLOOKUP($A100,Rasbonus!$A$61:$AM$295,MATCH(Ras,Rasbonus!$A$1:$AM$1,0),FALSE)),VLOOKUP($A100,Rasbonus!$A$61:$AM$295,MATCH(Ras,Rasbonus!$A$1:$AM$1,0),FALSE),\"0\")","v":"0"},null,null,-20,0,0,0,0,0,0,0,0,0,0,0,0,0,0,0,0,0,0,0,0,0]
["Subduing",{"$f":"VLOOKUP(A101,AllaSkills!$A$3:$BV$319,'Ny NPC'!$A$2+3,FALSE)","v":"6"},"6","6","Combat",null,null,null,null,null,null,null,null,null,null,null,null,null,null,null,null,null,null,null,null,null,null,null,0,-25,{"$f":"(AG+QU)/2","v":2.5},{"$f":"HLOOKUP(Yrke,Levelbonus!$B$1:$CR$20,5,FALSE)","v":0},0,{"$f":"IF(ISNUMBER(VLOOKUP($A101,Rasbonus!$A$61:$AM$295,MATCH(Ras,Rasbonus!$A$1:$AM$1,0),FALSE)),VLOOKUP($A101,Rasbonus!$A$61:$AM$295,MATCH(Ras,Rasbonus!$A$1:$AM$1,0),FALSE),\"0\")","v":"0"},null,null,-23,0,0,0,0,0,0,0,0,0,0,0,0,0,0,0,0,0,0,0,0,0]
["Tackling",{"$f":"VLOOKUP(A102,AllaSkills!$A$3:$BV$319,'Ny NPC'!$A$2+3,FALSE)","v":"9"},"9","9","Combat",null,null,null,null,null,null,null,null,null,null,null,null,null,null,null,null,null,null,null,null,null,null,null,0,-25,{"$f":"(ST+AG)/2","v":12.5},{"$f":"HLOOKUP(Yrke,Levelbonus!$B$1:$CR$20,5,FALSE)","v":0},0,{"$f":"IF(ISNUMBER(VLOOKUP($A102,Rasbonus!$A$61:$AM$295,MATCH(Ras,Rasbonus!$A$1:$AM$1,0),FALSE)),VLOOKUP($A102,Rasbonus!$A$61:$AM$295,MATCH(Ras,Rasbonus!$A$1:$AM$1,0),FALSE),\"0\")","v":20},{"$f":"'Ny NPC'!$AC$63","v":0},null,8,0,0,0,0,0,0,0,0,0,0,0,0,0,0,0,0,0,0,0,0,0]
["Unarmed Expertise",{"$f":"VLOOKUP(A103,AllaSkills!$A$3:$BV$319,'Ny NPC'!$A$2+3,FALSE)","v":"9"},"9",{"$f":"IF(RIGHT(B103,1)=\"*\",LEFT(B103,1),IF(LEN(B103)=3,RIGHT(B103,1),IF(LEN(B103)<3,B103,RIGHT(B103,2))))","v":"9"},"Combat",null,null,null,null,null,null,null,null,null,null,null,null,null,null,null,null,null,null,null,null,null,null,null,{"$f":"SUM(F103:AB103)","v":0},-25,{"$f":"(ST+AG+EQ)/3","v":10},{"$f":"HLOOKUP(Yrke,Levelbonus!$B$1:$CR$20,5,FALSE)","v":0},0,{"$f":"IF(ISNUMBER(VLOOKUP($A103,Rasbonus!$A$61:$AM$295,MATCH(Ras,Rasbonus!$A$1:$AM$1,0),FALSE)),VLOOKUP($A103,Rasbonus!$A$61:$AM$295,MATCH(Ras,Rasbonus!$A$1:$AM$1,0),FALSE),\"0\")","v":"0"},{"$f":"'Ny NPC'!$N$3","v":"0"},null,-15,0,0,0,0,0,0,0,0,0,0,0,0,0,0,0,0,0,0,0,0,0]
["Weapon Brawling",{"$f":"VLOOKUP(A104,AllaSkills!$A$3:$BV$319,'Ny NPC'!$A$2+3,FALSE)","v":"9"},"9","9","Combat",null,null,null,null,null,null,null,null,null,null,null,null,null,null,null,null,null,null,null,null,null,null,null,0,-25,{"$f":"(ST+AG+QU)/3","v":8.3333333333333339},{"$f":"HLOOKUP(Yrke,Levelbonus!$B$1:$CR$20,5,FALSE)","v":0},0,{"$f":"IF(ISNUMBER(VLOOKUP($A104,Rasbonus!$A$61:$AM$295,MATCH(Ras,Rasbonus!$A$1:$AM$1,0),FALSE)),VLOOKUP($A104,Rasbonus!$A$61:$AM$295,MATCH(Ras,Rasbonus!$A$1:$AM$1,0),FALSE),\"0\")","v":"0"},null,null,-17,0,0,0,0,0,0,0,0,0,0,0,0,0,0,0,0,0,0,0,0,0]
["Weapon Kata",{"$f":"VLOOKUP(A105,AllaSkills!$A$3:$BV$319,'Ny NPC'!$A$2+3,FALSE)","v":"9"},"9","9","Combat",null,null,null,null,null,null,null,null,null,null,null,null,null,null,null,null,null,null,null,null,null,null,null,0,-25,{"$f":"(ST+AG+EQ)/3","v":10},{"$f":"HLOOKUP(Yrke,Levelbonus!$B$1:$CR$20,5,FALSE)","v":0},0,{"$f":"IF(ISNUMBER(VLOOKUP($A105,Rasbonus!$A$61:$AM$295,MATCH(Ras,Rasbonus!$A$1:$AM$1,0),FALSE)),VLOOKUP($A105,Rasbonus!$A$61:$AM$295,MATCH(Ras,Rasbonus!$A$1:$AM$1,0),FALSE),\"0\")","v":"0"},{"$f":"'Ny NPC'!$N$3","v":"0"},null,-15,0,0,0,0,0,0,0,0,0,0,0,0,0,0,0,0,0,0,0,0,0]
["Yado",{"$f":"VLOOKUP(A106,AllaSkills!$A$3:$BV$319,'Ny NPC'!$A$2+3,FALSE)","v":"6"},{"$f":"IF(LEN(B106)=3,LEFT(B106,1),IF(LEN(B106)<3,B106,99))","v":"6"},{"$f":"IF(RIGHT(B106,1)=\"*\",LEFT(B106,1),IF(LEN(B106)=3,RIGHT(B106,1),IF(LEN(B106)<3,B106,RIGHT(B106,2))))","v":"6"},"Combat",null,null,null,null,null,null,null,null,null,null,null,null,null,null,null,null,null,null,null,null,null,null,null,{"$f":"SUM(F106:AB106)","v":0},{"$f":"IF(AC106<1,-25,IF(AC106>30,80+((AC106-30)*0.5),IF(AC106>20,70+(AC106-20),IF(AC106>10,50+((AC106-10)*2),AC106*5))))","v":-25},{"$f":"(QU+AG)/2","v":2.5},{"$f":"HLOOKUP(Yrke,Levelbonus!$B$1:$CR$20,5,FALSE)","v":0},{"$f":"AF106*Level","v":0},{"$f":"IF(ISNUMBER(VLOOKUP($A106,Rasbonus!$A$61:$AM$295,MATCH(Ras,Rasbonus!$A$1:$AM$1,0),FALSE)),VLOOKUP($A106,Rasbonus!$A$61:$AM$295,MATCH(Ras,Rasbonus!$A$1:$AM$1,0),FALSE),\"0\")","v":"0"},{"$f":"'Ny NPC'!$N$3","v":"0"},null,{"$f":"ROUND(AD106+AE106+AG106+AH106+AI106+AJ106,0)","v":-23},0,0,0,0,0,0,0,0,0,0,0,0,0,0,0,0,0,0,0,0,0]
[]
["Silent Kill",{"$f":"VLOOKUP(A108,AllaSkills!$A$3:$BV$319,'Ny NPC'!$A$2+3,FALSE)","v":"6"},{"$f":"IF(LEN(B108)=3,LEFT(B108,1),IF(LEN(B108)<3,B108,99))","v":"6"},{"$f":"IF(RIGHT(B108,1)=\"*\",LEFT(B108,1),IF(LEN(B108)=3,RIGHT(B108,1),IF(LEN(B108)<3,B108,RIGHT(B108,2))))","v":"6"},"Deadly",null,null,null,null,null,null,null,null,null,null,null,null,null,null,null,null,null,null,null,null,null,null,null,{"$f":"SUM(F108:AB108)","v":0},{"$f":"IF(AC108<1,-25,IF(AC108>30,80+((AC108-30)*0.5),IF(AC108>20,70+(AC108-20),IF(AC108>10,50+((AC108-10)*2),AC108*5))))","v":-25},{"$f":"AG","v":5},{"$f":"HLOOKUP(Yrke,Levelbonus!$B$1:$CR$20,7,FALSE)","v":0},{"$f":"AF108*Level","v":0},{"$f":"IF(ISNUMBER(VLOOKUP($A108,Rasbonus!$A$61:$AM$295,MATCH(Ras,Rasbonus!$A$1:$AM$1,0),FALSE)),VLOOKUP($A108,Rasbonus!$A$61:$AM$295,MATCH(Ras,Rasbonus!$A$1:$AM$1,0),FALSE),\"0\")","v":"0"},{"$f":"'Ny NPC'!$N$3","v":"0"},null,{"$f":"ROUND(AD108+AE108+AG108+AH108+AI108+AJ108,0)","v":-20},{"$f":"IF(F108>2,\"99\",IF(F108<1,0,IF(F108=1,$C108+$C108-$C108,IF(F108=2,$C108+$D108))))","v":0},{"$f":"IF(I108>2,\"99\",IF(I108<1,0,IF(I108=1,$C108+$C108-$C108,IF(I108=2,$C108+$D108))))","v":0},0,0,0,0,0,0,0,0,0,{"$f":"IF(S108>2,\"99\",IF(S108<1,0,IF(S108=1,$C108+$C108-$C108,IF(S108=2,$C108+$D108))))","v":0},0,0,0,0,0,0,0,0,0]
["Use/Remove Poison",{"$f":"VLOOKUP(A109,AllaSkills!$A$3:$BV$319,'Ny NPC'!$A$2+3,FALSE)","v":"1/4"},{"$f":"IF(LEN(B109)=3,LEFT(B109,1),IF(LEN(B109)<3,B109,99))","v":"1"},{"$f":"IF(RIGHT(B109,1)=\"*\",LEFT(B109,1),IF(LEN(B109)=3,RIGHT(B109,1),IF(LEN(B109)<3,B109,RIGHT(B109,2))))","v":"4"},"Deadly",null,null,null,null,null,null,null,null,null,null,null,null,null,null,null,null,null,null,null,null,null,null,null,{"$f":"SUM(F109:AB109)","v":0},{"$f":"IF(AC109<1,-25,IF(AC109>30,80+((AC109-30)*0.5),IF(AC109>20,70+(AC109-20),IF(AC109>10,50+((AC109-10)*2),AC109*5))))","v":-25},{"$f":"(AG+IN)/2","v":5},{"$f":"HLOOKUP(Yrke,Levelbonus!$B$1:$CR$20,7,FALSE)","v":0},{"$f":"AF109*Level","v":0},{"$f":"IF(ISNUMBER(VLOOKUP($A109,Rasbonus!$A$61:$AM$295,MATCH(Ras,Rasbonus!$A$1:$AM$1,0),FALSE)),VLOOKUP($A109,Rasbonus!$A$61:$AM$295,MATCH(Ras,Rasbonus!$A$1:$AM$1,0),FALSE),\"0\")","v":"0"},null,null,{"$f":"ROUND(AD109+AE109+AG109+AH109+AI109+AJ109,0)","v":-20},{"$f":"IF(F109>2,\"99\",IF(F109<1,0,IF(F109=1,$C109+$C109-$C109,IF(F109=2,$C109+$D109))))","v":0},0,0,0,0,0,0,0,0,0,0,0,0,0,0,0,0,0,0,0,0]
[]
["Concentration",{"$f":"HLOOKUP(Diverse!$G$2,'2nd'!$B$1:$CR$18,6,FALSE)","v":1},null,null,null,{"$f":"SUM(AL112:AL129)","v":0},{"$f":"SUM(AM112:AM129)","v":0},null,{"$f":"SUM(AM112:AM129)","v":0},{"$f":"SUM(AN112:AN129)","v":0},0,0,0,0,0,0,0,0,0,0,0,0,0,0,0,0,0,0,"Rank","Skill","Stat",null,"Lvl","Race","Armor","Item","Total"]
["AM Quickdraw",{"$f":"VLOOKUP(A112,AllaSkills!$A$3:$BV$319,'Ny NPC'!$A$2+3,FALSE)","v":"4"},"4","4","Concentration",null,null,null,null,null,null,null,null,null,null,null,null,null,null,null,null,null,null,null,null,null,null,null,0,-25,{"$f":"(AG+EQ)/2","v":5},{"$f":"HLOOKUP(Yrke,Levelbonus!$B$1:$CR$20,6,FALSE)","v":0},0,{"$f":"IF(ISNUMBER(VLOOKUP($A112,Rasbonus!$A$61:$AM$295,MATCH(Ras,Rasbonus!$A$1:$AM$1,0),FALSE)),VLOOKUP($A112,Rasbonus!$A$61:$AM$295,MATCH(Ras,Rasbonus!$A$1:$AM$1,0),FALSE),\"0\")","v":"0"},{"$f":"'Ny NPC'!$N$3","v":"0"},null,-20,{"$f":"IF(F112>2,\"99\",IF(F112<1,0,IF(F112=1,$C112+$C112-$C112,IF(F112=2,$C112+$D112))))","v":0},{"$f":"IF(I112>2,\"99\",IF(I112<1,0,IF(I112=1,$C112+$C112-$C112,IF(I112=2,$C112+$D112))))","v":0},{"$f":"IF(J112>2,\"99\",IF(J112<1,0,IF(J112=1,$C112+$C112-$C112,IF(J112=2,$C112+$D112))))","v":0},{"$f":"IF(K112>2,\"99\",IF(K112<1,0,IF(K112=1,$C112+$C112-$C112,IF(K112=2,$C112+$D112))))","v":0},{"$f":"IF(L112>2,\"99\",IF(L112<1,0,IF(L112=1,$C112+$C112-$C112,IF(L112=2,$C112+$D112))))","v":0},{"$f":"IF(M112>2,\"99\",IF(M112<1,0,IF(M112=1,$C112+$C112-$C112,IF(M112=2,$C112+$D112))))","v":0},{"$f":"IF(N112>2,\"99\",IF(N112<1,0,IF(N112=1,$C112+$C112-$C112,IF(N112=2,$C112+$D112))))","v":0},{"$f":"IF(O112>2,\"99\",IF(O112<1,0,IF(O112=1,$C112+$C112-$C112,IF(O112=2,$C112+$D112))))","v":0},{"$f":"IF(P112>2,\"99\",IF(P112<1,0,IF(P112=1,$C112+$C112-$C112,IF(P112=2,$C112+$D112))))","v":0},{"$f":"IF(Q112>2,\"99\",IF(Q112<1,0,IF(Q112=1,$C112+$C112-$C112,IF(Q112=2,$C112+$D112))))","v":0},{"$f":"IF(R112>2,\"99\",IF(R112<1,0,IF(R112=1,$C112+$C112-$C112,IF(R112=2,$C112+$D112))))","v":0},{"$f":"IF(S112>2,\"99\",IF(S112<1,0,IF(S112=1,$C112+$C112-$C112,IF(S112=2,$C112+$D112))))","v":0},{"$f":"IF(T112>2,\"99\",IF(T112<1,0,IF(T112=1,$C112+$C112-$C112,IF(T112=2,$C112+$D112))))","v":0},{"$f":"IF(U112>2,\"99\",IF(U112<1,0,IF(U112=1,$C112+$C112-$C112,IF(U112=2,$C112+$D112))))","v":0},{"$f":"IF(V112>2,\"99\",IF(V112<1,0,IF(V112=1,$C112+$C112-$C112,IF(V112=2,$C112+$D112))))","v":0},{"$f":"IF(W112>2,\"99\",IF(W112<1,0,IF(W112=1,$C112+$C112-$C112,IF(W112=2,$C112+$D112))))","v":0},{"$f":"IF(X112>2,\"99\",IF(X112<1,0,IF(X112=1,$C112+$C112-$C112,IF(X112=2,$C112+$D112))))","v":0},{"$f":"IF(Y112>2,\"99\",IF(Y112<1,0,IF(Y112=1,$C112+$C112-$C112,IF(Y112=2,$C112+$D112))))","v":0},{"$f":"IF(Z112>2,\"99\",IF(Z112<1,0,IF(Z112=1,$C112+$C112-$C112,IF(Z112=2,$C112+$D112))))","v":0},{"$f":"IF(AA112>2,\"99\",IF(AA112<1,0,IF(AA112=1,$C112+$C112-$C112,IF(AA112=2,$C112+$D112))))","v":0},{"$f":"IF(AB112>2,\"99\",IF(AB112<1,0,IF(AB112=1,$C112+$C112-$C112,IF(AB112=2,$C112+$D112))))","v":0}]
["Blind Fighting",{"$f":"VLOOKUP(A113,AllaSkills!$A$3:$BV$319,'Ny NPC'!$A$2+3,FALSE)","v":"10"},"10","10","Concentration",null,null,null,null,null,null,null,null,null,null,null,null,null,null,null,null,null,null,null,null,null,null,null,0,-25,{"$f":"(RE+EM)/2","v":5},{"$f":"HLOOKUP(Yrke,Levelbonus!$B$1:$CR$20,6,FALSE)","v":0},0,{"$f":"IF(ISNUMBER(VLOOKUP($A113,Rasbonus!$A$61:$AM$295,MATCH(Ras,Rasbonus!$A$1:$AM$1,0),FALSE)),VLOOKUP($A113,Rasbonus!$A$61:$AM$295,MATCH(Ras,Rasbonus!$A$1:$AM$1,0),FALSE),\"0\")","v":"0"},null,null,-20,0,0,0,0,0,0,0,0,0,0,0,0,0,0,0,0,0,0,0,0,0]
["Body Damage Stabilization",{"$f":"VLOOKUP(A114,AllaSkills!$A$3:$BV$319,'Ny NPC'!$A$2+3,FALSE)","v":"3/5"},"3","5","Concentration",null,null,null,null,null,null,null,null,null,null,null,null,null,null,null,null,null,null,null,null,null,null,null,0,-25,{"$f":"(SD+EM)/2","v":5},{"$f":"HLOOKUP(Yrke,Levelbonus!$B$1:$CR$20,6,FALSE)","v":0},0,{"$f":"IF(ISNUMBER(VLOOKUP($A114,Rasbonus!$A$61:$AM$295,MATCH(Ras,Rasbonus!$A$1:$AM$1,0),FALSE)),VLOOKUP($A114,Rasbonus!$A$61:$AM$295,MATCH(Ras,Rasbonus!$A$1:$AM$1,0),FALSE),\"0\")","v":"0"},null,null,-20,0,0,0,0,0,0,0,0,0,0,0,0,0,0,0,0,0,0,0,0,0]
["Control Lycantrophy",{"$f":"VLOOKUP(A115,AllaSkills!$A$3:$BV$319,'Ny NPC'!$A$2+3,FALSE)","v":"3/6"},"3","6","Concentration",null,null,null,null,null,null,null,null,null,null,null,null,null,null,null,null,null,null,null,null,null,null,null,0,-25,{"$f":"SD","v":5},{"$f":"HLOOKUP(Yrke,Levelbonus!$B$1:$CR$20,6,FALSE)","v":0},0,{"$f":"IF(ISNUMBER(VLOOKUP($A115,Rasbonus!$A$61:$AM$295,MATCH(Ras,Rasbonus!$A$1:$AM$1,0),FALSE)),VLOOKUP($A115,Rasbonus!$A$61:$AM$295,MATCH(Ras,Rasbonus!$A$1:$AM$1,0),FALSE),\"0\")","v":"0"},null,null,-20,0,0,0,0,0,0,0,0,0,0,0,0,0,0,0,0,0,0,0,0,0]
["Dowsing",{"$f":"VLOOKUP(A116,AllaSkills!$A$3:$BV$319,'Ny NPC'!$A$2+3,FALSE)","v":"2/5"},"2","5","Concentration",null,null,null,null,null,null,null,null,null,null,null,null,null,null,null,null,null,null,null,null,null,null,null,0,-25,{"$f":"EM","v":5},{"$f":"HLOOKUP(Yrke,Levelbonus!$B$1:$CR$20,6,FALSE)","v":0},0,{"$f":"IF(ISNUMBER(VLOOKUP($A116,Rasbonus!$A$61:$AM$295,MATCH(Ras,Rasbonus!$A$1:$AM$1,0),FALSE)),VLOOKUP($A116,Rasbonus!$A$61:$AM$295,MATCH(Ras,Rasbonus!$A$1:$AM$1,0),FALSE),\"0\")","v":"0"},null,null,-20,0,0,0,0,0,0,0,0,0,0,0,0,0,0,0,0,0,0,0,0,0]
["Frenzy",{"$f":"VLOOKUP(A117,AllaSkills!$A$3:$BV$319,'Ny NPC'!$A$2+3,FALSE)","v":"6"},"6","6","Concentration",null,null,null,null,null,null,null,null,null,null,null,null,null,null,null,null,null,null,null,null,null,null,null,0,-25,{"$f":"(EM+SD)/2","v":5},{"$f":"HLOOKUP(Yrke,Levelbonus!$B$1:$CR$20,6,FALSE)","v":0},0,{"$f":"IF(ISNUMBER(VLOOKUP($A117,Rasbonus!$A$61:$AM$295,MATCH(Ras,Rasbonus!$A$1:$AM$1,0),FALSE)),VLOOKUP($A117,Rasbonus!$A$61:$AM$295,MATCH(Ras,Rasbonus!$A$1:$AM$1,0),FALSE),\"0\")","v":15},null,null,-5,0,0,0,0,0,0,0,0,0,0,0,0,0,0,0,0,0,0,0,0,0]
["Meditation Cleansing",{"$f":"VLOOKUP(A118,AllaSkills!$A$3:$BV$319,'Ny NPC'!$A$2+3,FALSE)","v":"2/4"},"2","4","Concentration",null,null,null,null,null,null,null,null,null,null,null,null,null,null,null,null,null,null,null,null,null,null,null,0,-25,{"$f":"(SD+EM)/2","v":5},{"$f":"HLOOKUP(Yrke,Levelbonus!$B$1:$CR$20,6,FALSE)","v":0},0,{"$f":"IF(ISNUMBER(VLOOKUP($A118,Rasbonus!$A$61:$AM$295,MATCH(Ras,Rasbonus!$A$1:$AM$1,0),FALSE)),VLOOKUP($A118,Rasbonus!$A$61:$AM$295,MATCH(Ras,Rasbonus!$A$1:$AM$1,0),FALSE),\"0\")","v":"0"},null,null,-20,0,0,0,0,0,0,0,0,0,0,0,0,0,0,0,0,0,0,0,0,0]
["Meditation Death",{"$f":"VLOOKUP(A119,AllaSkills!$A$3:$BV$319,'Ny NPC'!$A$2+3,FALSE)","v":"1/5"},"1","5","Concentration",null,null,null,null,null,null,null,null,null,null,null,null,null,null,null,null,null,null,null,null,null,null,null,0,-25,{"$f":"(SD+PR)/2","v":7.5},{"$f":"HLOOKUP(Yrke,Levelbonus!$B$1:$CR$20,6,FALSE)","v":0},0,{"$f":"IF(ISNUMBER(VLOOKUP($A119,Rasbonus!$A$61:$AM$295,MATCH(Ras,Rasbonus!$A$1:$AM$1,0),FALSE)),VLOOKUP($A119,Rasbonus!$A$61:$AM$295,MATCH(Ras,Rasbonus!$A$1:$AM$1,0),FALSE),\"0\")","v":"0"},null,null,-18,0,0,0,0,0,0,0,0,0,0,0,0,0,0,0,0,0,0,0,0,0]
["Meditation Healing",{"$f":"VLOOKUP(A120,AllaSkills!$A$3:$BV$319,'Ny NPC'!$A$2+3,FALSE)","v":"2/4"},"2","4","Concentration",null,null,null,null,null,null,null,null,null,null,null,null,null,null,null,null,null,null,null,null,null,null,null,0,-25,{"$f":"(SD+EM)/2","v":5},{"$f":"HLOOKUP(Yrke,Levelbonus!$B$1:$CR$20,6,FALSE)","v":0},0,{"$f":"IF(ISNUMBER(VLOOKUP($A120,Rasbonus!$A$61:$AM$295,MATCH(Ras,Rasbonus!$A$1:$AM$1,0),FALSE)),VLOOKUP($A120,Rasbonus!$A$61:$AM$295,MATCH(Ras,Rasbonus!$A$1:$AM$1,0),FALSE),\"0\")","v":"0"},null,null,-20,0,0,0,0,0,0,0,0,0,0,0,0,0,0,0,0,0,0,0,0,0]
["Meditation Ki",{"$f":"VLOOKUP(A121,AllaSkills!$A$3:$BV$319,'Ny NPC'!$A$2+3,FALSE)","v":"3/5"},"3","5","Concentration",null,null,null,null,null,null,null,null,null,null,null,null,null,null,null,null,null,null,null,null,null,null,null,0,-25,{"$f":"(SD+PR)/2","v":7.5},{"$f":"HLOOKUP(Yrke,Levelbonus!$B$1:$CR$20,6,FALSE)","v":0},0,{"$f":"IF(ISNUMBER(VLOOKUP($A121,Rasbonus!$A$61:$AM$295,MATCH(Ras,Rasbonus!$A$1:$AM$1,0),FALSE)),VLOOKUP($A121,Rasbonus!$A$61:$AM$295,MATCH(Ras,Rasbonus!$A$1:$AM$1,0),FALSE),\"0\")","v":"0"},null,null,-18,0,0,0,0,0,0,0,0,0,0,0,0,0,0,0,0,0,0,0,0,0]
["Meditation Sleep",{"$f":"VLOOKUP(A122,AllaSkills!$A$3:$BV$319,'Ny NPC'!$A$2+3,FALSE)","v":"1/4"},"1","4","Concentration",null,null,null,null,null,null,null,null,null,null,null,null,null,null,null,null,null,null,null,null,null,null,null,0,-25,{"$f":"(SD+IN)/2","v":5},{"$f":"HLOOKUP(Yrke,Levelbonus!$B$1:$CR$20,6,FALSE)","v":0},0,{"$f":"IF(ISNUMBER(VLOOKUP($A122,Rasbonus!$A$61:$AM$295,MATCH(Ras,Rasbonus!$A$1:$AM$1,0),FALSE)),VLOOKUP($A122,Rasbonus!$A$61:$AM$295,MATCH(Ras,Rasbonus!$A$1:$AM$1,0),FALSE),\"0\")","v":"0"},null,null,-20,0,0,0,0,0,0,0,0,0,0,0,0,0,0,0,0,0,0,0,0,0]
["Meditation Trance",{"$f":"VLOOKUP(A123,AllaSkills!$A$3:$BV$319,'Ny NPC'!$A$2+3,FALSE)","v":"1/4"},"1","4","Concentration",null,null,null,null,null,null,null,null,null,null,null,null,null,null,null,null,null,null,null,null,null,null,null,0,-25,{"$f":"(SD+PR)/2","v":7.5},{"$f":"HLOOKUP(Yrke,Levelbonus!$B$1:$CR$20,6,FALSE)","v":0},0,{"$f":"IF(ISNUMBER(VLOOKUP($A123,Rasbonus!$A$61:$AM$295,MATCH(Ras,Rasbonus!$A$1:$AM$1,0),FALSE)),VLOOKUP($A123,Rasbonus!$A$61:$AM$295,MATCH(Ras,Rasbonus!$A$1:$AM$1,0),FALSE),\"0\")","v":"0"},null,null,-18,0,0,0,0,0,0,0,0,0,0,0,0,0,0,0,0,0,0,0,0,0]
["Mnemonics",{"$f":"VLOOKUP(A124,AllaSkills!$A$3:$BV$319,'Ny NPC'!$A$2+3,FALSE)","v":"1/4"},"1","4","Concentration",null,null,null,null,null,null,null,null,null,null,null,null,null,null,null,null,null,null,null,null,null,null,null,0,-25,{"$f":"(RE+SD)/2","v":5},{"$f":"HLOOKUP(Yrke,Levelbonus!$B$1:$CR$20,6,FALSE)","v":0},0,{"$f":"IF(ISNUMBER(VLOOKUP($A124,Rasbonus!$A$61:$AM$295,MATCH(Ras,Rasbonus!$A$1:$AM$1,0),FALSE)),VLOOKUP($A124,Rasbonus!$A$61:$AM$295,MATCH(Ras,Rasbonus!$A$1:$AM$1,0),FALSE),\"0\")","v":"0"},null,null,-20,0,0,0,0,0,0,0,0,0,0,0,0,0,0,0,0,0,0,0,0,0]
["Prepared Shot",{"$f":"VLOOKUP(A125,AllaSkills!$A$3:$BV$319,'Ny NPC'!$A$2+3,FALSE)","v":"6"},"6","6","Concentration",null,null,null,null,null,null,null,null,null,null,null,null,null,null,null,null,null,null,null,null,null,null,null,0,-25,{"$f":"(SD+IN)/2","v":5},{"$f":"HLOOKUP(Yrke,Levelbonus!$B$1:$CR$20,6,FALSE)","v":0},0,{"$f":"IF(ISNUMBER(VLOOKUP($A125,Rasbonus!$A$61:$AM$295,MATCH(Ras,Rasbonus!$A$1:$AM$1,0),FALSE)),VLOOKUP($A125,Rasbonus!$A$61:$AM$295,MATCH(Ras,Rasbonus!$A$1:$AM$1,0),FALSE),\"0\")","v":"0"},null,null,-20,0,0,0,0,0,0,0,0,0,0,0,0,0,0,0,0,0,0,0,0,0]
["WOW Fatigue",{"$f":"VLOOKUP(A126,AllaSkills!$A$3:$BV$319,'Ny NPC'!$A$2+3,FALSE)","v":"20"},"20","20","Concentration",null,null,null,null,null,null,null,null,null,null,null,null,null,null,null,null,null,null,null,null,null,null,null,0,-25,{"$f":"SD","v":5},{"$f":"HLOOKUP(Yrke,Levelbonus!$B$1:$CR$20,6,FALSE)","v":0},0,{"$f":"IF(ISNUMBER(VLOOKUP($A126,Rasbonus!$A$61:$AM$295,MATCH(Ras,Rasbonus!$A$1:$AM$1,0),FALSE)),VLOOKUP($A126,Rasbonus!$A$61:$AM$295,MATCH(Ras,Rasbonus!$A$1:$AM$1,0),FALSE),\"0\")","v":10},null,null,-10,0,0,0,0,0,0,0,0,0,0,0,0,0,0,0,0,0,0,0,0,0]
["WOW Pain",{"$f":"VLOOKUP(A127,AllaSkills!$A$3:$BV$319,'Ny NPC'!$A$2+3,FALSE)","v":"20"},{"$f":"IF(LEN(B127)=3,LEFT(B127,1),IF(LEN(B127)<3,B127,99))","v":"20"},"20","Concentration",null,null,null,null,null,null,null,null,null,null,null,null,null,null,null,null,null,null,null,null,null,null,null,0,{"$f":"IF(AC127<1,-25,IF(AC127>30,80+((AC127-30)*0.5),IF(AC127>20,70+(AC127-20),IF(AC127>10,50+((AC127-10)*2),AC127*5))))","v":-25},{"$f":"SD","v":5},{"$f":"HLOOKUP(Yrke,Levelbonus!$B$1:$CR$20,6,FALSE)","v":0},{"$f":"AF127*Level","v":0},{"$f":"IF(ISNUMBER(VLOOKUP($A127,Rasbonus!$A$61:$AM$295,MATCH(Ras,Rasbonus!$A$1:$AM$1,0),FALSE)),VLOOKUP($A127,Rasbonus!$A$61:$AM$295,MATCH(Ras,Rasbonus!$A$1:$AM$1,0),FALSE),\"0\")","v":10},null,null,-10,0,0,0,0,0,0,0,0,0,0,0,0,0,0,0,0,0,0,0,0,0]
["WOW Unconsciousness",{"$f":"VLOOKUP(A128,AllaSkills!$A$3:$BV$319,'Ny NPC'!$A$2+3,FALSE)","v":"20"},"20","20","Concentration",null,null,null,null,null,null,null,null,null,null,null,null,null,null,null,null,null,null,null,null,null,null,null,0,-25,{"$f":"SD","v":5},{"$f":"HLOOKUP(Yrke,Levelbonus!$B$1:$CR$20,6,FALSE)","v":0},0,{"$f":"IF(ISNUMBER(VLOOKUP($A128,Rasbonus!$A$61:$AM$295,MATCH(Ras,Rasbonus!$A$1:$AM$1,0),FALSE)),VLOOKUP($A128,Rasbonus!$A$61:$AM$295,MATCH(Ras,Rasbonus!$A$1:$AM$1,0),FALSE),\"0\")","v":10},null,null,-10,0,0,0,0,0,0,0,0,0,0,0,0,0,0,0,0,0,0,0,0,0]
["WOW Will",{"$f":"VLOOKUP(A129,AllaSkills!$A$3:$BV$319,'Ny NPC'!$A$2+3,FALSE)","v":"20"},"20",{"$f":"IF(RIGHT(B129,1)=\"*\",LEFT(B129,1),IF(LEN(B129)=3,RIGHT(B129,1),IF(LEN(B129)<3,B129,RIGHT(B129,2))))","v":"20"},"Concentration",null,null,null,null,null,null,null,null,null,null,null,null,null,null,null,null,null,null,null,null,null,null,null,{"$f":"SUM(F129:AB129)","v":0},-25,{"$f":"SD","v":5},{"$f":"HLOOKUP(Yrke,Levelbonus!$B$1:$CR$20,6,FALSE)","v":0},0,{"$f":"IF(ISNUMBER(VLOOKUP($A129,Rasbonus!$A$61:$AM$295,MATCH(Ras,Rasbonus!$A$1:$AM$1,0),FALSE)),VLOOKUP($A129,Rasbonus!$A$61:$AM$295,MATCH(Ras,Rasbonus!$A$1:$AM$1,0),FALSE),\"0\")","v":"0"},null,null,-20,0,0,0,0,0,0,0,0,0,0,0,0,0,0,0,0,0,0,0,0,0]
[]
["General & Evaluation",{"$f":"HLOOKUP(Diverse!$G$2,'2nd'!$B$1:$CR$18,9,FALSE)","v":22},null,null,null,{"$f":"SUM(AL132:AL156)","v":0},{"$f":"SUM(AM132:AM156)","v":0},null,{"$f":"SUM(AM132:AM156)","v":0},{"$f":"SUM(AN132:AN156)","v":0},0,0,0,0,0,0,0,0,0,0,0,0,0,0,0,0,0,0,"Rank","Skill","Stat",null,"Lvl","Race","Armor","Item","Total"]
["Advertising",{"$f":"VLOOKUP(A132,AllaSkills!$A$3:$BV$319,'Ny NPC'!$A$2+3,FALSE)","v":"3/5"},"3","5","General",null,null,null,null,null,null,null,null,null,null,null,null,null,null,null,null,null,null,null,null,null,null,null,0,-25,{"$f":"(IN+RE)/2","v":5},{"$f":"HLOOKUP(Yrke,Levelbonus!$B$1:$CR$20,9,FALSE)","v":2},2,{"$f":"IF(ISNUMBER(VLOOKUP($A132,Rasbonus!$A$61:$AM$295,MATCH(Ras,Rasbonus!$A$1:$AM$1,0),FALSE)),VLOOKUP($A132,Rasbonus!$A$61:$AM$295,MATCH(Ras,Rasbonus!$A$1:$AM$1,0),FALSE),\"0\")","v":"0"},null,null,-18,{"$f":"IF(F132>2,\"99\",IF(F132<1,0,IF(F132=1,$C132+$C132-$C132,IF(F132=2,$C132+$D132))))","v":0},{"$f":"IF(I132>2,\"99\",IF(I132<1,0,IF(I132=1,$C132+$C132-$C132,IF(I132=2,$C132+$D132))))","v":0},{"$f":"IF(J132>2,\"99\",IF(J132<1,0,IF(J132=1,$C132+$C132-$C132,IF(J132=2,$C132+$D132))))","v":0},{"$f":"IF(K132>2,\"99\",IF(K132<1,0,IF(K132=1,$C132+$C132-$C132,IF(K132=2,$C132+$D132))))","v":0},{"$f":"IF(L132>2,\"99\",IF(L132<1,0,IF(L132=1,$C132+$C132-$C132,IF(L132=2,$C132+$D132))))","v":0},{"$f":"IF(M132>2,\"99\",IF(M132<1,0,IF(M132=1,$C132+$C132-$C132,IF(M132=2,$C132+$D132))))","v":0},{"$f":"IF(N132>2,\"99\",IF(N132<1,0,IF(N132=1,$C132+$C132-$C132,IF(N132=2,$C132+$D132))))","v":0},{"$f":"IF(O132>2,\"99\",IF(O132<1,0,IF(O132=1,$C132+$C132-$C132,IF(O132=2,$C132+$D132))))","v":0},{"$f":"IF(P132>2,\"99\",IF(P132<1,0,IF(P132=1,$C132+$C132-$C132,IF(P132=2,$C132+$D132))))","v":0},{"$f":"IF(Q132>2,\"99\",IF(Q132<1,0,IF(Q132=1,$C132+$C132-$C132,IF(Q132=2,$C132+$D132))))","v":0},{"$f":"IF(R132>2,\"99\",IF(R132<1,0,IF(R132=1,$C132+$C132-$C132,IF(R132=2,$C132+$D132))))","v":0},{"$f":"IF(S132>2,\"99\",IF(S132<1,0,IF(S132=1,$C132+$C132-$C132,IF(S132=2,$C132+$D132))))","v":0},{"$f":"IF(T132>2,\"99\",IF(T132<1,0,IF(T132=1,$C132+$C132-$C132,IF(T132=2,$C132+$D132))))","v":0},{"$f":"IF(U132>2,\"99\",IF(U132<1,0,IF(U132=1,$C132+$C132-$C132,IF(U132=2,$C132+$D132))))","v":0},{"$f":"IF(V132>2,\"99\",IF(V132<1,0,IF(V132=1,$C132+$C132-$C132,IF(V132=2,$C132+$D132))))","v":0},{"$f":"IF(W132>2,\"99\",IF(W132<1,0,IF(W132=1,$C132+$C132-$C132,IF(W132=2,$C132+$D132))))","v":0},{"$f":"IF(X132>2,\"99\",IF(X132<1,0,IF(X132=1,$C132+$C132-$C132,IF(X132=2,$C132+$D132))))","v":0},{"$f":"IF(Y132>2,\"99\",IF(Y132<1,0,IF(Y132=1,$C132+$C132-$C132,IF(Y132=2,$C132+$D132))))","v":0},{"$f":"IF(Z132>2,\"99\",IF(Z132<1,0,IF(Z132=1,$C132+$C132-$C132,IF(Z132=2,$C132+$D132))))","v":0},{"$f":"IF(AA132>2,\"99\",IF(AA132<1,0,IF(AA132=1,$C132+$C132-$C132,IF(AA132=2,$C132+$D132))))","v":0},{"$f":"IF(AB132>2,\"99\",IF(AB132<1,0,IF(AB132=1,$C132+$C132-$C132,IF(AB132=2,$C132+$D132))))","v":0}]
["Cookery",{"$f":"VLOOKUP(A133,AllaSkills!$A$3:$BV$319,'Ny NPC'!$A$2+3,FALSE)","v":"1/2"},"1","2","General",null,null,null,null,null,null,null,null,null,null,null,null,null,null,null,null,null,null,null,null,null,null,null,0,-25,{"$f":"(IN+RE)/2","v":5},{"$f":"HLOOKUP(Yrke,Levelbonus!$B$1:$CR$20,9,FALSE)","v":2},2,{"$f":"IF(ISNUMBER(VLOOKUP($A133,Rasbonus!$A$61:$AM$295,MATCH(Ras,Rasbonus!$A$1:$AM$1,0),FALSE)),VLOOKUP($A133,Rasbonus!$A$61:$AM$295,MATCH(Ras,Rasbonus!$A$1:$AM$1,0),FALSE),\"0\")","v":"0"},null,null,-18,0,0,0,0,0,0,0,0,0,0,0,0,0,0,0,0,0,0,0,0,0]
["Crafting",{"$f":"VLOOKUP(A134,AllaSkills!$A$3:$BV$319,'Ny NPC'!$A$2+3,FALSE)","v":"1/2"},"1","2","General",null,null,null,null,null,null,null,null,null,null,null,null,null,null,null,null,null,null,null,null,null,null,null,0,-25,{"$f":"(AG+SD)/2","v":5},{"$f":"HLOOKUP(Yrke,Levelbonus!$B$1:$CR$20,9,FALSE)","v":2},2,{"$f":"IF(ISNUMBER(VLOOKUP($A134,Rasbonus!$A$61:$AM$295,MATCH(Ras,Rasbonus!$A$1:$AM$1,0),FALSE)),VLOOKUP($A134,Rasbonus!$A$61:$AM$295,MATCH(Ras,Rasbonus!$A$1:$AM$1,0),FALSE),\"0\")","v":"0"},null,null,-18,0,0,0,0,0,0,0,0,0,0,0,0,0,0,0,0,0,0,0,0,0]
["Fletching",{"$f":"VLOOKUP(A135,AllaSkills!$A$3:$BV$319,'Ny NPC'!$A$2+3,FALSE)","v":"1/3"},"1","3","General",null,null,null,null,null,null,null,null,null,null,null,null,null,null,null,null,null,null,null,null,null,null,null,0,-25,{"$f":"(AG+SD)/2","v":5},{"$f":"HLOOKUP(Yrke,Levelbonus!$B$1:$CR$20,9,FALSE)","v":2},2,{"$f":"IF(ISNUMBER(VLOOKUP($A135,Rasbonus!$A$61:$AM$295,MATCH(Ras,Rasbonus!$A$1:$AM$1,0),FALSE)),VLOOKUP($A135,Rasbonus!$A$61:$AM$295,MATCH(Ras,Rasbonus!$A$1:$AM$1,0),FALSE),\"0\")","v":"0"},null,null,-18,0,0,0,0,0,0,0,0,0,0,0,0,0,0,0,0,0,0,0,0,0]
["Gimmickry",{"$f":"VLOOKUP(A136,AllaSkills!$A$3:$BV$319,'Ny NPC'!$A$2+3,FALSE)","v":"2/4"},"2","4","General",null,null,null,null,null,null,null,null,null,null,null,null,null,null,null,null,null,null,null,null,null,null,null,0,-25,{"$f":"RE","v":5},{"$f":"HLOOKUP(Yrke,Levelbonus!$B$1:$CR$20,9,FALSE)","v":2},2,{"$f":"IF(ISNUMBER(VLOOKUP($A136,Rasbonus!$A$61:$AM$295,MATCH(Ras,Rasbonus!$A$1:$AM$1,0),FALSE)),VLOOKUP($A136,Rasbonus!$A$61:$AM$295,MATCH(Ras,Rasbonus!$A$1:$AM$1,0),FALSE),\"0\")","v":"0"},null,null,-18,0,0,0,0,0,0,0,0,0,0,0,0,0,0,0,0,0,0,0,0,0]
["Horticulture",{"$f":"VLOOKUP(A137,AllaSkills!$A$3:$BV$319,'Ny NPC'!$A$2+3,FALSE)","v":"1/4"},"1","4","General",null,null,null,null,null,null,null,null,null,null,null,null,null,null,null,null,null,null,null,null,null,null,null,0,-25,{"$f":"(IN+EM)/2","v":5},{"$f":"HLOOKUP(Yrke,Levelbonus!$B$1:$CR$20,9,FALSE)","v":2},2,{"$f":"IF(ISNUMBER(VLOOKUP($A137,Rasbonus!$A$61:$AM$295,MATCH(Ras,Rasbonus!$A$1:$AM$1,0),FALSE)),VLOOKUP($A137,Rasbonus!$A$61:$AM$295,MATCH(Ras,Rasbonus!$A$1:$AM$1,0),FALSE),\"0\")","v":"0"},null,null,-18,0,0,0,0,0,0,0,0,0,0,0,0,0,0,0,0,0,0,0,0,0]
["Hygien",{"$f":"VLOOKUP(A138,AllaSkills!$A$3:$BV$319,'Ny NPC'!$A$2+3,FALSE)","v":"3"},"3","3","General",null,null,null,null,null,null,null,null,null,null,null,null,null,null,null,null,null,null,null,null,null,null,null,0,-25,{"$f":"(CO+SD)/2","v":12.5},{"$f":"HLOOKUP(Yrke,Levelbonus!$B$1:$CR$20,9,FALSE)","v":2},2,{"$f":"IF(ISNUMBER(VLOOKUP($A138,Rasbonus!$A$61:$AM$295,MATCH(Ras,Rasbonus!$A$1:$AM$1,0),FALSE)),VLOOKUP($A138,Rasbonus!$A$61:$AM$295,MATCH(Ras,Rasbonus!$A$1:$AM$1,0),FALSE),\"0\")","v":"0"},null,null,-11,0,0,0,0,0,0,0,0,0,0,0,0,0,0,0,0,0,0,0,0,0]
["Leatherworking",{"$f":"VLOOKUP(A139,AllaSkills!$A$3:$BV$319,'Ny NPC'!$A$2+3,FALSE)","v":"3"},"3","3","General",null,null,null,null,null,null,null,null,null,null,null,null,null,null,null,null,null,null,null,null,null,null,null,0,-25,{"$f":"(AG+RE)/2","v":5},{"$f":"HLOOKUP(Yrke,Levelbonus!$B$1:$CR$20,9,FALSE)","v":2},2,{"$f":"IF(ISNUMBER(VLOOKUP($A139,Rasbonus!$A$61:$AM$295,MATCH(Ras,Rasbonus!$A$1:$AM$1,0),FALSE)),VLOOKUP($A139,Rasbonus!$A$61:$AM$295,MATCH(Ras,Rasbonus!$A$1:$AM$1,0),FALSE),\"0\")","v":"0"},null,null,-18,0,0,0,0,0,0,0,0,0,0,0,0,0,0,0,0,0,0,0,0,0]
["Painting",{"$f":"VLOOKUP(A140,AllaSkills!$A$3:$BV$319,'Ny NPC'!$A$2+3,FALSE)","v":"2/5"},"2","5","General",null,null,null,null,null,null,null,null,null,null,null,null,null,null,null,null,null,null,null,null,null,null,null,0,-25,{"$f":"(IN+AG)/2","v":5},{"$f":"HLOOKUP(Yrke,Levelbonus!$B$1:$CR$20,9,FALSE)","v":2},2,{"$f":"IF(ISNUMBER(VLOOKUP($A140,Rasbonus!$A$61:$AM$295,MATCH(Ras,Rasbonus!$A$1:$AM$1,0),FALSE)),VLOOKUP($A140,Rasbonus!$A$61:$AM$295,MATCH(Ras,Rasbonus!$A$1:$AM$1,0),FALSE),\"0\")","v":"0"},null,null,-18,0,0,0,0,0,0,0,0,0,0,0,0,0,0,0,0,0,0,0,0,0]
["Play instrument #1",{"$f":"VLOOKUP(A141,AllaSkills!$A$3:$BV$319,'Ny NPC'!$A$2+3,FALSE)","v":"2/6"},"2","6","General",null,null,null,null,null,null,null,null,null,null,null,null,null,null,null,null,null,null,null,null,null,null,null,0,-25,{"$f":"(AG+RE)/2","v":5},{"$f":"HLOOKUP(Yrke,Levelbonus!$B$1:$CR$20,9,FALSE)","v":2},2,{"$f":"IF(ISNUMBER(VLOOKUP($A141,Rasbonus!$A$61:$AM$295,MATCH(Ras,Rasbonus!$A$1:$AM$1,0),FALSE)),VLOOKUP($A141,Rasbonus!$A$61:$AM$295,MATCH(Ras,Rasbonus!$A$1:$AM$1,0),FALSE),\"0\")","v":"0"},null,null,-18,0,0,0,0,0,0,0,0,0,0,0,0,0,0,0,0,0,0,0,0,0]
["Play instrument #2",{"$f":"VLOOKUP(A142,AllaSkills!$A$3:$BV$319,'Ny NPC'!$A$2+3,FALSE)","v":"3/7"},"3","7","General",null,null,null,null,null,null,null,null,null,null,null,null,null,null,null,null,null,null,null,null,null,null,null,0,-25,{"$f":"(AG+RE)/2","v":5},{"$f":"HLOOKUP(Yrke,Levelbonus!$B$1:$CR$20,9,FALSE)","v":2},2,{"$f":"IF(ISNUMBER(VLOOKUP($A142,Rasbonus!$A$61:$AM$295,MATCH(Ras,Rasbonus!$A$1:$AM$1,0),FALSE)),VLOOKUP($A142,Rasbonus!$A$61:$AM$295,MATCH(Ras,Rasbonus!$A$1:$AM$1,0),FALSE),\"0\")","v":"0"},null,null,-18,0,0,0,0,0,0,0,0,0,0,0,0,0,0,0,0,0,0,0,0,0]
["Play instrument #3",{"$f":"VLOOKUP(A143,AllaSkills!$A$3:$BV$319,'Ny NPC'!$A$2+3,FALSE)","v":"3"},"3","3","General",null,null,null,null,null,null,null,null,null,null,null,null,null,null,null,null,null,null,null,null,null,null,null,0,-25,{"$f":"(AG+RE)/2","v":5},{"$f":"HLOOKUP(Yrke,Levelbonus!$B$1:$CR$20,9,FALSE)","v":2},2,{"$f":"IF(ISNUMBER(VLOOKUP($A143,Rasbonus!$A$61:$AM$295,MATCH(Ras,Rasbonus!$A$1:$AM$1,0),FALSE)),VLOOKUP($A143,Rasbonus!$A$61:$AM$295,MATCH(Ras,Rasbonus!$A$1:$AM$1,0),FALSE),\"0\")","v":"0"},null,null,-18,0,0,0,0,0,0,0,0,0,0,0,0,0,0,0,0,0,0,0,0,0]
["Rope Mastery",{"$f":"VLOOKUP(A144,AllaSkills!$A$3:$BV$319,'Ny NPC'!$A$2+3,FALSE)","v":"3"},"3","3","General",null,null,null,null,null,null,null,null,null,null,null,null,null,null,null,null,null,null,null,null,null,null,null,0,-25,{"$f":"(AG+RE)/2","v":5},{"$f":"HLOOKUP(Yrke,Levelbonus!$B$1:$CR$20,9,FALSE)","v":2},2,{"$f":"IF(ISNUMBER(VLOOKUP($A144,Rasbonus!$A$61:$AM$295,MATCH(Ras,Rasbonus!$A$1:$AM$1,0),FALSE)),VLOOKUP($A144,Rasbonus!$A$61:$AM$295,MATCH(Ras,Rasbonus!$A$1:$AM$1,0),FALSE),\"0\")","v":"0"},null,null,-18,0,0,0,0,0,0,0,0,0,0,0,0,0,0,0,0,0,0,0,0,0]
["Sculpting",{"$f":"VLOOKUP(A145,AllaSkills!$A$3:$BV$319,'Ny NPC'!$A$2+3,FALSE)","v":"1/4"},"1","4","General",null,null,null,null,null,null,null,null,null,null,null,null,null,null,null,null,null,null,null,null,null,null,null,0,-25,{"$f":"(IN+AG)/2","v":5},{"$f":"HLOOKUP(Yrke,Levelbonus!$B$1:$CR$20,9,FALSE)","v":2},2,{"$f":"IF(ISNUMBER(VLOOKUP($A145,Rasbonus!$A$61:$AM$295,MATCH(Ras,Rasbonus!$A$1:$AM$1,0),FALSE)),VLOOKUP($A145,Rasbonus!$A$61:$AM$295,MATCH(Ras,Rasbonus!$A$1:$AM$1,0),FALSE),\"0\")","v":"0"},null,null,-18,0,0,0,0,0,0,0,0,0,0,0,0,0,0,0,0,0,0,0,0,0]
["Skinning",{"$f":"VLOOKUP(A146,AllaSkills!$A$3:$BV$319,'Ny NPC'!$A$2+3,FALSE)","v":"3"},"3","3","General",null,null,null,null,null,null,null,null,null,null,null,null,null,null,null,null,null,null,null,null,null,null,null,0,-25,{"$f":"(IN+AG)/2","v":5},{"$f":"HLOOKUP(Yrke,Levelbonus!$B$1:$CR$20,9,FALSE)","v":2},2,{"$f":"IF(ISNUMBER(VLOOKUP($A146,Rasbonus!$A$61:$AM$295,MATCH(Ras,Rasbonus!$A$1:$AM$1,0),FALSE)),VLOOKUP($A146,Rasbonus!$A$61:$AM$295,MATCH(Ras,Rasbonus!$A$1:$AM$1,0),FALSE),\"0\")","v":"0"},null,null,{"$f":"ROUND(AD146+AE146+AG146+AH146+AI146+AJ146,0)","v":-18},0,0,0,0,0,0,0,0,0,0,0,0,0,0,0,0,0,0,0,0,0]
["Smithing",{"$f":"VLOOKUP(A147,AllaSkills!$A$3:$BV$319,'Ny NPC'!$A$2+3,FALSE)","v":"1/2"},"1","2","General",null,null,null,null,null,null,null,null,null,null,null,null,null,null,null,null,null,null,null,null,null,null,null,0,-25,{"$f":"(ST+AG)/2","v":12.5},{"$f":"HLOOKUP(Yrke,Levelbonus!$B$1:$CR$20,9,FALSE)","v":2},2,{"$f":"IF(ISNUMBER(VLOOKUP($A147,Rasbonus!$A$61:$AM$295,MATCH(Ras,Rasbonus!$A$1:$AM$1,0),FALSE)),VLOOKUP($A147,Rasbonus!$A$61:$AM$295,MATCH(Ras,Rasbonus!$A$1:$AM$1,0),FALSE),\"0\")","v":"0"},null,null,-11,0,0,0,0,0,0,0,0,0,0,0,0,0,0,0,0,0,0,0,0,0]
["Stonecrafts",{"$f":"VLOOKUP(A148,AllaSkills!$A$3:$BV$319,'Ny NPC'!$A$2+3,FALSE)","v":"1/2"},"1","2","General",null,null,null,null,null,null,null,null,null,null,null,null,null,null,null,null,null,null,null,null,null,null,null,0,-25,{"$f":"(AG+SD)/2","v":5},{"$f":"HLOOKUP(Yrke,Levelbonus!$B$1:$CR$20,9,FALSE)","v":2},2,{"$f":"IF(ISNUMBER(VLOOKUP($A148,Rasbonus!$A$61:$AM$295,MATCH(Ras,Rasbonus!$A$1:$AM$1,0),FALSE)),VLOOKUP($A148,Rasbonus!$A$61:$AM$295,MATCH(Ras,Rasbonus!$A$1:$AM$1,0),FALSE),\"0\")","v":"0"},null,null,-18,0,0,0,0,0,0,0,0,0,0,0,0,0,0,0,0,0,0,0,0,0]
["Tactical Games",{"$f":"VLOOKUP(A149,AllaSkills!$A$3:$BV$319,'Ny NPC'!$A$2+3,FALSE)","v":"1/4"},"1","4","General",null,null,null,null,null,null,null,null,null,null,null,null,null,null,null,null,null,null,null,null,null,null,null,0,-25,{"$f":"(RE)","v":5},{"$f":"HLOOKUP(Yrke,Levelbonus!$B$1:$CR$20,9,FALSE)","v":2},2,{"$f":"IF(ISNUMBER(VLOOKUP($A149,Rasbonus!$A$61:$AM$295,MATCH(Ras,Rasbonus!$A$1:$AM$1,0),FALSE)),VLOOKUP($A149,Rasbonus!$A$61:$AM$295,MATCH(Ras,Rasbonus!$A$1:$AM$1,0),FALSE),\"0\")","v":"0"},null,null,-18,0,0,0,0,0,0,0,0,0,0,0,0,0,0,0,0,0,0,0,0,0]
["Woodcrafts",{"$f":"VLOOKUP(A150,AllaSkills!$A$3:$BV$319,'Ny NPC'!$A$2+3,FALSE)","v":"1/3"},{"$f":"IF(LEN(B150)=3,LEFT(B150,1),IF(LEN(B150)<3,B150,99))","v":"1"},{"$f":"IF(RIGHT(B150,1)=\"*\",LEFT(B150,1),IF(LEN(B150)=3,RIGHT(B150,1),IF(LEN(B150)<3,B150,RIGHT(B150,2))))","v":"3"},"General",null,null,null,null,null,null,null,null,null,null,null,null,null,null,null,null,null,null,null,null,null,null,null,{"$f":"SUM(F150:AB150)","v":0},{"$f":"IF(AC150<1,-25,IF(AC150>30,80+((AC150-30)*0.5),IF(AC150>20,70+(AC150-20),IF(AC150>10,50+((AC150-10)*2),AC150*5))))","v":-25},{"$f":"(AG+EM)/2","v":5},{"$f":"HLOOKUP(Yrke,Levelbonus!$B$1:$CR$20,9,FALSE)","v":2},{"$f":"AF150*Level","v":2},{"$f":"IF(ISNUMBER(VLOOKUP($A150,Rasbonus!$A$61:$AM$295,MATCH(Ras,Rasbonus!$A$1:$AM$1,0),FALSE)),VLOOKUP($A150,Rasbonus!$A$61:$AM$295,MATCH(Ras,Rasbonus!$A$1:$AM$1,0),FALSE),\"0\")","v":"0"},null,null,{"$f":"ROUND(AD150+AE150+AG150+AH150+AI150+AJ150,0)","v":-18},0,0,0,0,0,0,0,0,0,0,0,0,0,0,0,0,0,0,0,0,0]
[]
["Appraisal",{"$f":"VLOOKUP(A152,AllaSkills!$A$3:$BV$319,'Ny NPC'!$A$2+3,FALSE)","v":"1/2"},{"$f":"IF(LEN(B152)=3,LEFT(B152,1),IF(LEN(B152)<3,B152,99))","v":"1"},{"$f":"IF(RIGHT(B152,1)=\"*\",LEFT(B152,1),IF(LEN(B152)=3,RIGHT(B152,1),IF(LEN(B152)<3,B152,RIGHT(B152,2))))","v":"2"},"Evaluation",null,null,null,null,null,null,null,null,null,null,null,null,null,null,null,null,null,null,null,null,null,null,null,{"$f":"SUM(F152:AB152)","v":0},{"$f":"IF(AC152<1,-25,IF(AC152>30,80+((AC152-30)*0.5),IF(AC152>20,70+(AC152-20),IF(AC152>10,50+((AC152-10)*2),AC152*5))))","v":-25},{"$f":"(RE)","v":5},{"$f":"HLOOKUP(Yrke,Levelbonus!$B$1:$CR$20,8,FALSE)","v":2},{"$f":"AF152*Level","v":2},{"$f":"IF(ISNUMBER(VLOOKUP($A152,Rasbonus!$A$61:$AM$295,MATCH(Ras,Rasbonus!$A$1:$AM$1,0),FALSE)),VLOOKUP($A152,Rasbonus!$A$61:$AM$295,MATCH(Ras,Rasbonus!$A$1:$AM$1,0),FALSE),\"0\")","v":"0"},null,null,{"$f":"ROUND(AD152+AE152+AG152+AH152+AI152+AJ152,0)","v":-18},{"$f":"IF(F152>2,\"99\",IF(F152<1,0,IF(F152=1,$C152+$C152-$C152,IF(F152=2,$C152+$D152))))","v":0},{"$f":"IF(I152>2,\"99\",IF(I152<1,0,IF(I152=1,$C152+$C152-$C152,IF(I152=2,$C152+$D152))))","v":0},0,0,0,0,0,0,0,0,0,{"$f":"IF(S152>2,\"99\",IF(S152<1,0,IF(S152=1,$C152+$C152-$C152,IF(S152=2,$C152+$D152))))","v":0},0,0,0,0,0,0,0,0,0]
["Armor Evaluation",{"$f":"VLOOKUP(A153,AllaSkills!$A$3:$BV$319,'Ny NPC'!$A$2+3,FALSE)","v":"1/3"},{"$f":"IF(LEN(B153)=3,LEFT(B153,1),IF(LEN(B153)<3,B153,99))","v":"1"},{"$f":"IF(RIGHT(B153,1)=\"*\",LEFT(B153,1),IF(LEN(B153)=3,RIGHT(B153,1),IF(LEN(B153)<3,B153,RIGHT(B153,2))))","v":"3"},"Evaluation",null,null,null,null,null,null,null,null,null,null,null,null,null,null,null,null,null,null,null,null,null,null,null,{"$f":"SUM(F153:AB153)","v":0},{"$f":"IF(AC153<1,-25,IF(AC153>30,80+((AC153-30)*0.5),IF(AC153>20,70+(AC153-20),IF(AC153>10,50+((AC153-10)*2),AC153*5))))","v":-25},{"$f":"(IN+RE)/2","v":5},{"$f":"HLOOKUP(Yrke,Levelbonus!$B$1:$CR$20,8,FALSE)","v":2},{"$f":"AF153*Level","v":2},{"$f":"IF(ISNUMBER(VLOOKUP($A153,Rasbonus!$A$61:$AM$295,MATCH(Ras,Rasbonus!$A$1:$AM$1,0),FALSE)),VLOOKUP($A153,Rasbonus!$A$61:$AM$295,MATCH(Ras,Rasbonus!$A$1:$AM$1,0),FALSE),\"0\")","v":"0"},null,null,{"$f":"ROUND(AD153+AE153+AG153+AH153+AI153+AJ153,0)","v":-18},{"$f":"IF(F153>2,\"99\",IF(F153<1,0,IF(F153=1,$C153+$C153-$C153,IF(F153=2,$C153+$D153))))","v":0},0,0,0,0,0,0,0,0,0,0,0,0,0,0,0,0,0,0,0,0]
["Metal Evaluation",{"$f":"VLOOKUP(A154,AllaSkills!$A$3:$BV$319,'Ny NPC'!$A$2+3,FALSE)","v":"1/2"},{"$f":"IF(LEN(B154)=3,LEFT(B154,1),IF(LEN(B154)<3,B154,99))","v":"1"},{"$f":"IF(RIGHT(B154,1)=\"*\",LEFT(B154,1),IF(LEN(B154)=3,RIGHT(B154,1),IF(LEN(B154)<3,B154,RIGHT(B154,2))))","v":"2"},"Evaluation",null,null,null,null,null,null,null,null,null,null,null,null,null,null,null,null,null,null,null,null,null,null,null,{"$f":"SUM(F154:AB154)","v":0},{"$f":"IF(AC154<1,-25,IF(AC154>30,80+((AC154-30)*0.5),IF(AC154>20,70+(AC154-20),IF(AC154>10,50+((AC154-10)*2),AC154*5))))","v":-25},{"$f":"(IN+RE)/2","v":5},{"$f":"HLOOKUP(Yrke,Levelbonus!$B$1:$CR$20,8,FALSE)","v":2},{"$f":"AF154*Level","v":2},{"$f":"IF(ISNUMBER(VLOOKUP($A154,Rasbonus!$A$61:$AM$295,MATCH(Ras,Rasbonus!$A$1:$AM$1,0),FALSE)),VLOOKUP($A154,Rasbonus!$A$61:$AM$295,MATCH(Ras,Rasbonus!$A$1:$AM$1,0),FALSE),\"0\")","v":"0"},null,null,{"$f":"ROUND(AD154+AE154+AG154+AH154+AI154+AJ154,0)","v":-18},{"$f":"IF(F154>2,\"99\",IF(F154<1,0,IF(F154=1,$C154+$C154-$C154,IF(F154=2,$C154+$D154))))","v":0},0,0,0,0,0,0,0,0,0,0,0,0,0,0,0,0,0,0,0,0]
["Stone Evaluation",{"$f":"VLOOKUP(A155,AllaSkills!$A$3:$BV$319,'Ny NPC'!$A$2+3,FALSE)","v":"1/2"},{"$f":"IF(LEN(B155)=3,LEFT(B155,1),IF(LEN(B155)<3,B155,99))","v":"1"},{"$f":"IF(RIGHT(B155,1)=\"*\",LEFT(B155,1),IF(LEN(B155)=3,RIGHT(B155,1),IF(LEN(B155)<3,B155,RIGHT(B155,2))))","v":"2"},"Evaluation",null,null,null,null,null,null,null,null,null,null,null,null,null,null,null,null,null,null,null,null,null,null,null,{"$f":"SUM(F155:AB155)","v":0},{"$f":"IF(AC155<1,-25,IF(AC155>30,80+((AC155-30)*0.5),IF(AC155>20,70+(AC155-20),IF(AC155>10,50+((AC155-10)*2),AC155*5))))","v":-25},{"$f":"(IN+RE)/2","v":5},{"$f":"HLOOKUP(Yrke,Levelbonus!$B$1:$CR$20,8,FALSE)","v":2},{"$f":"AF155*Level","v":2},{"$f":"IF(ISNUMBER(VLOOKUP($A155,Rasbonus!$A$61:$AM$295,MATCH(Ras,Rasbonus!$A$1:$AM$1,0),FALSE)),VLOOKUP($A155,Rasbonus!$A$61:$AM$295,MATCH(Ras,Rasbonus!$A$1:$AM$1,0),FALSE),\"0\")","v":"0"},null,null,{"$f":"ROUND(AD155+AE155+AG155+AH155+AI155+AJ155,0)","v":-18},{"$f":"IF(F155>2,\"99\",IF(F155<1,0,IF(F155=1,$C155+$C155-$C155,IF(F155=2,$C155+$D155))))","v":0},0,0,0,0,0,0,0,0,0,0,0,0,0,0,0,0,0,0,0,0]
["Weapon Evaluation",{"$f":"VLOOKUP(A156,AllaSkills!$A$3:$BV$319,'Ny NPC'!$A$2+3,FALSE)","v":"1/3"},{"$f":"IF(LEN(B156)=3,LEFT(B156,1),IF(LEN(B156)<3,B156,99))","v":"1"},{"$f":"IF(RIGHT(B156,1)=\"*\",LEFT(B156,1),IF(LEN(B156)=3,RIGHT(B156,1),IF(LEN(B156)<3,B156,RIGHT(B156,2))))","v":"3"},"Evaluation",null,null,null,null,null,null,null,null,null,null,null,null,null,null,null,null,null,null,null,null,null,null,null,{"$f":"SUM(F156:AB156)","v":0},{"$f":"IF(AC156<1,-25,IF(AC156>30,80+((AC156-30)*0.5),IF(AC156>20,70+(AC156-20),IF(AC156>10,50+((AC156-10)*2),AC156*5))))","v":-25},{"$f":"(IN+RE)/2","v":5},{"$f":"HLOOKUP(Yrke,Levelbonus!$B$1:$CR$20,8,FALSE)","v":2},{"$f":"AF156*Level","v":2},{"$f":"IF(ISNUMBER(VLOOKUP($A156,Rasbonus!$A$61:$AM$295,MATCH(Ras,Rasbonus!$A$1:$AM$1,0),FALSE)),VLOOKUP($A156,Rasbonus!$A$61:$AM$295,MATCH(Ras,Rasbonus!$A$1:$AM$1,0),FALSE),\"0\")","v":"0"},null,null,{"$f":"ROUND(AD156+AE156+AG156+AH156+AI156+AJ156,0)","v":-18},{"$f":"IF(F156>2,\"99\",IF(F156<1,0,IF(F156=1,$C156+$C156-$C156,IF(F156=2,$C156+$D156))))","v":0},0,0,0,0,0,0,0,0,0,0,0,0,0,0,0,0,0,0,0,0]
[]
["Linguistic",{"$f":"HLOOKUP(Diverse!$G$2,'2nd'!$B$1:$CR$18,11,FALSE)","v":3},null,null,null,{"$f":"SUM(AL159:AL171)","v":0},{"$f":"SUM(AM159:AM171)","v":0},null,{"$f":"SUM(AM159:AM171)","v":0},{"$f":"SUM(AN159:AN171)","v":0},0,0,0,0,0,0,0,0,0,0,0,0,0,0,0,0,0,0,"Rank","Skill","Stat",null,"Lvl","Race","Armor","Item","Total"]
["Language",{"$f":"VLOOKUP(A159,AllaSkills!$A$3:$BV$319,'Ny NPC'!$A$2+3,FALSE)","v":"1/*"},"1","1","Linguistic",null,null,null,null,null,null,null,null,null,null,null,null,null,null,null,null,null,null,null,null,null,null,null,0,-25,null,{"$f":"HLOOKUP(Yrke,Levelbonus!$B$1:$CR$20,11,FALSE)","v":0},0,null,null,null,{"$f":"ROUND(AD159+AE159+AG159+AH159+AI159+AJ159,0)","v":-25},{"$f":"IF(F159>2,\"99\",IF(F159<1,0,IF(F159=1,$C159+$C159-$C159,IF(F159=2,$C159+$D159))))","v":0},{"$f":"IF(I159>2,\"99\",IF(I159<1,0,IF(I159=1,$C159+$C159-$C159,IF(I159=2,$C159+$D159))))","v":0},0,0,0,0,0,0,0,0,0,0,0,0,0,0,0,0,0,0,0]
[]
["Lip Reading",{"$f":"VLOOKUP(A161,AllaSkills!$A$3:$BV$319,'Ny NPC'!$A$2+3,FALSE)","v":"3/5"},"3","5","Linguistic",null,null,null,null,null,null,null,null,null,null,null,null,null,null,null,null,null,null,null,null,null,null,null,0,-25,{"$f":"(IN+RE)/2","v":5},{"$f":"HLOOKUP(Yrke,Levelbonus!$B$1:$CR$20,11,FALSE)","v":0},0,{"$f":"IF(ISNUMBER(VLOOKUP($A161,Rasbonus!$A$61:$AM$295,MATCH(Ras,Rasbonus!$A$1:$AM$1,0),FALSE)),VLOOKUP($A161,Rasbonus!$A$61:$AM$295,MATCH(Ras,Rasbonus!$A$1:$AM$1,0),FALSE),\"0\")","v":"0"},null,null,-20,{"$f":"IF(F161>2,\"99\",IF(F161<1,0,IF(F161=1,$C161+$C161-$C161,IF(F161=2,$C161+$D161))))","v":0},{"$f":"IF(I161>2,\"99\",IF(I161<1,0,IF(I161=1,$C161+$C161-$C161,IF(I161=2,$C161+$D161))))","v":0},{"$f":"IF(J161>2,\"99\",IF(J161<1,0,IF(J161=1,$C161+$C161-$C161,IF(J161=2,$C161+$D161))))","v":0},{"$f":"IF(K161>2,\"99\",IF(K161<1,0,IF(K161=1,$C161+$C161-$C161,IF(K161=2,$C161+$D161))))","v":0},{"$f":"IF(L161>2,\"99\",IF(L161<1,0,IF(L161=1,$C161+$C161-$C161,IF(L161=2,$C161+$D161))))","v":0},{"$f":"IF(M161>2,\"99\",IF(M161<1,0,IF(M161=1,$C161+$C161-$C161,IF(M161=2,$C161+$D161))))","v":0},{"$f":"IF(N161>2,\"99\",IF(N161<1,0,IF(N161=1,$C161+$C161-$C161,IF(N161=2,$C161+$D161))))","v":0},{"$f":"IF(O161>2,\"99\",IF(O161<1,0,IF(O161=1,$C161+$C161-$C161,IF(O161=2,$C161+$D161))))","v":0},{"$f":"IF(P161>2,\"99\",IF(P161<1,0,IF(P161=1,$C161+$C161-$C161,IF(P161=2,$C161+$D161))))","v":0},{"$f":"IF(Q161>2,\"99\",IF(Q161<1,0,IF(Q161=1,$C161+$C161-$C161,IF(Q161=2,$C161+$D161))))","v":0},{"$f":"IF(R161>2,\"99\",IF(R161<1,0,IF(R161=1,$C161+$C161-$C161,IF(R161=2,$C161+$D161))))","v":0},{"$f":"IF(S161>2,\"99\",IF(S161<1,0,IF(S161=1,$C161+$C161-$C161,IF(S161=2,$C161+$D161))))","v":0},{"$f":"IF(T161>2,\"99\",IF(T161<1,0,IF(T161=1,$C161+$C161-$C161,IF(T161=2,$C161+$D161))))","v":0},{"$f":"IF(U161>2,\"99\",IF(U161<1,0,IF(U161=1,$C161+$C161-$C161,IF(U161=2,$C161+$D161))))","v":0},{"$f":"IF(V161>2,\"99\",IF(V161<1,0,IF(V161=1,$C161+$C161-$C161,IF(V161=2,$C161+$D161))))","v":0},{"$f":"IF(W161>2,\"99\",IF(W161<1,0,IF(W161=1,$C161+$C161-$C161,IF(W161=2,$C161+$D161))))","v":0},{"$f":"IF(X161>2,\"99\",IF(X161<1,0,IF(X161=1,$C161+$C161-$C161,IF(X161=2,$C161+$D161))))","v":0},{"$f":"IF(Y161>2,\"99\",IF(Y161<1,0,IF(Y161=1,$C161+$C161-$C161,IF(Y161=2,$C161+$D161))))","v":0},{"$f":"IF(Z161>2,\"99\",IF(Z161<1,0,IF(Z161=1,$C161+$C161-$C161,IF(Z161=2,$C161+$D161))))","v":0},{"$f":"IF(AA161>2,\"99\",IF(AA161<1,0,IF(AA161=1,$C161+$C161-$C161,IF(AA161=2,$C161+$D161))))","v":0},{"$f":"IF(AB161>2,\"99\",IF(AB161<1,0,IF(AB161=1,$C161+$C161-$C161,IF(AB161=2,$C161+$D161))))","v":0}]
["Mimicry",{"$f":"VLOOKUP(A162,AllaSkills!$A$3:$BV$319,'Ny NPC'!$A$2+3,FALSE)","v":"2/6"},"2","6","Linguistic",null,null,null,null,null,null,null,null,null,null,null,null,null,null,null,null,null,null,null,null,null,null,null,0,-25,{"$f":"(IN+SD)/2","v":5},{"$f":"HLOOKUP(Yrke,Levelbonus!$B$1:$CR$20,11,FALSE)","v":0},0,{"$f":"IF(ISNUMBER(VLOOKUP($A162,Rasbonus!$A$61:$AM$295,MATCH(Ras,Rasbonus!$A$1:$AM$1,0),FALSE)),VLOOKUP($A162,Rasbonus!$A$61:$AM$295,MATCH(Ras,Rasbonus!$A$1:$AM$1,0),FALSE),\"0\")","v":"0"},null,null,-20,0,0,0,0,0,0,0,0,0,0,0,0,0,0,0,0,0,0,0,0,0]
["Music",{"$f":"VLOOKUP(A163,AllaSkills!$A$3:$BV$319,'Ny NPC'!$A$2+3,FALSE)","v":"2/6"},"2","6","Linguistic",null,null,null,null,null,null,null,null,null,null,null,null,null,null,null,null,null,null,null,null,null,null,null,0,-25,{"$f":"(AG+EM)/2","v":5},{"$f":"HLOOKUP(Yrke,Levelbonus!$B$1:$CR$20,11,FALSE)","v":0},0,{"$f":"IF(ISNUMBER(VLOOKUP($A163,Rasbonus!$A$61:$AM$295,MATCH(Ras,Rasbonus!$A$1:$AM$1,0),FALSE)),VLOOKUP($A163,Rasbonus!$A$61:$AM$295,MATCH(Ras,Rasbonus!$A$1:$AM$1,0),FALSE),\"0\")","v":"0"},null,null,-20,0,0,0,0,0,0,0,0,0,0,0,0,0,0,0,0,0,0,0,0,0]
["Poetic Improvisation",{"$f":"VLOOKUP(A164,AllaSkills!$A$3:$BV$319,'Ny NPC'!$A$2+3,FALSE)","v":"2/6"},"2","6","Linguistic",null,null,null,null,null,null,null,null,null,null,null,null,null,null,null,null,null,null,null,null,null,null,null,0,-25,{"$f":"(IN+RE)/2","v":5},{"$f":"HLOOKUP(Yrke,Levelbonus!$B$1:$CR$20,11,FALSE)","v":0},0,{"$f":"IF(ISNUMBER(VLOOKUP($A164,Rasbonus!$A$61:$AM$295,MATCH(Ras,Rasbonus!$A$1:$AM$1,0),FALSE)),VLOOKUP($A164,Rasbonus!$A$61:$AM$295,MATCH(Ras,Rasbonus!$A$1:$AM$1,0),FALSE),\"0\")","v":"0"},null,null,-20,0,0,0,0,0,0,0,0,0,0,0,0,0,0,0,0,0,0,0,0,0]
["Propaganda",{"$f":"VLOOKUP(A165,AllaSkills!$A$3:$BV$319,'Ny NPC'!$A$2+3,FALSE)","v":"3/5"},"3","5","Linguistic",null,null,null,null,null,null,null,null,null,null,null,null,null,null,null,null,null,null,null,null,null,null,null,0,-25,{"$f":"(IN+EM)/2","v":5},{"$f":"HLOOKUP(Yrke,Levelbonus!$B$1:$CR$20,11,FALSE)","v":0},0,{"$f":"IF(ISNUMBER(VLOOKUP($A165,Rasbonus!$A$61:$AM$295,MATCH(Ras,Rasbonus!$A$1:$AM$1,0),FALSE)),VLOOKUP($A165,Rasbonus!$A$61:$AM$295,MATCH(Ras,Rasbonus!$A$1:$AM$1,0),FALSE),\"0\")","v":"0"},null,null,-20,0,0,0,0,0,0,0,0,0,0,0,0,0,0,0,0,0,0,0,0,0]
["Public Speaking",{"$f":"VLOOKUP(A166,AllaSkills!$A$3:$BV$319,'Ny NPC'!$A$2+3,FALSE)","v":"3/5"},"3","5","Linguistic",null,null,null,null,null,null,null,null,null,null,null,null,null,null,null,null,null,null,null,null,null,null,null,0,-25,{"$f":"AVERAGE(EM,PR)","v":7.5},{"$f":"HLOOKUP(Yrke,Levelbonus!$B$1:$CR$20,11,FALSE)","v":0},0,{"$f":"IF(ISNUMBER(VLOOKUP($A166,Rasbonus!$A$61:$AM$295,MATCH(Ras,Rasbonus!$A$1:$AM$1,0),FALSE)),VLOOKUP($A166,Rasbonus!$A$61:$AM$295,MATCH(Ras,Rasbonus!$A$1:$AM$1,0),FALSE),\"0\")","v":"0"},null,null,-18,0,0,0,0,0,0,0,0,0,0,0,0,0,0,0,0,0,0,0,0,0]
["Signaling",{"$f":"VLOOKUP(A167,AllaSkills!$A$3:$BV$319,'Ny NPC'!$A$2+3,FALSE)","v":"1/5"},"1","5","Linguistic",null,null,null,null,null,null,null,null,null,null,null,null,null,null,null,null,null,null,null,null,null,null,null,0,-25,{"$f":"(RE+SD)/2","v":5},{"$f":"HLOOKUP(Yrke,Levelbonus!$B$1:$CR$20,11,FALSE)","v":0},0,{"$f":"IF(ISNUMBER(VLOOKUP($A167,Rasbonus!$A$61:$AM$295,MATCH(Ras,Rasbonus!$A$1:$AM$1,0),FALSE)),VLOOKUP($A167,Rasbonus!$A$61:$AM$295,MATCH(Ras,Rasbonus!$A$1:$AM$1,0),FALSE),\"0\")","v":"0"},null,null,-20,0,0,0,0,0,0,0,0,0,0,0,0,0,0,0,0,0,0,0,0,0]
["Singing",{"$f":"VLOOKUP(A168,AllaSkills!$A$3:$BV$319,'Ny NPC'!$A$2+3,FALSE)","v":"2/6"},"2","6","Linguistic",null,null,null,null,null,null,null,null,null,null,null,null,null,null,null,null,null,null,null,null,null,null,null,0,-25,{"$f":"(PR+IN)/2","v":7.5},{"$f":"HLOOKUP(Yrke,Levelbonus!$B$1:$CR$20,11,FALSE)","v":0},0,{"$f":"IF(ISNUMBER(VLOOKUP($A168,Rasbonus!$A$61:$AM$295,MATCH(Ras,Rasbonus!$A$1:$AM$1,0),FALSE)),VLOOKUP($A168,Rasbonus!$A$61:$AM$295,MATCH(Ras,Rasbonus!$A$1:$AM$1,0),FALSE),\"0\")","v":"0"},null,null,-18,0,0,0,0,0,0,0,0,0,0,0,0,0,0,0,0,0,0,0,0,0]
["Tale Telling",{"$f":"VLOOKUP(A169,AllaSkills!$A$3:$BV$319,'Ny NPC'!$A$2+3,FALSE)","v":"2/6"},"2","6","Linguistic",null,null,null,null,null,null,null,null,null,null,null,null,null,null,null,null,null,null,null,null,null,null,null,0,-25,{"$f":"PR","v":10},{"$f":"HLOOKUP(Yrke,Levelbonus!$B$1:$CR$20,11,FALSE)","v":0},0,{"$f":"IF(ISNUMBER(VLOOKUP($A169,Rasbonus!$A$61:$AM$295,MATCH(Ras,Rasbonus!$A$1:$AM$1,0),FALSE)),VLOOKUP($A169,Rasbonus!$A$61:$AM$295,MATCH(Ras,Rasbonus!$A$1:$AM$1,0),FALSE),\"0\")","v":"0"},null,null,-15,0,0,0,0,0,0,0,0,0,0,0,0,0,0,0,0,0,0,0,0,0]
["Trading",{"$f":"VLOOKUP(A170,AllaSkills!$A$3:$BV$319,'Ny NPC'!$A$2+3,FALSE)","v":"3/5"},"3","5","Linguistic",null,null,null,null,null,null,null,null,null,null,null,null,null,null,null,null,null,null,null,null,null,null,null,0,-25,{"$f":"(RE)","v":5},{"$f":"HLOOKUP(Yrke,Levelbonus!$B$1:$CR$20,11,FALSE)","v":0},0,{"$f":"IF(ISNUMBER(VLOOKUP($A170,Rasbonus!$A$61:$AM$295,MATCH(Ras,Rasbonus!$A$1:$AM$1,0),FALSE)),VLOOKUP($A170,Rasbonus!$A$61:$AM$295,MATCH(Ras,Rasbonus!$A$1:$AM$1,0),FALSE),\"0\")","v":"0"},null,null,-20,0,0,0,0,0,0,0,0,0,0,0,0,0,0,0,0,0,0,0,0,0]
["Ventriloquism",{"$f":"VLOOKUP(A171,AllaSkills!$A$3:$BV$319,'Ny NPC'!$A$2+3,FALSE)","v":"3/6"},{"$f":"IF(LEN(B171)=3,LEFT(B171,1),IF(LEN(B171)<3,B171,99))","v":"3"},{"$f":"IF(RIGHT(B171,1)=\"*\",LEFT(B171,1),IF(LEN(B171)=3,RIGHT(B171,1),IF(LEN(B171)<3,B171,RIGHT(B171,2))))","v":"6"},"Linguistic",null,null,null,null,null,null,null,null,null,null,null,null,null,null,null,null,null,null,null,null,null,null,null,{"$f":"SUM(F171:AB171)","v":0},{"$f":"IF(AC171<1,-25,IF(AC171>30,80+((AC171-30)*0.5),IF(AC171>20,70+(AC171-20),IF(AC171>10,50+((AC171-10)*2),AC171*5))))","v":-25},{"$f":"(SD+IN)/2","v":5},{"$f":"HLOOKUP(Yrke,Levelbonus!$B$1:$CR$20,11,FALSE)","v":0},{"$f":"AF171*Level","v":0},{"$f":"IF(ISNUMBER(VLOOKUP($A171,Rasbonus!$A$61:$AM$295,MATCH(Ras,Rasbonus!$A$1:$AM$1,0),FALSE)),VLOOKUP($A171,Rasbonus!$A$61:$AM$295,MATCH(Ras,Rasbonus!$A$1:$AM$1,0),FALSE),\"0\")","v":"0"},null,null,{"$f":"ROUND(AD171+AE171+AG171+AH171+AI171+AJ171,0)","v":-20},0,0,0,0,0,0,0,0,0,0,0,0,0,0,0,0,0,0,0,0,0]
[]
["Magical",{"$f":"HLOOKUP(Diverse!$G$2,'2nd'!$B$1:$CR$18,12,FALSE)","v":26},null,null,null,{"$f":"SUM(AL174:AL193)","v":0},null,null,{"$f":"SUM(AM174:AM193)","v":0},{"$f":"SUM(AN175:AN193)","v":0},0,0,0,0,0,0,0,0,0,0,0,0,0,0,0,0,0,0,"Rank","Skill","Stat",null,"Lvl","Race","Armor","Item","Total"]
["Circle Lore (Protecting)",{"$f":"VLOOKUP(A174,AllaSkills!$A$3:$BV$319,'Ny NPC'!$A$2+3,FALSE)","v":"2/4"},{"$f":"IF(LEN(B174)=3,LEFT(B174,1),IF(LEN(B174)<3,B174,99))","v":"2"},{"$f":"IF(RIGHT(B174,1)=\"*\",LEFT(B174,1),IF(LEN(B174)=3,RIGHT(B174,1),IF(LEN(B174)<3,B174,RIGHT(B174,2))))","v":"4"},"Magical",null,null,null,null,null,null,null,null,null,null,null,null,null,null,null,null,null,null,null,null,null,null,null,{"$f":"SUM(F174:AB174)","v":0},{"$f":"IF(AC174<1,-25,IF(AC174>30,80+((AC174-30)*0.5),IF(AC174>20,70+(AC174-20),IF(AC174>10,50+((AC174-10)*2),AC174*5))))","v":-25},{"$f":"RE","v":5},{"$f":"HLOOKUP(Yrke,Levelbonus!$B$1:$CR$20,12,FALSE)","v":3},{"$f":"AF174*Level","v":3},{"$f":"IF(ISNUMBER(VLOOKUP($A174,Rasbonus!$A$61:$AM$295,MATCH(Ras,Rasbonus!$A$1:$AM$1,0),FALSE)),VLOOKUP($A174,Rasbonus!$A$61:$AM$295,MATCH(Ras,Rasbonus!$A$1:$AM$1,0),FALSE),\"0\")","v":"0"},null,null,{"$f":"ROUND(AD174+AE174+AG174+AH174+AI174+AJ174,0)","v":-17},{"$f":"IF(F174>2,\"99\",IF(F174<1,0,IF(F174=1,$C174+$C174-$C174,IF(F174=2,$C174+$D174))))","v":0},{"$f":"IF(I174>2,\"99\",IF(I174<1,0,IF(I174=1,$C174+$C174-$C174,IF(I174=2,$C174+$D174))))","v":0},{"$f":"IF(J174>2,\"99\",IF(J174<1,0,IF(J174=1,$C174+$C174-$C174,IF(J174=2,$C174+$D174))))","v":0},0,0,0,0,0,0,0,0,0,0,0,0,0,0,0,0,0,0]
[]
["Circle Lore (Fortitude)",{"$f":"VLOOKUP(A176,AllaSkills!$A$3:$BV$319,'Ny NPC'!$A$2+3,FALSE)","v":"2/4"},{"$f":"IF(LEN(B176)=3,LEFT(B176,1),IF(LEN(B176)<3,B176,99))","v":"2"},{"$f":"IF(RIGHT(B176,1)=\"*\",LEFT(B176,1),IF(LEN(B176)=3,RIGHT(B176,1),IF(LEN(B176)<3,B176,RIGHT(B176,2))))","v":"4"},"Magical",null,null,null,null,null,null,null,null,null,null,null,null,null,null,null,null,null,null,null,null,null,null,null,{"$f":"SUM(F176:AB176)","v":0},{"$f":"IF(AC176<1,-25,IF(AC176>30,80+((AC176-30)*0.5),IF(AC176>20,70+(AC176-20),IF(AC176>10,50+((AC176-10)*2),AC176*5))))","v":-25},{"$f":"RE","v":5},{"$f":"HLOOKUP(Yrke,Levelbonus!$B$1:$CR$20,12,FALSE)","v":3},{"$f":"AF176*Level","v":3},{"$f":"IF(ISNUMBER(VLOOKUP($A176,Rasbonus!$A$61:$AM$295,MATCH(Ras,Rasbonus!$A$1:$AM$1,0),FALSE)),VLOOKUP($A176,Rasbonus!$A$61:$AM$295,MATCH(Ras,Rasbonus!$A$1:$AM$1,0),FALSE),\"0\")","v":"0"},null,null,{"$f":"ROUND(AD176+AE176+AG176+AH176+AI176+AJ176,0)","v":-17},{"$f":"IF(F176>2,\"99\",IF(F176<1,0,IF(F176=1,$C176+$C176-$C176,IF(F176=2,$C176+$D176))))","v":0},{"$f":"IF(I176>2,\"99\",IF(I176<1,0,IF(I176=1,$C176+$C176-$C176,IF(I176=2,$C176+$D176))))","v":0},{"$f":"IF(J176>2,\"99\",IF(J176<1,0,IF(J176=1,$C176+$C176-$C176,IF(J176=2,$C176+$D176))))","v":0},{"$f":"IF(K176>2,\"99\",IF(K176<1,0,IF(K176=1,$C176+$C176-$C176,IF(K176=2,$C176+$D176))))","v":0},{"$f":"IF(L176>2,\"99\",IF(L176<1,0,IF(L176=1,$C176+$C176-$C176,IF(L176=2,$C176+$D176))))","v":0},{"$f":"IF(M176>2,\"99\",IF(M176<1,0,IF(M176=1,$C176+$C176-$C176,IF(M176=2,$C176+$D176))))","v":0},{"$f":"IF(N176>2,\"99\",IF(N176<1,0,IF(N176=1,$C176+$C176-$C176,IF(N176=2,$C176+$D176))))","v":0},{"$f":"IF(O176>2,\"99\",IF(O176<1,0,IF(O176=1,$C176+$C176-$C176,IF(O176=2,$C176+$D176))))","v":0},{"$f":"IF(P176>2,\"99\",IF(P176<1,0,IF(P176=1,$C176+$C176-$C176,IF(P176=2,$C176+$D176))))","v":0},{"$f":"IF(Q176>2,\"99\",IF(Q176<1,0,IF(Q176=1,$C176+$C176-$C176,IF(Q176=2,$C176+$D176))))","v":0},{"$f":"IF(R176>2,\"99\",IF(R176<1,0,IF(R176=1,$C176+$C176-$C176,IF(R176=2,$C176+$D176))))","v":0},{"$f":"IF(S176>2,\"99\",IF(S176<1,0,IF(S176=1,$C176+$C176-$C176,IF(S176=2,$C176+$D176))))","v":0},{"$f":"IF(T176>2,\"99\",IF(T176<1,0,IF(T176=1,$C176+$C176-$C176,IF(T176=2,$C176+$D176))))","v":0},{"$f":"IF(U176>2,\"99\",IF(U176<1,0,IF(U176=1,$C176+$C176-$C176,IF(U176=2,$C176+$D176))))","v":0},{"$f":"IF(V176>2,\"99\",IF(V176<1,0,IF(V176=1,$C176+$C176-$C176,IF(V176=2,$C176+$D176))))","v":0},{"$f":"IF(W176>2,\"99\",IF(W176<1,0,IF(W176=1,$C176+$C176-$C176,IF(W176=2,$C176+$D176))))","v":0},{"$f":"IF(X176>2,\"99\",IF(X176<1,0,IF(X176=1,$C176+$C176-$C176,IF(X176=2,$C176+$D176))))","v":0},{"$f":"IF(Y176>2,\"99\",IF(Y176<1,0,IF(Y176=1,$C176+$C176-$C176,IF(Y176=2,$C176+$D176))))","v":0},{"$f":"IF(Z176>2,\"99\",IF(Z176<1,0,IF(Z176=1,$C176+$C176-$C176,IF(Z176=2,$C176+$D176))))","v":0},{"$f":"IF(AA176>2,\"99\",IF(AA176<1,0,IF(AA176=1,$C176+$C176-$C176,IF(AA176=2,$C176+$D176))))","v":0},{"$f":"IF(AB176>2,\"99\",IF(AB176<1,0,IF(AB176=1,$C176+$C176-$C176,IF(AB176=2,$C176+$D176))))","v":0}]
["Divination",{"$f":"VLOOKUP(A177,AllaSkills!$A$3:$BV$319,'Ny NPC'!$A$2+3,FALSE)","v":"2/4"},"2","4","Magical",null,null,null,null,null,null,null,null,null,null,null,null,null,null,null,null,null,null,null,null,null,null,null,0,{"$f":"IF(AC177<1,-25,IF(AC177>30,80+((AC177-30)*0.5),IF(AC177>20,70+(AC177-20),IF(AC177>10,50+((AC177-10)*2),AC177*5))))","v":-25},{"$f":"(IN+EM)/2","v":5},{"$f":"HLOOKUP(Yrke,Levelbonus!$B$1:$CR$20,12,FALSE)","v":3},{"$f":"AF177*Level","v":3},{"$f":"IF(ISNUMBER(VLOOKUP($A177,Rasbonus!$A$61:$AM$295,MATCH(Ras,Rasbonus!$A$1:$AM$1,0),FALSE)),VLOOKUP($A177,Rasbonus!$A$61:$AM$295,MATCH(Ras,Rasbonus!$A$1:$AM$1,0),FALSE),\"0\")","v":"0"},null,null,{"$f":"ROUND(AD177+AE177+AG177+AH177+AI177+AJ177,0)","v":-17},{"$f":"IF(F177>2,\"99\",IF(F177<1,0,IF(F177=1,$C177+$C177-$C177,IF(F177=2,$C177+$D177))))","v":0},0,0,0,0,0,0,0,0,0,0,0,0,0,0,0,0,0,0,0,0]
["Magical Expertise",{"$f":"VLOOKUP(A178,AllaSkills!$A$3:$BV$319,'Ny NPC'!$A$2+3,FALSE)","v":"2/5"},"2","5","Magical",null,null,null,null,null,null,null,null,null,null,null,null,null,null,null,null,null,null,null,null,null,null,null,0,null,null,null,null,null,null,null,null,0,0,0,0,0,0,0,0,0,0,0,0,0,0,0,0,0,0,0,0,0]
["Magical Rituals",{"$f":"VLOOKUP(A179,AllaSkills!$A$3:$BV$319,'Ny NPC'!$A$2+3,FALSE)","v":"1/4"},"1","4","Magical",null,null,null,null,null,null,null,null,null,null,null,null,null,null,null,null,null,null,null,null,null,null,null,0,{"$f":"IF(AC179<1,-25,IF(AC179>30,80+((AC179-30)*0.5),IF(AC179>20,70+(AC179-20),IF(AC179>10,50+((AC179-10)*2),AC179*5))))","v":-25},{"$f":"(IN+RE)/2","v":5},{"$f":"HLOOKUP(Yrke,Levelbonus!$B$1:$CR$20,12,FALSE)","v":3},{"$f":"AF179*Level","v":3},{"$f":"IF(ISNUMBER(VLOOKUP($A179,Rasbonus!$A$61:$AM$295,MATCH(Ras,Rasbonus!$A$1:$AM$1,0),FALSE)),VLOOKUP($A179,Rasbonus!$A$61:$AM$295,MATCH(Ras,Rasbonus!$A$1:$AM$1,0),FALSE),\"0\")","v":"0"},null,null,{"$f":"ROUND(AD179+AE179+AG179+AH179+AI179+AJ179,0)","v":-17},0,0,0,0,0,0,0,0,0,0,0,0,0,0,0,0,0,0,0,0,0]
["Magnitude",{"$f":"VLOOKUP(A180,AllaSkills!$A$3:$BV$319,'Ny NPC'!$A$2+3,FALSE)","v":"3/8"},"3","8","Magical",null,null,null,null,null,null,null,null,null,null,null,null,null,null,null,null,null,null,null,null,null,null,null,0,{"$f":"IF(AC180<1,-25,IF(AC180>30,80+((AC180-30)*0.5),IF(AC180>20,70+(AC180-20),IF(AC180>10,50+((AC180-10)*2),AC180*5))))","v":-25},{"$f":"(EM+IN)/2","v":5},{"$f":"HLOOKUP(Yrke,Levelbonus!$B$1:$CR$20,12,FALSE)","v":3},{"$f":"AF180*Level","v":3},{"$f":"IF(ISNUMBER(VLOOKUP($A180,Rasbonus!$A$61:$AM$295,MATCH(Ras,Rasbonus!$A$1:$AM$1,0),FALSE)),VLOOKUP($A180,Rasbonus!$A$61:$AM$295,MATCH(Ras,Rasbonus!$A$1:$AM$1,0),FALSE),\"0\")","v":"0"},null,null,{"$f":"ROUND(AD180+AE180+AG180+AH180+AI180+AJ180,0)","v":-17},0,0,0,0,0,0,0,0,0,0,0,0,0,0,0,0,0,0,0,0,0]
["Overcasting",{"$f":"VLOOKUP(A181,AllaSkills!$A$3:$BV$319,'Ny NPC'!$A$2+3,FALSE)","v":"2/5"},"2","5","Magical",null,null,null,null,null,null,null,null,null,null,null,null,null,null,null,null,null,null,null,null,null,null,null,0,{"$f":"IF(AC181<1,-25,IF(AC181>30,80+((AC181-30)*0.5),IF(AC181>20,70+(AC181-20),IF(AC181>10,50+((AC181-10)*2),AC181*5))))","v":-25},{"$f":"IF('Ny NPC'!V45=1,IN,IF('Ny NPC'!V45=2,EM,IF('Ny NPC'!V45=3,PR,IF('Ny NPC'!V45=4,(EM+IN)*0.5,IF('Ny NPC'!V45=5,(PR+IN)*0.5,IF('Ny NPC'!V45=6,(EM+PR)*0.5,(EM+IN+PR)*0.33))))))","v":5},{"$f":"HLOOKUP(Yrke,Levelbonus!$B$1:$CR$20,12,FALSE)","v":3},{"$f":"AF181*Level","v":3},{"$f":"IF(ISNUMBER(VLOOKUP($A181,Rasbonus!$A$61:$AM$295,MATCH(Ras,Rasbonus!$A$1:$AM$1,0),FALSE)),VLOOKUP($A181,Rasbonus!$A$61:$AM$295,MATCH(Ras,Rasbonus!$A$1:$AM$1,0),FALSE),\"0\")","v":"0"},null,null,{"$f":"ROUND(AD181+AE181+AG181+AH181+AI181+AJ181,0)","v":-17},0,0,0,0,0,0,0,0,0,0,0,0,0,0,0,0,0,0,0,0,0]
["Power Manipulation",{"$f":"VLOOKUP(A182,AllaSkills!$A$3:$BV$319,'Ny NPC'!$A$2+3,FALSE)","v":"3/6"},"3","6","Magical",null,null,null,null,null,null,null,null,null,null,null,null,null,null,null,null,null,null,null,null,null,null,null,0,null,null,null,null,null,null,null,null,0,0,0,0,0,0,0,0,0,0,0,0,0,0,0,0,0,0,0,0,0]
["Power Perception",{"$f":"VLOOKUP(A183,AllaSkills!$A$3:$BV$319,'Ny NPC'!$A$2+3,FALSE)","v":"1/3"},"1","3","Magical",null,null,null,null,null,null,null,null,null,null,null,null,null,null,null,null,null,null,null,null,null,null,null,0,{"$f":"IF(AC183<1,-25,IF(AC183>30,80+((AC183-30)*0.5),IF(AC183>20,70+(AC183-20),IF(AC183>10,50+((AC183-10)*2),AC183*5))))","v":-25},{"$f":"EM","v":5},{"$f":"HLOOKUP(Yrke,Levelbonus!$B$1:$CR$20,12,FALSE)","v":3},{"$f":"AF183*Level","v":3},{"$f":"IF(ISNUMBER(VLOOKUP($A183,Rasbonus!$A$61:$AM$295,MATCH(Ras,Rasbonus!$A$1:$AM$1,0),FALSE)),VLOOKUP($A183,Rasbonus!$A$61:$AM$295,MATCH(Ras,Rasbonus!$A$1:$AM$1,0),FALSE),\"0\")","v":"0"},null,null,{"$f":"ROUND(AD183+AE183+AG183+AH183+AI183+AJ183,0)","v":-17},0,0,0,0,0,0,0,0,0,0,0,0,0,0,0,0,0,0,0,0,0]
["Power Projection",{"$f":"VLOOKUP(A184,AllaSkills!$A$3:$BV$319,'Ny NPC'!$A$2+3,FALSE)","v":"1/4"},"1","4","Magical",null,null,null,null,null,null,null,null,null,null,null,null,null,null,null,null,null,null,null,null,null,null,null,0,{"$f":"IF(AC184<1,-25,IF(AC184>30,80+((AC184-30)*0.5),IF(AC184>20,70+(AC184-20),IF(AC184>10,50+((AC184-10)*2),AC184*5))))","v":-25},{"$f":"EM","v":5},{"$f":"HLOOKUP(Yrke,Levelbonus!$B$1:$CR$20,12,FALSE)","v":3},3,{"$f":"IF(ISNUMBER(VLOOKUP($A184,Rasbonus!$A$61:$AM$295,MATCH(Ras,Rasbonus!$A$1:$AM$1,0),FALSE)),VLOOKUP($A184,Rasbonus!$A$61:$AM$295,MATCH(Ras,Rasbonus!$A$1:$AM$1,0),FALSE),\"0\")","v":"0"},null,null,-17,0,0,0,0,0,0,0,0,0,0,0,0,0,0,0,0,0,0,0,0,0]
["PP Development",{"$f":"VLOOKUP(A185,AllaSkills!$A$3:$BV$319,'Ny NPC'!$A$2+3,FALSE)","v":"2/5"},"2","5","Magical",null,null,null,null,null,null,null,null,null,null,null,null,null,null,null,null,null,null,null,null,null,null,null,0,{"$f":"(AC185)*3","v":0},{"$f":"IF('Ny NPC'!V45=1,IN/2,IF('Ny NPC'!V45=2,EM/2,IF('Ny NPC'!V45=3,PR/2,IF('Ny NPC'!V45=4,(EM+IN)*0.25,IF('Ny NPC'!V45=5,(PR+IN)*0.25,IF('Ny NPC'!V45=6,(EM+PR)*0.25,(EM+IN+PR)/6))))))","v":2.5},{"$f":"HLOOKUP(Yrke,Levelbonus!$B$1:$CR$20,18,FALSE)","v":2},2,{"$f":"IF(ISNUMBER(VLOOKUP($A185,Rasbonus!$A$61:$AM$295,MATCH(Ras,Rasbonus!$A$1:$AM$1,0),FALSE)),VLOOKUP($A185,Rasbonus!$A$61:$AM$295,MATCH(Ras,Rasbonus!$A$1:$AM$1,0),FALSE),\"0\")","v":"0"},null,null,5,0,0,0,0,0,0,0,0,0,0,0,0,0,0,0,0,0,0,0,0,0]
["Rejuvenation",{"$f":"VLOOKUP(A186,AllaSkills!$A$3:$BV$319,'Ny NPC'!$A$2+3,FALSE)","v":"2/5"},"2","5","Magical",null,null,null,null,null,null,null,null,null,null,null,null,null,null,null,null,null,null,null,null,null,null,null,0,{"$f":"IF(AC186<1,-25,IF(AC186>30,80+((AC186-30)*0.5),IF(AC186>20,70+(AC186-20),IF(AC186>10,50+((AC186-10)*2),AC186*5))))","v":-25},{"$f":"SD","v":5},{"$f":"HLOOKUP(Yrke,Levelbonus!$B$1:$CR$20,12,FALSE)","v":3},3,{"$f":"IF(ISNUMBER(VLOOKUP($A186,Rasbonus!$A$61:$AM$295,MATCH(Ras,Rasbonus!$A$1:$AM$1,0),FALSE)),VLOOKUP($A186,Rasbonus!$A$61:$AM$295,MATCH(Ras,Rasbonus!$A$1:$AM$1,0),FALSE),\"0\")","v":"0"},null,null,-17,0,0,0,0,0,0,0,0,0,0,0,0,0,0,0,0,0,0,0,0,0]
["Scrying",{"$f":"VLOOKUP(A187,AllaSkills!$A$3:$BV$319,'Ny NPC'!$A$2+3,FALSE)","v":"2/4"},"2","4","Magical",null,null,null,null,null,null,null,null,null,null,null,null,null,null,null,null,null,null,null,null,null,null,null,0,-25,{"$f":"(IN+PR)/2","v":7.5},{"$f":"HLOOKUP(Yrke,Levelbonus!$B$1:$CR$20,12,FALSE)","v":3},3,{"$f":"IF(ISNUMBER(VLOOKUP($A187,Rasbonus!$A$61:$AM$295,MATCH(Ras,Rasbonus!$A$1:$AM$1,0),FALSE)),VLOOKUP($A187,Rasbonus!$A$61:$AM$295,MATCH(Ras,Rasbonus!$A$1:$AM$1,0),FALSE),\"0\")","v":"0"},null,null,-15,0,0,0,0,0,0,0,0,0,0,0,0,0,0,0,0,0,0,0,0,0]
["Spell Mastery",{"$f":"VLOOKUP(A188,AllaSkills!$A$3:$BV$319,'Ny NPC'!$A$2+3,FALSE)","v":"2/7"},"2","7","Magical",null,null,null,null,null,null,null,null,null,null,null,null,null,null,null,null,null,null,null,null,null,null,null,0,-25,{"$f":"(EM+PR)/2","v":7.5},{"$f":"HLOOKUP(Yrke,Levelbonus!$B$1:$CR$20,12,FALSE)","v":3},3,{"$f":"IF(ISNUMBER(VLOOKUP($A188,Rasbonus!$A$61:$AM$295,MATCH(Ras,Rasbonus!$A$1:$AM$1,0),FALSE)),VLOOKUP($A188,Rasbonus!$A$61:$AM$295,MATCH(Ras,Rasbonus!$A$1:$AM$1,0),FALSE),\"0\")","v":"0"},null,null,-15,0,0,0,0,0,0,0,0,0,0,0,0,0,0,0,0,0,0,0,0,0]
["Summoning",{"$f":"VLOOKUP(A189,AllaSkills!$A$3:$BV$319,'Ny NPC'!$A$2+3,FALSE)","v":"2/4"},"2","4","Magical",null,null,null,null,null,null,null,null,null,null,null,null,null,null,null,null,null,null,null,null,null,null,null,0,-25,{"$f":"(EM+RE)/2","v":5},{"$f":"HLOOKUP(Yrke,Levelbonus!$B$1:$CR$20,12,FALSE)","v":3},3,{"$f":"IF(ISNUMBER(VLOOKUP($A189,Rasbonus!$A$61:$AM$295,MATCH(Ras,Rasbonus!$A$1:$AM$1,0),FALSE)),VLOOKUP($A189,Rasbonus!$A$61:$AM$295,MATCH(Ras,Rasbonus!$A$1:$AM$1,0),FALSE),\"0\")","v":"0"},null,null,-17,0,0,0,0,0,0,0,0,0,0,0,0,0,0,0,0,0,0,0,0,0]
["Symbol Lore",{"$f":"VLOOKUP(A190,AllaSkills!$A$3:$BV$319,'Ny NPC'!$A$2+3,FALSE)","v":"1/4"},"1","4","Magical",null,null,null,null,null,null,null,null,null,null,null,null,null,null,null,null,null,null,null,null,null,null,null,0,-25,{"$f":"RE","v":5},{"$f":"HLOOKUP(Yrke,Levelbonus!$B$1:$CR$20,12,FALSE)","v":3},3,{"$f":"IF(ISNUMBER(VLOOKUP($A190,Rasbonus!$A$61:$AM$295,MATCH(Ras,Rasbonus!$A$1:$AM$1,0),FALSE)),VLOOKUP($A190,Rasbonus!$A$61:$AM$295,MATCH(Ras,Rasbonus!$A$1:$AM$1,0),FALSE),\"0\")","v":"0"},null,null,-17,0,0,0,0,0,0,0,0,0,0,0,0,0,0,0,0,0,0,0,0,0]
["Targeting Skill",{"$f":"VLOOKUP(A191,AllaSkills!$A$3:$BV$319,'Ny NPC'!$A$2+3,FALSE)","v":"2/5"},"2","5","Magical",null,null,null,null,null,null,null,null,null,null,null,null,null,null,null,null,null,null,null,null,null,null,null,0,-25,{"$f":"IN","v":5},{"$f":"HLOOKUP(Yrke,Levelbonus!$B$1:$CR$20,12,FALSE)","v":3},3,{"$f":"IF(ISNUMBER(VLOOKUP($A191,Rasbonus!$A$61:$AM$295,MATCH(Ras,Rasbonus!$A$1:$AM$1,0),FALSE)),VLOOKUP($A191,Rasbonus!$A$61:$AM$295,MATCH(Ras,Rasbonus!$A$1:$AM$1,0),FALSE),\"0\")","v":"0"},null,null,-17,0,0,0,0,0,0,0,0,0,0,0,0,0,0,0,0,0,0,0,0,0]
["Transcend Armor",{"$f":"VLOOKUP(A192,AllaSkills!$A$3:$BV$319,'Ny NPC'!$A$2+3,FALSE)","v":"4"},"4","4","Magical",null,null,null,null,null,null,null,null,null,null,null,null,null,null,null,null,null,null,null,null,null,null,null,0,-25,{"$f":"IF('Ny NPC'!V45=1,IN,IF('Ny NPC'!V45=2,EM,IF('Ny NPC'!V45=3,PR,IF('Ny NPC'!V45=4,(EM+IN)*0.5,IF('Ny NPC'!V45=5,(PR+IN)*0.5,IF('Ny NPC'!V45=6,(EM+PR)*0.5,(EM+IN+PR)*0.33))))))","v":5},{"$f":"HLOOKUP(Yrke,Levelbonus!$B$1:$CR$20,12,FALSE)","v":3},3,{"$f":"IF(ISNUMBER(VLOOKUP($A192,Rasbonus!$A$61:$AM$295,MATCH(Ras,Rasbonus!$A$1:$AM$1,0),FALSE)),VLOOKUP($A192,Rasbonus!$A$61:$AM$295,MATCH(Ras,Rasbonus!$A$1:$AM$1,0),FALSE),\"0\")","v":"0"},null,null,-17,0,0,0,0,0,0,0,0,0,0,0,0,0,0,0,0,0,0,0,0,0]
["Warding Lore",{"$f":"VLOOKUP(A193,AllaSkills!$A$3:$BV$319,'Ny NPC'!$A$2+3,FALSE)","v":"1/4"},"1","4","Magical",null,null,null,null,null,null,null,null,null,null,null,null,null,null,null,null,null,null,null,null,null,null,null,0,-25,{"$f":"(RE+IN)/2","v":5},{"$f":"HLOOKUP(Yrke,Levelbonus!$B$1:$CR$20,12,FALSE)","v":3},3,{"$f":"IF(ISNUMBER(VLOOKUP($A193,Rasbonus!$A$61:$AM$295,MATCH(Ras,Rasbonus!$A$1:$AM$1,0),FALSE)),VLOOKUP($A193,Rasbonus!$A$61:$AM$295,MATCH(Ras,Rasbonus!$A$1:$AM$1,0),FALSE),\"0\")","v":"0"},null,null,-17,0,0,0,0,0,0,0,0,0,0,0,0,0,0,0,0,0,0,0,0,0]
[]
[]
["Medical",{"$f":"HLOOKUP(Diverse!$G$2,'2nd'!$B$1:$CR$18,13,FALSE)","v":0},null,null,null,{"$f":"SUM(AL197:AL206)","v":0},null,null,{"$f":"SUM(AM197:AM206)","v":0},0,0,0,0,0,0,0,0,0,0,0,0,0,0,0,0,0,0,0,"Rank","Skill","Stat",null,"Lvl","Race","Armor","Item","Total"]
["Animal healing",{"$f":"VLOOKUP(A197,AllaSkills!$A$3:$BV$319,'Ny NPC'!$A$2+3,FALSE)","v":"2/5"},{"$f":"IF(LEN(B197)=3,LEFT(B197,1),IF(LEN(B197)<3,B197,99))","v":"2"},{"$f":"IF(RIGHT(B197,1)=\"*\",LEFT(B197,1),IF(LEN(B197)=3,RIGHT(B197,1),IF(LEN(B197)<3,B197,RIGHT(B197,2))))","v":"5"},"Medical",null,null,null,null,null,null,null,null,null,null,null,null,null,null,null,null,null,null,null,null,null,null,null,{"$f":"SUM(F197:AB197)","v":0},{"$f":"IF(AC197<1,-25,IF(AC197>30,80+((AC197-30)*0.5),IF(AC197>20,70+(AC197-20),IF(AC197>10,50+((AC197-10)*2),AC197*5))))","v":-25},{"$f":"(EM+RE)/2","v":5},{"$f":"HLOOKUP(Yrke,Levelbonus!$B$1:$CR$20,13,FALSE)","v":0},{"$f":"AF197*Level","v":0},{"$f":"IF(ISNUMBER(VLOOKUP($A197,Rasbonus!$A$61:$AM$295,MATCH(Ras,Rasbonus!$A$1:$AM$1,0),FALSE)),VLOOKUP($A197,Rasbonus!$A$61:$AM$295,MATCH(Ras,Rasbonus!$A$1:$AM$1,0),FALSE),\"0\")","v":"0"},null,null,{"$f":"ROUND(AD197+AE197+AG197+AH197+AI197+AJ197,0)","v":-20},{"$f":"IF(F197>2,\"99\",IF(F197<1,0,IF(F197=1,$C197+$C197-$C197,IF(F197=2,$C197+$D197))))","v":0},{"$f":"IF(I197>2,\"99\",IF(I197<1,0,IF(I197=1,$C197+$C197-$C197,IF(I197=2,$C197+$D197))))","v":0},{"$f":"IF(J197>2,\"99\",IF(J197<1,0,IF(J197=1,$C197+$C197-$C197,IF(J197=2,$C197+$D197))))","v":0},{"$f":"IF(K197>2,\"99\",IF(K197<1,0,IF(K197=1,$C197+$C197-$C197,IF(K197=2,$C197+$D197))))","v":0},{"$f":"IF(L197>2,\"99\",IF(L197<1,0,IF(L197=1,$C197+$C197-$C197,IF(L197=2,$C197+$D197))))","v":0},{"$f":"IF(M197>2,\"99\",IF(M197<1,0,IF(M197=1,$C197+$C197-$C197,IF(M197=2,$C197+$D197))))","v":0},{"$f":"IF(N197>2,\"99\",IF(N197<1,0,IF(N197=1,$C197+$C197-$C197,IF(N197=2,$C197+$D197))))","v":0},{"$f":"IF(O197>2,\"99\",IF(O197<1,0,IF(O197=1,$C197+$C197-$C197,IF(O197=2,$C197+$D197))))","v":0},{"$f":"IF(P197>2,\"99\",IF(P197<1,0,IF(P197=1,$C197+$C197-$C197,IF(P197=2,$C197+$D197))))","v":0},{"$f":"IF(Q197>2,\"99\",IF(Q197<1,0,IF(Q197=1,$C197+$C197-$C197,IF(Q197=2,$C197+$D197))))","v":0},{"$f":"IF(R197>2,\"99\",IF(R197<1,0,IF(R197=1,$C197+$C197-$C197,IF(R197=2,$C197+$D197))))","v":0},{"$f":"IF(S197>2,\"99\",IF(S197<1,0,IF(S197=1,$C197+$C197-$C197,IF(S197=2,$C197+$D197))))","v":0},{"$f":"IF(T197>2,\"99\",IF(T197<1,0,IF(T197=1,$C197+$C197-$C197,IF(T197=2,$C197+$D197))))","v":0},{"$f":"IF(U197>2,\"99\",IF(U197<1,0,IF(U197=1,$C197+$C197-$C197,IF(U197=2,$C197+$D197))))","v":0},{"$f":"IF(V197>2,\"99\",IF(V197<1,0,IF(V197=1,$C197+$C197-$C197,IF(V197=2,$C197+$D197))))","v":0},{"$f":"IF(W197>2,\"99\",IF(W197<1,0,IF(W197=1,$C197+$C197-$C197,IF(W197=2,$C197+$D197))))","v":0},{"$f":"IF(X197>2,\"99\",IF(X197<1,0,IF(X197=1,$C197+$C197-$C197,IF(X197=2,$C197+$D197))))","v":0},{"$f":"IF(Y197>2,\"99\",IF(Y197<1,0,IF(Y197=1,$C197+$C197-$C197,IF(Y197=2,$C197+$D197))))","v":0},{"$f":"IF(Z197>2,\"99\",IF(Z197<1,0,IF(Z197=1,$C197+$C197-$C197,IF(Z197=2,$C197+$D197))))","v":0},{"$f":"IF(AA197>2,\"99\",IF(AA197<1,0,IF(AA197=1,$C197+$C197-$C197,IF(AA197=2,$C197+$D197))))","v":0},{"$f":"IF(AB197>2,\"99\",IF(AB197<1,0,IF(AB197=1,$C197+$C197-$C197,IF(AB197=2,$C197+$D197))))","v":0}]
["Dentistry",{"$f":"VLOOKUP(A198,AllaSkills!$A$3:$BV$319,'Ny NPC'!$A$2+3,FALSE)","v":"5"},"5","5","Medical",null,null,null,null,null,null,null,null,null,null,null,null,null,null,null,null,null,null,null,null,null,null,null,0,-25,{"$f":"(RE+AG)/2","v":5},{"$f":"HLOOKUP(Yrke,Levelbonus!$B$1:$CR$20,13,FALSE)","v":0},0,{"$f":"IF(ISNUMBER(VLOOKUP($A198,Rasbonus!$A$61:$AM$295,MATCH(Ras,Rasbonus!$A$1:$AM$1,0),FALSE)),VLOOKUP($A198,Rasbonus!$A$61:$AM$295,MATCH(Ras,Rasbonus!$A$1:$AM$1,0),FALSE),\"0\")","v":"0"},null,null,-20,0,0,0,0,0,0,0,0,0,0,0,0,0,0,0,0,0,0,0,0,0]
["Diagnostics",{"$f":"VLOOKUP(A199,AllaSkills!$A$3:$BV$319,'Ny NPC'!$A$2+3,FALSE)","v":"2"},"2","2","Medical",null,null,null,null,null,null,null,null,null,null,null,null,null,null,null,null,null,null,null,null,null,null,null,0,-25,{"$f":"(IN+RE)/2","v":5},{"$f":"HLOOKUP(Yrke,Levelbonus!$B$1:$CR$20,13,FALSE)","v":0},0,{"$f":"IF(ISNUMBER(VLOOKUP($A199,Rasbonus!$A$61:$AM$295,MATCH(Ras,Rasbonus!$A$1:$AM$1,0),FALSE)),VLOOKUP($A199,Rasbonus!$A$61:$AM$295,MATCH(Ras,Rasbonus!$A$1:$AM$1,0),FALSE),\"0\")","v":"0"},null,null,-20,0,0,0,0,0,0,0,0,0,0,0,0,0,0,0,0,0,0,0,0,0]
["Drug Tolerance",{"$f":"VLOOKUP(A200,AllaSkills!$A$3:$BV$319,'Ny NPC'!$A$2+3,FALSE)","v":"2/5"},"2","5","Medical",null,null,null,null,null,null,null,null,null,null,null,null,null,null,null,null,null,null,null,null,null,null,null,0,-25,null,{"$f":"HLOOKUP(Yrke,Levelbonus!$B$1:$CR$20,13,FALSE)","v":0},0,{"$f":"IF(ISNUMBER(VLOOKUP($A200,Rasbonus!$A$61:$AM$295,MATCH(Ras,Rasbonus!$A$1:$AM$1,0),FALSE)),VLOOKUP($A200,Rasbonus!$A$61:$AM$295,MATCH(Ras,Rasbonus!$A$1:$AM$1,0),FALSE),\"0\")","v":"0"},null,null,-25,0,0,0,0,0,0,0,0,0,0,0,0,0,0,0,0,0,0,0,0,0]
[]
["First Aid",{"$f":"VLOOKUP(A202,AllaSkills!$A$3:$BV$319,'Ny NPC'!$A$2+3,FALSE)","v":"2/5"},"2","5","Medical",null,null,null,null,null,null,null,null,null,null,null,null,null,null,null,null,null,null,null,null,null,null,null,0,-25,{"$f":"(SD+EM)/2","v":5},{"$f":"HLOOKUP(Yrke,Levelbonus!$B$1:$CR$20,13,FALSE)","v":0},0,{"$f":"IF(ISNUMBER(VLOOKUP($A202,Rasbonus!$A$61:$AM$295,MATCH(Ras,Rasbonus!$A$1:$AM$1,0),FALSE)),VLOOKUP($A202,Rasbonus!$A$61:$AM$295,MATCH(Ras,Rasbonus!$A$1:$AM$1,0),FALSE),\"0\")","v":"0"},null,null,-20,0,0,0,0,0,0,0,0,0,0,0,0,0,0,0,0,0,0,0,0,0]
["Hypnosis",{"$f":"VLOOKUP(A203,AllaSkills!$A$3:$BV$319,'Ny NPC'!$A$2+3,FALSE)","v":"2/4"},"2","4","Medical",null,null,null,null,null,null,null,null,null,null,null,null,null,null,null,null,null,null,null,null,null,null,null,0,-25,{"$f":"(PR+SD)/2","v":7.5},{"$f":"HLOOKUP(Yrke,Levelbonus!$B$1:$CR$20,13,FALSE)","v":0},0,{"$f":"IF(ISNUMBER(VLOOKUP($A203,Rasbonus!$A$61:$AM$295,MATCH(Ras,Rasbonus!$A$1:$AM$1,0),FALSE)),VLOOKUP($A203,Rasbonus!$A$61:$AM$295,MATCH(Ras,Rasbonus!$A$1:$AM$1,0),FALSE),\"0\")","v":"0"},null,null,-18,0,0,0,0,0,0,0,0,0,0,0,0,0,0,0,0,0,0,0,0,0]
["Midwifery",{"$f":"VLOOKUP(A204,AllaSkills!$A$3:$BV$319,'Ny NPC'!$A$2+3,FALSE)","v":"4"},"4","4","Medical",null,null,null,null,null,null,null,null,null,null,null,null,null,null,null,null,null,null,null,null,null,null,null,0,-25,{"$f":"(EM+RE+IN)/3","v":5},{"$f":"HLOOKUP(Yrke,Levelbonus!$B$1:$CR$20,13,FALSE)","v":0},0,{"$f":"IF(ISNUMBER(VLOOKUP($A204,Rasbonus!$A$61:$AM$295,MATCH(Ras,Rasbonus!$A$1:$AM$1,0),FALSE)),VLOOKUP($A204,Rasbonus!$A$61:$AM$295,MATCH(Ras,Rasbonus!$A$1:$AM$1,0),FALSE),\"0\")","v":"0"},null,null,-20,0,0,0,0,0,0,0,0,0,0,0,0,0,0,0,0,0,0,0,0,0]
["Second Aid",{"$f":"VLOOKUP(A205,AllaSkills!$A$3:$BV$319,'Ny NPC'!$A$2+3,FALSE)","v":"3/6"},"3","6","Medical",null,null,null,null,null,null,null,null,null,null,null,null,null,null,null,null,null,null,null,null,null,null,null,0,-25,{"$f":"(SD+EM+IN)/3","v":5},{"$f":"HLOOKUP(Yrke,Levelbonus!$B$1:$CR$20,13,FALSE)","v":0},0,{"$f":"IF(ISNUMBER(VLOOKUP($A205,Rasbonus!$A$61:$AM$295,MATCH(Ras,Rasbonus!$A$1:$AM$1,0),FALSE)),VLOOKUP($A205,Rasbonus!$A$61:$AM$295,MATCH(Ras,Rasbonus!$A$1:$AM$1,0),FALSE),\"0\")","v":"0"},null,null,-20,0,0,0,0,0,0,0,0,0,0,0,0,0,0,0,0,0,0,0,0,0]
["Surgery",{"$f":"VLOOKUP(A206,AllaSkills!$A$3:$BV$319,'Ny NPC'!$A$2+3,FALSE)","v":"5"},{"$f":"IF(LEN(B206)=3,LEFT(B206,1),IF(LEN(B206)<3,B206,99))","v":"5"},{"$f":"IF(RIGHT(B206,1)=\"*\",LEFT(B206,1),IF(LEN(B206)=3,RIGHT(B206,1),IF(LEN(B206)<3,B206,RIGHT(B206,2))))","v":"5"},"Medical",null,null,null,null,null,null,null,null,null,null,null,null,null,null,null,null,null,null,null,null,null,null,null,{"$f":"SUM(F206:AB206)","v":0},{"$f":"IF(AC206<1,-25,IF(AC206>30,80+((AC206-30)*0.5),IF(AC206>20,70+(AC206-20),IF(AC206>10,50+((AC206-10)*2),AC206*5))))","v":-25},{"$f":"(SD+EM+IN)/3","v":5},{"$f":"HLOOKUP(Yrke,Levelbonus!$B$1:$CR$20,13,FALSE)","v":0},{"$f":"AF206*Level","v":0},{"$f":"IF(ISNUMBER(VLOOKUP($A206,Rasbonus!$A$61:$AM$295,MATCH(Ras,Rasbonus!$A$1:$AM$1,0),FALSE)),VLOOKUP($A206,Rasbonus!$A$61:$AM$295,MATCH(Ras,Rasbonus!$A$1:$AM$1,0),FALSE),\"0\")","v":"0"},null,null,{"$f":"ROUND(AD206+AE206+AG206+AH206+AI206+AJ206,0)","v":-20},0,0,0,0,0,0,0,0,0,0,0,0,0,0,0,0,0,0,0,0,0]
[]
["Perception",{"$f":"HLOOKUP(Diverse!$G$2,'2nd'!$B$1:$CR$18,14,FALSE)","v":5},null,null,null,{"$f":"SUM(AL209:AL216)","v":0},null,null,{"$f":"SUM(AM209:AM216)","v":0},0,0,0,0,0,0,0,0,0,0,0,0,0,0,0,0,0,0,0,"Rank","Skill","Stat",null,"Lvl","Race","Armor","Item","Total"]
["Awakening",{"$f":"VLOOKUP(A209,AllaSkills!$A$3:$BV$319,'Ny NPC'!$A$2+3,FALSE)","v":"18"},"18","18","Perception",null,null,null,null,null,null,null,null,null,null,null,null,null,null,null,null,null,null,null,null,null,null,null,0,-25,{"$f":"IN","v":5},{"$f":"HLOOKUP(Yrke,Levelbonus!$B$1:$CR$20,14,FALSE)","v":1},1,{"$f":"IF(ISNUMBER(VLOOKUP($A209,Rasbonus!$A$61:$AM$295,MATCH(Ras,Rasbonus!$A$1:$AM$1,0),FALSE)),VLOOKUP($A209,Rasbonus!$A$61:$AM$295,MATCH(Ras,Rasbonus!$A$1:$AM$1,0),FALSE),\"0\")","v":"0"},null,null,-19,{"$f":"IF(F209>2,\"99\",IF(F209<1,0,IF(F209=1,$C209+$C209-$C209,IF(F209=2,$C209+$D209))))","v":0},{"$f":"IF(I209>2,\"99\",IF(I209<1,0,IF(I209=1,$C209+$C209-$C209,IF(I209=2,$C209+$D209))))","v":0},0,0,0,0,0,0,0,0,0,{"$f":"IF(S209>2,\"99\",IF(S209<1,0,IF(S209=1,$C209+$C209-$C209,IF(S209=2,$C209+$D209))))","v":0},0,0,0,0,0,0,0,0,0]
["Direction Sense",{"$f":"VLOOKUP(A210,AllaSkills!$A$3:$BV$319,'Ny NPC'!$A$2+3,FALSE)","v":"2/4"},"2","4","Perception",null,null,null,null,null,null,null,null,null,null,null,null,null,null,null,null,null,null,null,null,null,null,null,0,-25,{"$f":"(IN+RE)/2","v":5},{"$f":"HLOOKUP(Yrke,Levelbonus!$B$1:$CR$20,14,FALSE)","v":1},1,{"$f":"IF(ISNUMBER(VLOOKUP($A210,Rasbonus!$A$61:$AM$295,MATCH(Ras,Rasbonus!$A$1:$AM$1,0),FALSE)),VLOOKUP($A210,Rasbonus!$A$61:$AM$295,MATCH(Ras,Rasbonus!$A$1:$AM$1,0),FALSE),\"0\")","v":"0"},null,null,-19,0,0,0,0,0,0,0,0,0,0,0,0,0,0,0,0,0,0,0,0,0]
["Lie Perception",{"$f":"VLOOKUP(A211,AllaSkills!$A$3:$BV$319,'Ny NPC'!$A$2+3,FALSE)","v":"3/5"},"3","5","Perception",null,null,null,null,null,null,null,null,null,null,null,null,null,null,null,null,null,null,null,null,null,null,null,0,-25,{"$f":"(IN+RE)/2","v":5},{"$f":"HLOOKUP(Yrke,Levelbonus!$B$1:$CR$20,14,FALSE)","v":1},1,{"$f":"IF(ISNUMBER(VLOOKUP($A211,Rasbonus!$A$61:$AM$295,MATCH(Ras,Rasbonus!$A$1:$AM$1,0),FALSE)),VLOOKUP($A211,Rasbonus!$A$61:$AM$295,MATCH(Ras,Rasbonus!$A$1:$AM$1,0),FALSE),\"0\")","v":"0"},null,null,-19,0,0,0,0,0,0,0,0,0,0,0,0,0,0,0,0,0,0,0,0,0]
["Poison Perception",{"$f":"VLOOKUP(A212,AllaSkills!$A$3:$BV$319,'Ny NPC'!$A$2+3,FALSE)","v":"1/4"},"1","4","Perception",null,null,null,null,null,null,null,null,null,null,null,null,null,null,null,null,null,null,null,null,null,null,null,0,-25,{"$f":"(IN+RE)/2","v":5},{"$f":"HLOOKUP(Yrke,Levelbonus!$B$1:$CR$20,14,FALSE)","v":1},1,{"$f":"IF(ISNUMBER(VLOOKUP($A212,Rasbonus!$A$61:$AM$295,MATCH(Ras,Rasbonus!$A$1:$AM$1,0),FALSE)),VLOOKUP($A212,Rasbonus!$A$61:$AM$295,MATCH(Ras,Rasbonus!$A$1:$AM$1,0),FALSE),\"0\")","v":"0"},null,null,-19,0,0,0,0,0,0,0,0,0,0,0,0,0,0,0,0,0,0,0,0,0]
["Sense Ambush",{"$f":"VLOOKUP(A213,AllaSkills!$A$3:$BV$319,'Ny NPC'!$A$2+3,FALSE)","v":"3"},"3","3","Perception",null,null,null,null,null,null,null,null,null,null,null,null,null,null,null,null,null,null,null,null,null,null,null,0,-25,{"$f":"(IN+RE)/2","v":5},{"$f":"HLOOKUP(Yrke,Levelbonus!$B$1:$CR$20,14,FALSE)","v":1},1,{"$f":"IF(ISNUMBER(VLOOKUP($A213,Rasbonus!$A$61:$AM$295,MATCH(Ras,Rasbonus!$A$1:$AM$1,0),FALSE)),VLOOKUP($A213,Rasbonus!$A$61:$AM$295,MATCH(Ras,Rasbonus!$A$1:$AM$1,0),FALSE),\"0\")","v":"0"},null,null,-19,0,0,0,0,0,0,0,0,0,0,0,0,0,0,0,0,0,0,0,0,0]
["Surveillance",{"$f":"VLOOKUP(A214,AllaSkills!$A$3:$BV$319,'Ny NPC'!$A$2+3,FALSE)","v":"2/6"},"2","6","Perception",null,null,null,null,null,null,null,null,null,null,null,null,null,null,null,null,null,null,null,null,null,null,null,0,-25,{"$f":"(IN+SD)/2","v":5},{"$f":"HLOOKUP(Yrke,Levelbonus!$B$1:$CR$20,14,FALSE)","v":1},1,{"$f":"IF(ISNUMBER(VLOOKUP($A214,Rasbonus!$A$61:$AM$295,MATCH(Ras,Rasbonus!$A$1:$AM$1,0),FALSE)),VLOOKUP($A214,Rasbonus!$A$61:$AM$295,MATCH(Ras,Rasbonus!$A$1:$AM$1,0),FALSE),\"0\")","v":"0"},null,null,-19,0,0,0,0,0,0,0,0,0,0,0,0,0,0,0,0,0,0,0,0,0]
["Time Sense",{"$f":"VLOOKUP(A215,AllaSkills!$A$3:$BV$319,'Ny NPC'!$A$2+3,FALSE)","v":"1/3"},"1","3","Perception",null,null,null,null,null,null,null,null,null,null,null,null,null,null,null,null,null,null,null,null,null,null,null,0,-25,{"$f":"(IN+RE)/2","v":5},{"$f":"HLOOKUP(Yrke,Levelbonus!$B$1:$CR$20,14,FALSE)","v":1},1,{"$f":"IF(ISNUMBER(VLOOKUP($A215,Rasbonus!$A$61:$AM$295,MATCH(Ras,Rasbonus!$A$1:$AM$1,0),FALSE)),VLOOKUP($A215,Rasbonus!$A$61:$AM$295,MATCH(Ras,Rasbonus!$A$1:$AM$1,0),FALSE),\"0\")","v":"0"},null,null,-19,0,0,0,0,0,0,0,0,0,0,0,0,0,0,0,0,0,0,0,0,0]
["Tracking",{"$f":"VLOOKUP(A216,AllaSkills!$A$3:$BV$319,'Ny NPC'!$A$2+3,FALSE)","v":"3"},{"$f":"IF(LEN(B216)=3,LEFT(B216,1),IF(LEN(B216)<3,B216,99))","v":"3"},{"$f":"IF(RIGHT(B216,1)=\"*\",LEFT(B216,1),IF(LEN(B216)=3,RIGHT(B216,1),IF(LEN(B216)<3,B216,RIGHT(B216,2))))","v":"3"},"Perception",null,null,null,null,null,null,null,null,null,null,null,null,null,null,null,null,null,null,null,null,null,null,null,{"$f":"SUM(F216:AB216)","v":0},{"$f":"IF(AC216<1,-25,IF(AC216>30,80+((AC216-30)*0.5),IF(AC216>20,70+(AC216-20),IF(AC216>10,50+((AC216-10)*2),AC216*5))))","v":-25},{"$f":"(IN+RE)/2","v":5},{"$f":"HLOOKUP(Yrke,Levelbonus!$B$1:$CR$20,14,FALSE)","v":1},{"$f":"AF216*Level","v":1},{"$f":"IF(ISNUMBER(VLOOKUP($A216,Rasbonus!$A$61:$AM$295,MATCH(Ras,Rasbonus!$A$1:$AM$1,0),FALSE)),VLOOKUP($A216,Rasbonus!$A$61:$AM$295,MATCH(Ras,Rasbonus!$A$1:$AM$1,0),FALSE),\"0\")","v":10},null,null,{"$f":"ROUND(AD216+AE216+AG216+AH216+AI216+AJ216,0)","v":-9},{"$f":"IF(F217>2,\"99\",IF(F217<1,0,IF(F217=1,$C217+$C217-$C217,IF(F217=2,$C217+$D217))))","v":0},{"$f":"IF(I217>2,\"99\",IF(I217<1,0,IF(I217=1,$C217+$C217-$C217,IF(I217=2,$C217+$D217))))","v":0},0,0,0,0,0,0,0,0,0,0,0,0,0,0,0,0,0,0,0]
[]
["Social & Subterfuge",{"$f":"HLOOKUP(Diverse!$G$2,'2nd'!$B$1:$CR$18,15,FALSE)","v":2},null,null,null,{"$f":"SUM(AL219:AL237)","v":0},{"$f":"SUM(AM219:AM237)","v":0},null,{"$f":"SUM(AM219:AM237)","v":0},{"$f":"SUM(AN219:AN237)","v":0},0,0,0,0,0,0,0,0,0,0,0,0,0,0,0,0,0,0,"Rank","Skill","Stat",null,"Lvl","Race","Armor","Item","Total"]
["Diplomacy",{"$f":"VLOOKUP(A219,AllaSkills!$A$3:$BV$319,'Ny NPC'!$A$2+3,FALSE)","v":"2/5"},"2","5","Social",null,null,null,null,null,null,null,null,null,null,null,null,null,null,null,null,null,null,null,null,null,null,null,0,-25,{"$f":"(PR+IN)/2","v":7.5},{"$f":"HLOOKUP(Yrke,Levelbonus!$B$1:$CR$20,15,FALSE)","v":0},0,{"$f":"IF(ISNUMBER(VLOOKUP($A219,Rasbonus!$A$61:$AM$295,MATCH(Ras,Rasbonus!$A$1:$AM$1,0),FALSE)),VLOOKUP($A219,Rasbonus!$A$61:$AM$295,MATCH(Ras,Rasbonus!$A$1:$AM$1,0),FALSE),\"0\")","v":"0"},null,null,-18,{"$f":"IF(F219>2,\"99\",IF(F219<1,0,IF(F219=1,$C219+$C219-$C219,IF(F219=2,$C219+$D219))))","v":0},{"$f":"IF(I219>2,\"99\",IF(I219<1,0,IF(I219=1,$C219+$C219-$C219,IF(I219=2,$C219+$D219))))","v":0},0,0,0,0,0,0,0,0,0,{"$f":"IF(S219>2,\"99\",IF(S219<1,0,IF(S219=1,$C219+$C219-$C219,IF(S219=2,$C219+$D219))))","v":0},0,0,0,0,0,0,0,0,0]
["Duping",{"$f":"VLOOKUP(A220,AllaSkills!$A$3:$BV$319,'Ny NPC'!$A$2+3,FALSE)","v":"3/5"},"3","5","Social",null,null,null,null,null,null,null,null,null,null,null,null,null,null,null,null,null,null,null,null,null,null,null,0,-25,{"$f":"PR","v":10},{"$f":"HLOOKUP(Yrke,Levelbonus!$B$1:$CR$20,15,FALSE)","v":0},0,{"$f":"IF(ISNUMBER(VLOOKUP($A220,Rasbonus!$A$61:$AM$295,MATCH(Ras,Rasbonus!$A$1:$AM$1,0),FALSE)),VLOOKUP($A220,Rasbonus!$A$61:$AM$295,MATCH(Ras,Rasbonus!$A$1:$AM$1,0),FALSE),\"0\")","v":"0"},null,null,-15,0,0,0,0,0,0,0,0,0,0,0,0,0,0,0,0,0,0,0,0,0]
["Gambling",{"$f":"VLOOKUP(A221,AllaSkills!$A$3:$BV$319,'Ny NPC'!$A$2+3,FALSE)","v":"2/6"},"2","6","Social",null,null,null,null,null,null,null,null,null,null,null,null,null,null,null,null,null,null,null,null,null,null,null,0,-25,{"$f":"(RE+PR)/2","v":7.5},{"$f":"HLOOKUP(Yrke,Levelbonus!$B$1:$CR$20,15,FALSE)","v":0},0,{"$f":"IF(ISNUMBER(VLOOKUP($A221,Rasbonus!$A$61:$AM$295,MATCH(Ras,Rasbonus!$A$1:$AM$1,0),FALSE)),VLOOKUP($A221,Rasbonus!$A$61:$AM$295,MATCH(Ras,Rasbonus!$A$1:$AM$1,0),FALSE),\"0\")","v":"0"},null,null,-18,0,0,0,0,0,0,0,0,0,0,0,0,0,0,0,0,0,0,0,0,0]
["Interrogation",{"$f":"VLOOKUP(A222,AllaSkills!$A$3:$BV$319,'Ny NPC'!$A$2+3,FALSE)","v":"4"},"4","4","Social",null,null,null,null,null,null,null,null,null,null,null,null,null,null,null,null,null,null,null,null,null,null,null,0,-25,{"$f":"(AG+RE)/2","v":5},{"$f":"HLOOKUP(Yrke,Levelbonus!$B$1:$CR$20,15,FALSE)","v":0},0,{"$f":"IF(ISNUMBER(VLOOKUP($A222,Rasbonus!$A$61:$AM$295,MATCH(Ras,Rasbonus!$A$1:$AM$1,0),FALSE)),VLOOKUP($A222,Rasbonus!$A$61:$AM$295,MATCH(Ras,Rasbonus!$A$1:$AM$1,0),FALSE),\"0\")","v":"0"},null,null,-20,0,0,0,0,0,0,0,0,0,0,0,0,0,0,0,0,0,0,0,0,0]
["Intimidation",{"$f":"VLOOKUP(A223,AllaSkills!$A$3:$BV$319,'Ny NPC'!$A$2+3,FALSE)","v":"2/5"},"2","5","Social",null,null,null,null,null,null,null,null,null,null,null,null,null,null,null,null,null,null,null,null,null,null,null,0,-25,{"$f":"(PR+RE)/2","v":7.5},{"$f":"HLOOKUP(Yrke,Levelbonus!$B$1:$CR$20,15,FALSE)","v":0},0,{"$f":"IF(ISNUMBER(VLOOKUP($A223,Rasbonus!$A$61:$AM$295,MATCH(Ras,Rasbonus!$A$1:$AM$1,0),FALSE)),VLOOKUP($A223,Rasbonus!$A$61:$AM$295,MATCH(Ras,Rasbonus!$A$1:$AM$1,0),FALSE),\"0\")","v":10},null,null,-8,0,0,0,0,0,0,0,0,0,0,0,0,0,0,0,0,0,0,0,0,0]
["Leadership",{"$f":"VLOOKUP(A224,AllaSkills!$A$3:$BV$319,'Ny NPC'!$A$2+3,FALSE)","v":"2/4"},"2","4","Social",null,null,null,null,null,null,null,null,null,null,null,null,null,null,null,null,null,null,null,null,null,null,null,0,-25,{"$f":"(PR+RE)/2","v":7.5},{"$f":"HLOOKUP(Yrke,Levelbonus!$B$1:$CR$20,15,FALSE)","v":0},0,{"$f":"IF(ISNUMBER(VLOOKUP($A224,Rasbonus!$A$61:$AM$295,MATCH(Ras,Rasbonus!$A$1:$AM$1,0),FALSE)),VLOOKUP($A224,Rasbonus!$A$61:$AM$295,MATCH(Ras,Rasbonus!$A$1:$AM$1,0),FALSE),\"0\")","v":"0"},null,null,-18,0,0,0,0,0,0,0,0,0,0,0,0,0,0,0,0,0,0,0,0,0]
["Seduction",{"$f":"VLOOKUP(A225,AllaSkills!$A$3:$BV$319,'Ny NPC'!$A$2+3,FALSE)","v":"2/5"},"2","5","Social",null,null,null,null,null,null,null,null,null,null,null,null,null,null,null,null,null,null,null,null,null,null,null,0,-25,{"$f":"(EM+PR+AP)/3","v":6.666666666666667},{"$f":"HLOOKUP(Yrke,Levelbonus!$B$1:$CR$20,15,FALSE)","v":0},0,{"$f":"IF(ISNUMBER(VLOOKUP($A225,Rasbonus!$A$61:$AM$295,MATCH(Ras,Rasbonus!$A$1:$AM$1,0),FALSE)),VLOOKUP($A225,Rasbonus!$A$61:$AM$295,MATCH(Ras,Rasbonus!$A$1:$AM$1,0),FALSE),\"0\")","v":"0"},null,null,-18,0,0,0,0,0,0,0,0,0,0,0,0,0,0,0,0,0,0,0,0,0]
[]
["Acting",{"$f":"VLOOKUP(A227,AllaSkills!$A$3:$BV$319,'Ny NPC'!$A$2+3,FALSE)","v":"3/6"},"3","6","Subterfuge",null,null,null,null,null,null,null,null,null,null,null,null,null,null,null,null,null,null,null,null,null,null,null,0,-25,{"$f":"(EM+PR+AP)/3","v":6.666666666666667},{"$f":"HLOOKUP(Yrke,Levelbonus!$B$1:$CR$20,16,FALSE)","v":0},0,{"$f":"IF(ISNUMBER(VLOOKUP($A227,Rasbonus!$A$61:$AM$295,MATCH(Ras,Rasbonus!$A$1:$AM$1,0),FALSE)),VLOOKUP($A227,Rasbonus!$A$61:$AM$295,MATCH(Ras,Rasbonus!$A$1:$AM$1,0),FALSE),\"0\")","v":"0"},null,null,-18,{"$f":"IF(F227>2,\"99\",IF(F227<1,0,IF(F227=1,$C227+$C227-$C227,IF(F227=2,$C227+$D227))))","v":0},{"$f":"IF(I227>2,\"99\",IF(I227<1,0,IF(I227=1,$C227+$C227-$C227,IF(I227=2,$C227+$D227))))","v":0},{"$f":"IF(J227>2,\"99\",IF(J227<1,0,IF(J227=1,$C227+$C227-$C227,IF(J227=2,$C227+$D227))))","v":0},{"$f":"IF(K227>2,\"99\",IF(K227<1,0,IF(K227=1,$C227+$C227-$C227,IF(K227=2,$C227+$D227))))","v":0},{"$f":"IF(L227>2,\"99\",IF(L227<1,0,IF(L227=1,$C227+$C227-$C227,IF(L227=2,$C227+$D227))))","v":0},{"$f":"IF(M227>2,\"99\",IF(M227<1,0,IF(M227=1,$C227+$C227-$C227,IF(M227=2,$C227+$D227))))","v":0},{"$f":"IF(N227>2,\"99\",IF(N227<1,0,IF(N227=1,$C227+$C227-$C227,IF(N227=2,$C227+$D227))))","v":0},{"$f":"IF(O227>2,\"99\",IF(O227<1,0,IF(O227=1,$C227+$C227-$C227,IF(O227=2,$C227+$D227))))","v":0},{"$f":"IF(P227>2,\"99\",IF(P227<1,0,IF(P227=1,$C227+$C227-$C227,IF(P227=2,$C227+$D227))))","v":0},{"$f":"IF(Q227>2,\"99\",IF(Q227<1,0,IF(Q227=1,$C227+$C227-$C227,IF(Q227=2,$C227+$D227))))","v":0},{"$f":"IF(R227>2,\"99\",IF(R227<1,0,IF(R227=1,$C227+$C227-$C227,IF(R227=2,$C227+$D227))))","v":0},{"$f":"IF(S227>2,\"99\",IF(S227<1,0,IF(S227=1,$C227+$C227-$C227,IF(S227=2,$C227+$D227))))","v":0},{"$f":"IF(T227>2,\"99\",IF(T227<1,0,IF(T227=1,$C227+$C227-$C227,IF(T227=2,$C227+$D227))))","v":0},{"$f":"IF(U227>2,\"99\",IF(U227<1,0,IF(U227=1,$C227+$C227-$C227,IF(U227=2,$C227+$D227))))","v":0},{"$f":"IF(V227>2,\"99\",IF(V227<1,0,IF(V227=1,$C227+$C227-$C227,IF(V227=2,$C227+$D227))))","v":0},{"$f":"IF(W227>2,\"99\",IF(W227<1,0,IF(W227=1,$C227+$C227-$C227,IF(W227=2,$C227+$D227))))","v":0},{"$f":"IF(X227>2,\"99\",IF(X227<1,0,IF(X227=1,$C227+$C227-$C227,IF(X227=2,$C227+$D227))))","v":0},{"$f":"IF(Y227>2,\"99\",IF(Y227<1,0,IF(Y227=1,$C227+$C227-$C227,IF(Y227=2,$C227+$D227))))","v":0},{"$f":"IF(Z227>2,\"99\",IF(Z227<1,0,IF(Z227=1,$C227+$C227-$C227,IF(Z227=2,$C227+$D227))))","v":0},{"$f":"IF(AA227>2,\"99\",IF(AA227<1,0,IF(AA227=1,$C227+$C227-$C227,IF(AA227=2,$C227+$D227))))","v":0},{"$f":"IF(AB227>2,\"99\",IF(AB227<1,0,IF(AB227=1,$C227+$C227-$C227,IF(AB227=2,$C227+$D227))))","v":0}]
["Begging",{"$f":"VLOOKUP(A228,AllaSkills!$A$3:$BV$319,'Ny NPC'!$A$2+3,FALSE)","v":"2/6"},"2","6","Subterfuge",null,null,null,null,null,null,null,null,null,null,null,null,null,null,null,null,null,null,null,null,null,null,null,0,-25,{"$f":"(EM+PR+AP)/3","v":6.666666666666667},{"$f":"HLOOKUP(Yrke,Levelbonus!$B$1:$CR$20,16,FALSE)","v":0},0,{"$f":"IF(ISNUMBER(VLOOKUP($A228,Rasbonus!$A$61:$AM$295,MATCH(Ras,Rasbonus!$A$1:$AM$1,0),FALSE)),VLOOKUP($A228,Rasbonus!$A$61:$AM$295,MATCH(Ras,Rasbonus!$A$1:$AM$1,0),FALSE),\"0\")","v":"0"},null,null,-18,0,0,0,0,0,0,0,0,0,0,0,0,0,0,0,0,0,0,0,0,0]
["Bribery",{"$f":"VLOOKUP(A229,AllaSkills!$A$3:$BV$319,'Ny NPC'!$A$2+3,FALSE)","v":"2/6"},"2","6","Subterfuge",null,null,null,null,null,null,null,null,null,null,null,null,null,null,null,null,null,null,null,null,null,null,null,0,-25,{"$f":"(PR+RE+AP)/3","v":6.666666666666667},{"$f":"HLOOKUP(Yrke,Levelbonus!$B$1:$CR$20,16,FALSE)","v":0},0,{"$f":"IF(ISNUMBER(VLOOKUP($A229,Rasbonus!$A$61:$AM$295,MATCH(Ras,Rasbonus!$A$1:$AM$1,0),FALSE)),VLOOKUP($A229,Rasbonus!$A$61:$AM$295,MATCH(Ras,Rasbonus!$A$1:$AM$1,0),FALSE),\"0\")","v":"0"},null,null,-18,0,0,0,0,0,0,0,0,0,0,0,0,0,0,0,0,0,0,0,0,0]
["Camouflage",{"$f":"VLOOKUP(A230,AllaSkills!$A$3:$BV$319,'Ny NPC'!$A$2+3,FALSE)","v":"6"},"6","6","Subterfuge",null,null,null,null,null,null,null,null,null,null,null,null,null,null,null,null,null,null,null,null,null,null,null,0,-25,{"$f":"(RE+IN)/2","v":5},{"$f":"HLOOKUP(Yrke,Levelbonus!$B$1:$CR$20,16,FALSE)","v":0},0,{"$f":"IF(ISNUMBER(VLOOKUP($A230,Rasbonus!$A$61:$AM$295,MATCH(Ras,Rasbonus!$A$1:$AM$1,0),FALSE)),VLOOKUP($A230,Rasbonus!$A$61:$AM$295,MATCH(Ras,Rasbonus!$A$1:$AM$1,0),FALSE),\"0\")","v":"0"},null,null,-20,0,0,0,0,0,0,0,0,0,0,0,0,0,0,0,0,0,0,0,0,0]
["Disguise",{"$f":"VLOOKUP(A231,AllaSkills!$A$3:$BV$319,'Ny NPC'!$A$2+3,FALSE)","v":"3/6"},"3","6","Subterfuge",null,null,null,null,null,null,null,null,null,null,null,null,null,null,null,null,null,null,null,null,null,null,null,0,-25,{"$f":"(PR+SD)/2","v":7.5},{"$f":"HLOOKUP(Yrke,Levelbonus!$B$1:$CR$20,16,FALSE)","v":0},0,{"$f":"IF(ISNUMBER(VLOOKUP($A231,Rasbonus!$A$61:$AM$295,MATCH(Ras,Rasbonus!$A$1:$AM$1,0),FALSE)),VLOOKUP($A231,Rasbonus!$A$61:$AM$295,MATCH(Ras,Rasbonus!$A$1:$AM$1,0),FALSE),\"0\")","v":"0"},null,null,-18,0,0,0,0,0,0,0,0,0,0,0,0,0,0,0,0,0,0,0,0,0]
["Falsification",{"$f":"VLOOKUP(A232,AllaSkills!$A$3:$BV$319,'Ny NPC'!$A$2+3,FALSE)","v":"1/3"},"1","3","Subterfuge",null,null,null,null,null,null,null,null,null,null,null,null,null,null,null,null,null,null,null,null,null,null,null,0,-25,{"$f":"(SD+RE)/2","v":5},{"$f":"HLOOKUP(Yrke,Levelbonus!$B$1:$CR$20,16,FALSE)","v":0},0,{"$f":"IF(ISNUMBER(VLOOKUP($A232,Rasbonus!$A$61:$AM$295,MATCH(Ras,Rasbonus!$A$1:$AM$1,0),FALSE)),VLOOKUP($A232,Rasbonus!$A$61:$AM$295,MATCH(Ras,Rasbonus!$A$1:$AM$1,0),FALSE),\"0\")","v":"0"},null,null,-20,0,0,0,0,0,0,0,0,0,0,0,0,0,0,0,0,0,0,0,0,0]
["Hide Item",{"$f":"VLOOKUP(A233,AllaSkills!$A$3:$BV$319,'Ny NPC'!$A$2+3,FALSE)","v":"6"},"6","6","Subterfuge",null,null,null,null,null,null,null,null,null,null,null,null,null,null,null,null,null,null,null,null,null,null,null,0,-25,{"$f":"(RE+IN)/2","v":5},{"$f":"HLOOKUP(Yrke,Levelbonus!$B$1:$CR$20,16,FALSE)","v":0},0,{"$f":"IF(ISNUMBER(VLOOKUP($A233,Rasbonus!$A$61:$AM$295,MATCH(Ras,Rasbonus!$A$1:$AM$1,0),FALSE)),VLOOKUP($A233,Rasbonus!$A$61:$AM$295,MATCH(Ras,Rasbonus!$A$1:$AM$1,0),FALSE),\"0\")","v":"0"},null,null,-20,0,0,0,0,0,0,0,0,0,0,0,0,0,0,0,0,0,0,0,0,0]
["Mimery",{"$f":"VLOOKUP(A234,AllaSkills!$A$3:$BV$319,'Ny NPC'!$A$2+3,FALSE)","v":"3/6"},"3","6","Subterfuge",null,null,null,null,null,null,null,null,null,null,null,null,null,null,null,null,null,null,null,null,null,null,null,0,-25,{"$f":"(AG+SD)/2","v":5},{"$f":"HLOOKUP(Yrke,Levelbonus!$B$1:$CR$20,16,FALSE)","v":0},0,{"$f":"IF(ISNUMBER(VLOOKUP($A234,Rasbonus!$A$61:$AM$295,MATCH(Ras,Rasbonus!$A$1:$AM$1,0),FALSE)),VLOOKUP($A234,Rasbonus!$A$61:$AM$295,MATCH(Ras,Rasbonus!$A$1:$AM$1,0),FALSE),\"0\")","v":"0"},null,null,-20,0,0,0,0,0,0,0,0,0,0,0,0,0,0,0,0,0,0,0,0,0]
["Pick Pockets",{"$f":"VLOOKUP(A235,AllaSkills!$A$3:$BV$319,'Ny NPC'!$A$2+3,FALSE)","v":"3"},"3","3","Subterfuge",null,null,null,null,null,null,null,null,null,null,null,null,null,null,null,null,null,null,null,null,null,null,null,0,-25,{"$f":"(AG+IN)/2","v":5},{"$f":"HLOOKUP(Yrke,Levelbonus!$B$1:$CR$20,16,FALSE)","v":0},0,{"$f":"IF(ISNUMBER(VLOOKUP($A235,Rasbonus!$A$61:$AM$295,MATCH(Ras,Rasbonus!$A$1:$AM$1,0),FALSE)),VLOOKUP($A235,Rasbonus!$A$61:$AM$295,MATCH(Ras,Rasbonus!$A$1:$AM$1,0),FALSE),\"0\")","v":"0"},null,null,-20,0,0,0,0,0,0,0,0,0,0,0,0,0,0,0,0,0,0,0,0,0]
["Set Traps",{"$f":"VLOOKUP(A236,AllaSkills!$A$3:$BV$319,'Ny NPC'!$A$2+3,FALSE)","v":"4"},"4","4","Subterfuge",null,null,null,null,null,null,null,null,null,null,null,null,null,null,null,null,null,null,null,null,null,null,null,0,-25,{"$f":"(RE+AG)/2","v":5},{"$f":"HLOOKUP(Yrke,Levelbonus!$B$1:$CR$20,16,FALSE)","v":0},0,{"$f":"IF(ISNUMBER(VLOOKUP($A236,Rasbonus!$A$61:$AM$295,MATCH(Ras,Rasbonus!$A$1:$AM$1,0),FALSE)),VLOOKUP($A236,Rasbonus!$A$61:$AM$295,MATCH(Ras,Rasbonus!$A$1:$AM$1,0),FALSE),\"0\")","v":"0"},null,null,-20,0,0,0,0,0,0,0,0,0,0,0,0,0,0,0,0,0,0,0,0,0]
["Trickery",{"$f":"VLOOKUP(A237,AllaSkills!$A$3:$BV$319,'Ny NPC'!$A$2+3,FALSE)","v":"3"},"3","3","Subterfuge",null,null,null,null,null,null,null,null,null,null,null,null,null,null,null,null,null,null,null,null,null,null,null,0,-25,{"$f":"(PR+QU)/2","v":5},{"$f":"HLOOKUP(Yrke,Levelbonus!$B$1:$CR$20,16,FALSE)","v":0},0,{"$f":"IF(ISNUMBER(VLOOKUP($A237,Rasbonus!$A$61:$AM$295,MATCH(Ras,Rasbonus!$A$1:$AM$1,0),FALSE)),VLOOKUP($A237,Rasbonus!$A$61:$AM$295,MATCH(Ras,Rasbonus!$A$1:$AM$1,0),FALSE),\"0\")","v":"0"},null,null,-20,0,0,0,0,0,0,0,0,0,0,0,0,0,0,0,0,0,0,0,0,0]

{"sheet":"Bonuses","index":3,"n_rows":31,"n_cols":16,"rows_kept":31,"cut":false,"hidden":false,"merged":[]}
[]
["Combat (Attacks)",null,null,null,"Statistics",null,null,null,"Most used skills",null,null,null,null,"Abilities & Drawbacks"]
["Attack","With what?","OB",null,"Statistic","Total","Current",null,"Skill","Bonus","Skill","Bonus",null,"Cost","Ability","Description"]
["Primary Attack","My magical mace",{"$f":"'Ny NPC'!$Q30","v":25},null,"Hit Points",{"$f":"'Ny NPC'!$V43","v":25},null,null,"AM Speed",{"$f":"'Ny NPC'!$Q6","v":-20},"General Perception",{"$f":"'Ny NPC'!$Q17","v":11}]
["Secondary Attack","My extraordinary warhammer",{"$f":"'Ny NPC'!$Q31","v":22.5},null,"PP (incl. adder/multiplier)",{"$f":"'Ny NPC'!$O42","v":5},null,null,"AM Strength",{"$f":"'Ny NPC'!$Q7","v":23}]
["Tert. Attack","My horrible crossbow",{"$f":"'Ny NPC'!$Q32","v":17.5},null,"Initiative",{"$f":"'Ny NPC'!$B72","v":0}]
["Weapon Brawling",null,{"$f":"Secondary!$AK104","v":-17}]
["Shield Bash",null,{"$f":"Secondary!$AK98","v":-10}]
[]
[]
[]
[]
[]
[]
[null,"Please feel free to change the"]
[null,"above attacks to those favored"]
[]
[]
["Combat (Defenses)"]
["Defense",null,"Bonus"]
["Shield skill (incl. Shield expertise)",null,{"$f":"'Ny NPC'!$Q36","v":15}]
["Total DB (incl. Inherent)",null,{"$f":"'Ny NPC'!B53","v":15}]
["Inherent DB",null,{"$f":"'Ny NPC'!$B51","v":0}]
["Stunned Maneuver",null,{"$f":"Secondary!$AK100","v":-20}]
[]
[]
[]
[]
[null,"Please feel free to change the"]
[null,"above defensive skills to those "]
[null,"favored"]

{"sheet":"Items","index":4,"n_rows":357,"n_cols":24,"rows_kept":357,"cut":false,"hidden":false,"merged":[]}
[]
["#","Item","lbs","#","Item","lbs","#","Item","lbs","#","Item (not carried)",null,"Antal","Level","Herb","Form/Prep","Cost","Effect","Sideeffects/drawbacks","Risk","CL","Max effect","Time","Finding"]
[0,"Example Dagger",null,1,"Delicious Cookie",null,0,"Example gold coins",null,0,"Horse",null,null,null,"Concussion Relief"]
[2,"Example Waterskin",null,10,"Example Torches",null,null,null,null,null,null,null,null,1,"Abaas","Leaf/Ingest","3 bp","Heals 2-12 hit points."," ",null,101,10,"20 rnds","Light"]
[null,null,null,null,null,null,null,null,null,null,null,null,null,1,"Akbutege","Leaf/Ingest","2 bp","Heals 1-10 hit points.",null,null,623,5,"20 rnds","Easy"]
[null,null,null,null,null,null,null,null,null,null,null,null,null,1,"Arkasu","Sap/Apply","6 bp","Heals 2-12 hit points. Doubles rate of healing for major wounds if used once per day during the healing process.",null,null,637,5,"20 rnds","Medium"]
[null,null,null,null,null,null,null,null,null,null,null,null,null,4,"Arlan","Leaf/Apply","3 bp","Grown and prepared by healer it heals 4-9 hit points. Wild it will heal 1-6 hit points. The price is for the garden grown species.",null,null,624,5,"20 rnds","Easy"]
[null,null,null,null,null,null,null,null,null,null,null,null,null,4,"Caranan","Leaves/Ingest","1 bp","Heals 2-4 hits. Relieves swelling.",null,null,105,5,"20 rnds","Medium"]
[null,null,null,null,null,null,null,null,null,null,null,null,null,6,"Carefree Mustard","Leaves/Brew","100 sp","Heals all concussion hits in 1 hour. I.e after 20 minutes of drinking the brew the imbiber has been relieved of 1/3 of his taken hits.",null,null,106,"—","1 hour continous effect","Hard"]
[null,null,null,null,null,null,null,null,null,null,null,null,null,20,"Carneyar","Flower/Brew","1200 sp","Instantly heals all hits and stops all bleeding.","If drawback occurs, user is sluggish and slow (acts at -10) for 11-20 minutes after taking the herb.",null,107,"—","Instant","Absurd"]
[null,null,null,null,null,null,null,null,null,null,null,null,null,10,"Cusamar","Flower/Ingest","12 sp","Heals 15-60 (10+5d10) hit points. Takes 2 rounds to take effect.",null,null,625,3,"2 rounds","Extremely hard"]
[null,null,null,null,null,null,null,null,null,null,null,null,null,3,"Darsurion","Leaf/Apply","3 bp","Heals 1-6 hit points. ",null,null,626,10,"20 rnds","Light"]
[null,null,null,null,null,null,null,null,null,null,null,null,null,4,"Draaf","Leaf/Ingest","1 sp","Heals 1-10 for each of 2 consecutive rounds (i.e 2-20 hits total). ",null,null,627,10,"2 rounds","Easy"]
[null,null,null,null,null,null,null,null,null,null,null,null,null,1,"Dugmuthur","Berry/Ingest","5 sp","Heals 10 hit points instantly.",null,null,628,10,"Instant","Light"]
[null,null,null,null,null,null,null,null,null,null,null,null,null,2,"Fiis","Resin/Apply","5 bp","Heals 1-6 hit points.",null,null,111,10,"20 rnds","Easy"]
[null,null,null,null,null,null,null,null,null,null,null,null,null,6,"Gariig","Cactus/Ingest","40 sp","Instantly heal 30 hit points.",null,null,646,"—","Instant","Light"]
["#","Magical Items","lbs",null,"Location","Notes & Abilities",null,null,null,null,null,null,null,12,"Gefnul","Lichen/Ingest","150 sp","Heals 100 hit points instantly.",null,null,647,"—","Instant","Hard"]
[1,"Example Broadsword",4,null,"Side scabbard","Magical +10",null,null,null,null,null,null,null,10,"Harwite","Moss/Ingest","10 sp","Heals 1-50 hit points in one hour. Also mends small wounds (remove the penalty from one wound, up to -10).",null,null,null,3,"1 hour","Extremely hard"]
[null,null,null,null,null,null,null,null,null,null,null,null,null,4,"Kargijak","Berry/Paste","5 sp","Berries from Mordor. Healing and rejuvenating effect: user instantly regains 20 hit points. ","If drawback occurs, any non-orc user will be stunned for 1-2 rounds due to severe pain. The wound is certain to leave a scar in either case.",null,null,"—","Instant","Easy"]
[null,null,null,null,null,null,null,null,null,null,null,null,null,8,"Madarch","Mushroom/Brew","100 sp","Heals all cuts and restores blood vessels in 2 hours. User is relieved of all hits taken. The herb requires user to rest or healing time will be prolonged until user rests properly.",null,null,null,"—","2 hours","Very Hard"]
[null,null,null,null,null,null,null,null,null,null,null,null,null,1,"Mirenna","Berry/Ingest","6 sp","Red berry. Heals 10 hits. Instant effect.",null,null,631,10,"Instant","Light"]
[null,null,null,null,null,null,null,null,null,null,null,null,null,1,"Reglen","Moss/Brew","24 sp","This is the cultivated variant which lacks some of the potency of the ancient moss that grows wild. It heals 5-50 hit points instantly. Since it is less potent up to 4 doses per day will have effect.",null,null,632,4,"Instant","—"]
[null,null,null,null,null,null,null,null,null,null,null,null,null,1,"Reglen","Moss/Brew","45 sp","Found wild and prepared by a skilled healer, the Reglen moss heals 50 hit points instantly.",null,null,632,2,"Instant","Light"]
[null,null,null,null,null,null,null,null,null,null,null,null,null,1,"Rewk","Nodule/Brew","8 bp","Heals 2-20 hit points over 20 rounds.","If drawback occurs, user is sluggish and slow (acts at -10) for 11-20 minutes after taking the herb.",null,633,10,"20 rounds","Light"]
[null,null,null,null,null,null,null,null,null,null,null,null,null,12,"Telperion","Leaf/Ingest","70 sp","Heals 10-100 hit points. ",null,null,134,2,"Instant","Extremely hard"]
[null,null,null,null,null,null,null,null,null,null,null,null,null,1,"Thurl","Clove/Brew","1 cp","Heals 1-4 hit points. Brew keeps 1-2 weeks.",null,null,634,10,"20 rnds","Routine"]
[null,null,null,null,null,null,null,null,null,null,null,null,null,14,"Winclamit","Fruit/Ingest","90 sp","Heals 3-300 hit points instantly upon ingestion.","If drawback occurs, user is sluggish and slow (acts at -10) for 11-20 minutes after taking the herb.",null,635,"—","Instant","Extremely hard"]
[null,null,null,null,null,null,null,null,null,null,null,null,null,6,"Yavethalion","Fruit/Ingest","65 sp","Heals 5-50 hit points",null,null,636,"—","Instant","Hard"]
[]
[]
[null,null,null,null,null,null,null,null,null,null,null,null,null,"Level","Herb","Form/Prep","Cost","Effect","Sideeffects/drawbacks","Risk","CL","Max effect","Time/ Duration","Finding"]
[null,null,null,null,null,null,null,null,null,null,null,null,null,null,"Circulatory Repair"]
[null,null,null,null,null,null,null,null,null,null,null,null,null,10,"Anserke","Root/Apply","12 sp","Stops bleeding on the wound applied to. Bleedings of 1-3 hits/rnd close in 1 rnd, 4-6 hits/rnd close in 2 rnds and 7+ hits/rnd close in 3 rnds. Require 1 hour immobility or bleeding resumes.",null,null,619,"—","1-3 rnds/   1 hr","Very Hard"]
[null,null,null,null,null,null,null,null,null,null,null,null,null,8,"Belan","Nut/Ingest","15 sp","Stops all bleeding wounds in one body. Take 1-10 rounds to take effect. Patient cannot be moved for 1 hour or bleeding will resume at half rate.",null,null,null,"—","1-10 rnds/ 1 hr","Very Hard"]
[null,null,null,null,null,null,null,null,null,null,null,null,null,10,"Fek","Nut/Brew","15 sp","Stops all bleeding wounds in one body. Take 1-10 rounds to take effect. Patient cannot be moved for 1 hour or bleeding will resume at half rate. The nut will keep a long time, but once brewed it will only have full effect for 1 week.","Each week after the first provide a -10 penalty to the Herb Lore roll when using.",null,620,"—","1-10 rnds/ 1 hr","Very Hard"]
[null,null,null,null,null,null,null,null,null,null,null,null,null,9,"Golden Cress","Fern/Apply","10 sp","Stops bleeding up to 5 hits/rnd. Take 1-5 rounds to permanently seal one wound. If used on a wound bleeding more than 5 hits/rnd the Golden Cress will halve the bleeding for as long as the target remains still.",null,null,null,"—","1-5 rnds","Very Hard"]
[null,null,null,null,null,null,null,null,null,null,null,null,null,16,"Harfy","Resin/Apply","120 sp","Powerful herb that immediately and permanently closes one bleeding wound.",null,null,621,"—","Instant","Very Hard"]
[null,null,null,null,null,null,null,null,null,null,null,null,null,18,"Hugburtun","Fruit/Brew","180 sp","Immediately stops any form of bleeding. All wounds will close and stops internal bleeding stops. Hugburtun restores blood vessels to normality.",null,null,622,"—","Instant","Very Hard"]
[null,null,null,null,null,null,null,null,null,null,null,null,null,11,"Miretars Crown","Flower/Apply","30 sp","Instantly stops bleeding of any one wound. Bleeding resumes if flowers are removed before 10 minutes have passed.",null,null,124,"—","Instant/   10 min","Very Hard"]
[null,null,null,null,null,null,null,null,null,null,null,null,null,4,"Rumareth","Leaves/Brew","5 bp","Often used by the Angmarim. Stops bleeding from all wounds bleeding less than or equal to 2 hits per round. Causes bad scaring. Once the leaves have been brewed, the brew will keep for 1 week.","Drawback causes user to be drowsy (-30 to all actions) for 1 hour after imbibing. Each week of storage, after the first) provide a -10 penalty to Herb Lore roll when using.",null,128,"—","Instant","Very Hard"]
[null,null,null,null,null,null,null,null,null,null,null,null,null,8,"Sindoluin","Flower/Apply","1 sp","Anti-coagulant. Will stop bleeding from one wound that bleeds up to 3 hits per round. The patient may walk and move without the bleeding reopening so long as the Sindoluin plant remains attached to the wound.",null,null,130,"—","Instant","Easy"]
[null,null,null,null,null,null,null,null,null,null,null,null,null,12,"Tulaxar","Leaves/Brew","70 sp","Stops all bleeding in one body. Take 3-6 rounds to take effect. Wounds will not reopen. ","If drawback occurs, user must RR vs a 12th level poison. Failure by 1-25 causes drowsiness (-30) for 1 hour, failure by 26+ causes heart attack, unconsciousness and possibly death (25%).",null,null,"—","3-6 rnds","Very Hard"]
[]
[]
[null,null,null,null,null,null,null,null,null,null,null,null,null,"Level","Herb","Form/Prep","Cost","Effect","Sideeffects/drawbacks","Risk","CL","Max effect","Time/ Duration","Finding"]
[null,null,null,null,null,null,null,null,null,null,null,null,null,null,"Antidotes"]
[null,null,null,null,null,null,null,null,null,null,null,null,null,20,"Arduvaar","Plant/Brew","250 sp","Universal antidote. Reverse the effect of any known poison (unless target is dead). Magical herb, requires preparation of skilled alchemist. ",null,null,102,"—","Instant","Absurd"]
[null,null,null,null,null,null,null,null,null,null,null,null,null,6,"Argsbargie","Flower/Ingest","3 sp","Antidote for muscle poisons. Does not reverse any effects, but effectively stop any further damage.",null,null,601,"—","3 rnds","Hard"]
[null,null,null,null,null,null,null,null,null,null,null,null,null,2,"Baranie","Leaves/Brew","5 bp","Reduces nausea. Cures stomach disease and reduces the effects of certain poisons. Lower the effects of conversion poisons by 1 degree of severity.",null,null,104,"—","Varies","Easy"]
[null,null,null,null,null,null,null,null,null,null,null,null,null,10,"Carnerem","Leaf/Apply","8 sp","Delays any poison for 24 hours.",null,null,null,"—","24 hours","Hard"]
[null,null,null,null,null,null,null,null,null,null,null,null,null,12,"Cashdir","Flower/Ingest","16 sp","Antidote for muscle poison. Does not reverse any effects already taken, but stops any further damage.",null,null,null,"—","Instant","Very Hard"]
[null,null,null,null,null,null,null,null,null,null,null,null,null,6,"Culan","Leaf/Brew","12 sp","Anti spasmodic. Reduce the effects of any poison. Every dose of Culan lowers the result by 1 degree of severity; i.e extreme become severe, severe become moderate etc. Mild effects are cured immediately. Culan take 3 rounds to take effect.",null,null,108,"—","3 rounds","Medium"]
[null,null,null,null,null,null,null,null,null,null,null,null,null,9,"Eldaana","Leaf/Brew","25 sp","Antidote for reduction poisons. Will reverse any effects of a reduction poison over the course of 1 hour. Also reverses the effects of ‘Ugliness of Orn’ curse.",null,null,602,"—","1 hour","Medium"]
[null,null,null,null,null,null,null,null,null,null,null,null,null,4,"Elendils Basket","Root/Brew","2 sp","Purifies foul, tainted water and slows the effects of poisons by x10.",null,null,649,"—","x10","Light"]
[null,null,null,null,null,null,null,null,null,null,null,null,null,14,"Flur-rort","Flower/Liquid","40 sp","Antidote for nerve poisons. Will reverse all effects. The reversal take 1-10 minutes depending severity. This antidote cannot bring back anyone that has died as a result of poison.",null,null,null,"—","1-10 mins","Very Hard"]
[null,null,null,null,null,null,null,null,null,null,null,null,null,5,"Maiana","Leaf/Brew","7 sp","Halves the negative effects of lung afflications and respiratory disease (i.e halves the penalties from respiratory poisons and diseases). Take 4 hours for full effect.",null,null,null,"—","4 hours","Routine"]
[null,null,null,null,null,null,null,null,null,null,null,null,null,7,"Menelar","Cone/Brew","10 sp","Cures infections and functions as an antidote for circulatory poisons. Stops any further damage but do not reverse effects already taken place.",null,null,null,"—","20 rnds","Hard"]
[null,null,null,null,null,null,null,null,null,null,null,null,null,18,"Mir-Melellen","Nectar/Apply","175 sp","Cures and reverses the effects of any poison. Full reversion take 20 rounds.",null,null,null,null,"20 rnds","Extremely hard"]
[null,null,null,null,null,null,null,null,null,null,null,null,null,4,"Mook","Berry/Ingest","5 sp","Antidote for respiratory poisons. Stops any further damage. Effects that have already taken effect is not reversed.",null,null,604,"—","3 rnds","Light"]
[null,null,null,null,null,null,null,null,null,null,null,null,null,20,"Naza","Leaf/Ingest","210 sp","Aka Ul-Naza. Universal antidote with immediate effect. The Naza will cleanse the body of poisons and reverse all ill effects. Must be taken within 24 hours of poisoning.",null,null,125,"—","Instant","Absurd"]
[null,null,null,null,null,null,null,null,null,null,null,null,null,13,"Quilmufur","Root/Brew","50 sp","Antidote for conversion poisons. Reverse the effect of any conversion poison.",null,null,605,"—","Instant","Extremely hard"]
[null,null,null,null,null,null,null,null,null,null,null,null,null,10,"Shen","Leaf/Ingest","40 sp","Antidote for nerve poison. Will reverse any effects from nerve poisons in 20 rounds.",null,null,606,"—","20 rnds","Very Hard"]
[null,null,null,null,null,null,null,null,null,null,null,null,null,4,"Sorel nut","Nut/Ingest","5 cp","Antidote for Nur-Oiolosse",null,null,null,"—","Instant","Easy"]
[null,null,null,null,null,null,null,null,null,null,null,null,null,8,"Sweet Sorrel","Leaves/Inhale","12 sp","Incense that acts as antidote for poisonous gases. Will instantly stop the effect of any poison in gasform, but damage already done must be healed by other means.",null,null,null,"—","Instant","Hard"]
[null,null,null,null,null,null,null,null,null,null,null,null,null,11,"Taynaga","Bark/Powder","45 sp","Multipurpose herb. Brownish powder sterilizes and gives 5-50 hit points within 6-12 minutes. Can also be used to neutralize Jegga poison that not yet have had effect on target. For additional description see Hands of the Healer p. 139.",null,null,912,"N/A","6-12 mins","Hard"]
[null,null,null,null,null,null,null,null,null,null,null,null,null,20,"Ul-Naza","Leaf/Ingest","210 sp","Legendary antidote said to grow only in the wasteland were a Vala has walked. Will reverse the effects of any poison (even death) if taken within 1 day.",null,null,607,"—","Instant","Sheer Folly"]
[null,null,null,null,null,null,null,null,null,null,null,null,null,20,"Valanar","Leaf/Ingest","80 sp","Antidote for Karfar. Will reverse the effects, even death, if given within 24 hours of poisoning.",null,null,139,"—","1-10 rnds","Absurd"]
[null,null,null,null,null,null,null,null,null,null,null,null,null,9,"Vipersweed","Root/Brew","15 sp","Antidote for Asgurath and most other snake venoms. Will reverse the effects instantly.",null,null,141,"—","Instant","Medium"]
[null,null,null,null,null,null,null,null,null,null,null,null,null,14,"Yuth","Flower/Ingest","11 sp","Antidote for nerve venoms. Will only stop the poison from doing further damage, not reverse the effects already taken.",null,null,665,"—","20 rnds","Sheer Folly"]
[]
[]
[null,null,null,null,null,null,null,null,null,null,null,null,null,"Level","Herb","Form/Prep","Cost","Effect","Sideeffects/drawbacks","Risk","CL","Max effect","Time/ Duration","Finding"]
[null,null,null,null,null,null,null,null,null,null,null,null,null,null,"Bone, Nerve, Muscle and Organ Repair"]
[null,null,null,null,null,null,null,null,null,null,null,null,null,5,"Arfandas","Stem/Apply","5 bp","Double healing rate for fractures. 1 dose per day of recovery needed.",null,null,608,"—","Active for 24 hrs","Very Hard"]
[null,null,null,null,null,null,null,null,null,null,null,null,null,1,"Arnuminas","Leaf/Apply","2 bp","Doubles rate of healing for sprains, torn ligaments and cartilage damage. 1 dose per day needed for effect.","Drawback means healing has been faulty and user will have a permanent detriment of sorts.",null,655,"—","Active for 24 hrs","Easy"]
[null,null,null,null,null,null,null,null,null,null,null,null,null,6,"Arpsusar","Stalk/Brew","45 sp","Mends muscle damage. Will heal all damaged muscles in one body. Add 8 hours recovery time for each additional muscle damage.",null,null,656,"—","8 hrs","Hard"]
[null,null,null,null,null,null,null,null,null,null,null,null,null,16,"Baalak","Reed/Brew","220 sp","Shatter repairs. Magical herb, mends shattered bones without need of surgery. The herb will only heal one shattered bone so if there are many in the users body it will target the gravest injury (usually the one that provide most penalty).",null,null,609,"—","8 hours","Sheer Folly"]
[null,null,null,null,null,null,null,null,null,null,null,null,null,13,"Baldakur","Root/Brew","90 sp","Restores sight. Can repair one eye-damage as long as the eye is not completely destroyed.",null,null,666,"—","8 hours","Sheer Folly"]
[null,null,null,null,null,null,null,null,null,null,null,null,null,11,"Belramba","Lichen/Brew","60 sp","Nerve repair. Will heal all damaged nerves in one body.",null,null,662,"—","8 hours","Very Hard"]
[null,null,null,null,null,null,null,null,null,null,null,null,null,6,"Boneset","Root/Ingest","10 sp","Triple healing rate for fractures. Affects all fractures in a body. All fractures must be set before ingestion of the herbs.","Drawback mean that bones set incorrect and may confer a permanent disability.",null,null,"—","Varies","Very Hard"]
[null,null,null,null,null,null,null,null,null,null,null,null,null,14,"Bursthelas","Stalk/Brew","180 sp","Shatter repairs. Magical herb, mends shattered bones without need of surgery. The herb will only heal one shattered bone so if there are many in the users body it will target the gravest injury (usually the one that provide most penalty).",null,null,610,"—","12 hrs","Sheer Folly"]
[null,null,null,null,null,null,null,null,null,null,null,null,null,10,"Curfalka","Fruit/Ingest","120 sp/ 60 sp","Fresh fruits will heal 1 muscle damage in 3-30 minutes, but the herb is only fresh for 3 days. If preserved it heals one muscle damage in 8 hours. If the body contains more than one damaged muscle the herb will affect the most severe injury first.",null,null,657,"—","3-30 mins or 8 hours","Extremely hard"]
[null,null,null,null,null,null,null,null,null,null,null,null,null,5,"Dagmather","Spine/Brew","30 sp","Heals all cartilage damage in one damaged body. Healing take 8 hours of rest for full effect. If target continue to work or travel during the healing it take 12 hours for full effect.",null,null,658,"—","8 hours","Hard"]
[null,null,null,null,null,null,null,null,null,null,null,null,null,4,"Ebur","Flower/Ingest","12 sp","Repairs sprains. All sprains, even if ligament is completely torn, will heal over a time period of 8 hours. Smaller sprains, causing a penalty of less than or equal to -15 will heal in 1 hour.",null,null,659,"—","1-8 hrs","Medium"]
[null,null,null,null,null,null,null,null,null,null,null,null,null,12,"Edram","Moss/Ingest","110 sp/ 55 sp","Mends broken bones. The injured bone(s) must be set before ingestion of the herb. If herb is fresh (i.e picked within a minute) the healing time is 2 hours). If herb is preserved healing time is 8 hours. For every additional bone injury to be healed, add another 8 hour to total recovery time. Edram targets the worst wound first, usually the one with highest penalty to it.",null,null,611,"—","2-8 hrs","Sheer Folly"]
[null,null,null,null,null,null,null,null,null,null,null,null,null,8,"Febfendu ","Root/Brew","42 sp","Restores hearing regardless of how severe the damage to the ear is. Recovery time is between 8 hours and 1 week, depending on the severity of the damage (GM discretion). ","Drawback indicate a permanent reduction of hearing ability even though hearing is restored.",10,668,"—","Varies","Medium"]
[null,null,null,null,null,null,null,null,null,null,null,null,null,13,"Gildarion","Leaf/Paste","110 sp","Major organ repair. Recovery time is 1-10 days depending on the severity of the wound. ","Drawback indicate a lowered function of the healed organ, such as persistent pain causing a permanent -5 penalty.",5,113,"—","1-10 days","Extremely hard"]
[null,null,null,null,null,null,null,null,null,null,null,null,null,6,"Gorfon","Fruit/Ingest","38 sp","Heals one nerve damage.","Drawback causes user to go into sleep lasting for 11-20 hours.",null,null,"—","8 hours/ 11-20 hrs","Hard"]
[null,null,null,null,null,null,null,null,null,null,null,null,null,10,"Gursamel","Stalk/Apply","66 sp","Mends one broken bone. It take 6 hours of total rest (immobility) for full effect. If the victim is moved the herb will not take full effect (i.e some penalty will remain even when 6 hours has passed).",null,null,612,"—","6 hours","Extremely hard"]
[null,null,null,null,null,null,null,null,null,null,null,null,null,11,"Hegheg","Root/Paste","14 sp","Heals one damaged cartilage in 8 hours.",null,null,660,"—","8 hours","Sheer Folly"]
[null,null,null,null,null,null,null,null,null,null,null,null,null,10,"Hoak-Foer","Flower/Ingest","50 sp","Cures mental diseases in 1-6 days depending on severity. Will also cure mind loss (i.e stat loss in any non-physical stat). Stats temporary lowered by Stat Gain rolls or spells are increased by 1 point per day after the herb is ingested until it reach its former value. ","If drawback occurs, the ingester of the herb suffer a temporary loss of movement for 1-10 weeks. During this period user is at -15 to all moving maneuvers.",10,805,"—","1-6 days","Easy"]
[null,null,null,null,null,null,null,null,null,null,null,null,null,11,"Kakduram","Fruit/Ingest","130 sp","Restores hearing unless the ear is totally destroyed. ","Drawback indicate a permanent reduction of hearing ability even though hearing is restored.",null,669,"—","20 rnds","Extremely hard"]
[null,null,null,null,null,null,null,null,null,null,null,null,null,9,"Klandun","Fern/Ingest","150 sp","Cures paralysis. Immediate effect.",null,null,118,"—","Instant","Very Hard"]
[null,null,null,null,null,null,null,null,null,null,null,null,null,20,"Kolandor","Leaves/Apply","900 sp","Regenerates limbs in 6 months. ","If drawback occurs, a malformed and useless limb will grow back.",null,120,"—","6 months","Absurd"]
[null,null,null,null,null,null,null,null,null,null,null,null,null,15,"Laurre","Flower/Ingest","150 sp","Cures Morgurth in 24 hours. Also usable to awaken anyone from almost any sleep, catatonia or coma condition (take 1-10 rounds).",null,null,121,"—","24 hours","Absurd"]
[null,null,null,null,null,null,null,null,null,null,null,null,null,12,"Numenelos","Moss/Powder","366 sp","Complete nerve regeneration in 1-100 minutes (depending on severity of injury, a damaged nerve causing a -10 penalty should take a minute while a completely destroyed nervous system would take 100 minutes).",null,null,null,"—","1-100 min","Hard"]
[null,null,null,null,null,null,null,null,null,null,null,null,null,10,"Siran","Clove/Ingest","95 sp","Restoration of 1 damaged organ. ","The drawback on Siran is a rare skin disease that develops over 24 hours. Targets AP is lowered by 33% and the effects is even worse (50%) if skin is exposed to full sunshine. The disease will disappear in 1 week.",null,671,"—","1 hour","Very Hard"]
[null,null,null,null,null,null,null,null,null,null,null,null,null,10,"Tarnas","Nodule/Brew","165 sp","Repairs all damaged organs in one body.","If drawback occurs, user will be totally incapacitated for the duration (i.e 8 hrs) due to nausea and vomitting.",null,673,"—","8 hours","Very Hard"]
[null,null,null,null,null,null,null,null,null,null,null,null,null,14,"Tatharsul","Bread/Ingest","450 sp","Repairs nervous system to normal in 1-10 rounds.",null,null,715,"—","1-10 rnds","Light"]
[null,null,null,null,null,null,null,null,null,null,null,null,null,2,"Terbas","Leaf/Apply","15 sp","Heals nerve damage. Require 1 day per -10 penalty for recovery. A nerve damage causing victim a -30 penalty will heal in 3 days with the help of Terbas.",null,null,663,"—","1-10 days","Light"]
[null,null,null,null,null,null,null,null,null,null,null,null,null,11,"Ucason","Grass/Smoke","36 sp","Cures blindness from nerve damage, spells or any reason as long as the eye is not physically destroyed.",null,null,137,"—","2-20 rnds","Extremely hard"]
[null,null,null,null,null,null,null,null,null,null,null,null,null,11,"Ul-Ucason","Grass/Smoke","150 sp","A magically enhanced variant of the Ucason herb. Restores eye-sight to any victim even if eyes are destroyed. ",null,null,138,"—","4-40 rnds","Sheer Folly"]
[null,null,null,null,null,null,null,null,null,null,null,null,null,16,"Wek-wek","Nodule/Brew","300 sp","Magical herb that repairs all damaged organs in one body within 2-20 rounds. ",null,null,674,"—","2-20 rnds","Sheer Folly"]
[null,null,null,null,null,null,null,null,null,null,null,null,null,16,"Wifurwif","Lichen/Ingest","420 sp","Nerve repairs. ",null,null,664,"—","20 rnds","Extremely hard"]
[]
[]
[null,null,null,null,null,null,null,null,null,null,null,null,null,"Level","Herb","Form/Prep","Cost","Effect","Sideeffects/drawbacks","Risk","CL","Max effect","Time/ Duration","Finding"]
[null,null,null,null,null,null,null,null,null,null,null,null,null,null,"Nutrition"]
[null,null,null,null,null,null,null,null,null,null,null,null,null,10,"Chap Beech Nut","Nut/Ingest","15 bp","1 days nutrition.",null,null,null,"—","1 day","Very Hard"]
[null,null,null,null,null,null,null,null,null,null,null,null,null,1,"Cram","Bread/Ingest","13 bp","Dwarven waybread. A 4 oz slice provide 1 days nutrition. A 10-slice loaf costs 13 sp. Keeps 7 weeks if stored dry. Tastes of mushrooms.",null,null,712,"—","1 day","Easy"]
[null,null,null,null,null,null,null,null,null,null,null,null,null,6,"Furry Oak Acorn","Nut/Ingest","12 bp","1 nut provide 1 days nutrition. However one cannot live for more than 7 days on Furry Oak Acorns without suffering nutrition shortage.",null,null,null,1,"1 day","Medium"]
[null,null,null,null,null,null,null,null,null,null,null,null,null,12,"Grapeleaf","Nectar/Ingest","7 sp","1 days nutrition. If taken before going to sleep it also causes dreams for 2 hours. The dreams often come true. Target has +50 bonus to Divination for these 2 hours.","Drawback mean target involuntarily falls asleep unless a RR vs the herbs level is made.",null,717,1,"1 day/      2 hours","Very Hard"]
[null,null,null,null,null,null,null,null,null,null,null,null,null,6,"Hiam","Moss/Ingest","5 bp","1 days nutrition. Those who ingest Hiam moss find themselves alert and vigorous for 24 hours. Can be used for max 4 consecutive days. After that time a user must rest (or be at -75 to all activity) for twice as many days as he have used the herb. ","Drawback: outside the hillmen society some people are allergic to Hiam moss, causing them to suffer convulsions and eventually dying a horribly torturous death if RR fails by 21+.",null,null,"—","24 hours","Hard"]
[null,null,null,null,null,null,null,null,null,null,null,null,null,6,"Kujanikapurd","Mushroom/Ingest","5 sp","1 days nutrition.","If drawback occur, user will be drowsy and unbalanced, all maneuvers at -30 for the day.",null,null,1,"1 day","Medium"]
[null,null,null,null,null,null,null,null,null,null,null,null,null,1,"Lembas","Bread/Ingest","N/A","Elven waybread. Lembas feeds the will, providing +15 to RR vs disease, poisons and will contests (SD) and +15 Exhaustion points. It keeps for many years without deteriation. 1 thin cake sustains a full grown man for 1 day.",null,null,null,"—","1 day","Absurd"]
[null,null,null,null,null,null,null,null,null,null,null,null,null,6,"Lemsang","Mushroom/Ingest","11 sp","Dwarven mushroom. Dried, it keeps for many weeks without deteriation. 1 weeks nutrition.",null,null,null,"—","1 week","Hard"]
[null,null,null,null,null,null,null,null,null,null,null,null,null,6,"Nelisse","Leaf/Brew","8 bp","1 days nutrition. ","Drawback indicates that after drinking the brew user become sluggish and tired, performing at -50 for 1 hour.",null,807,"—","1 day","Hard"]
[null,null,null,null,null,null,null,null,null,null,null,null,null,6,"Ukur","Nut/Ingest","6 bp","One nut equals one days nutrition.","Drawback indicate user has a -10 due to hunger, unless something else is ingested.",null,650,"—","24 hours","Medium"]
[null,null,null,null,null,null,null,null,null,null,null,null,null,1,"Ulginor","Bread/Ingest","15 bp","1 days nutrition per slice. Keeps 1-2 months. Tastes of cheese & spinach. A 10 slice loaf costs 15 sp.",null,null,716,"—","24 hours","Routine"]
[]
[]
[null,null,null,null,null,null,null,null,null,null,null,null,null,"Level","Herb","Form/Prep","Cost","Effect","Sideeffects/drawbacks","Risk","CL","Max effect","Time/ Duration","Finding"]
[null,null,null,null,null,null,null,null,null,null,null,null,null,null,"General Purpose Herbs"]
[null,null,null,null,null,null,null,null,null,null,null,null,null,6,"Ajkara","Incense/Smoke","30 sp","Truth serum. RR failure by 1-25 put victim at -10 for 1-10 hours. Victim behave slow and drugged. RR failure by 26-50 results in -20 and victim being easy to interrogate (+50 to any Lie Perception rolls). RR failure by 51+ results in target being unable to lie.",null,null,202,"—","1-10 hrs","Medium"]
[null,null,null,null,null,null,null,null,null,null,null,null,null,11,"Ankii","Berry/Ingest","17 sp","Equals 8 hours of good sleep. Dangerous to use for prolonged periods. If used twice per week = 5 points of CON loss, thrice = lose 15 pts, four times = lose 30 pts. Four times = RR or coma.","Drawback lowers CON-stat (temp) by 1. Overuse is dangerous.",null,676,"—","Active for 24 hrs","Extremely hard"]
[null,null,null,null,null,null,null,null,null,null,null,null,null,1,"Arlan","Root/Ingest","1 cp","Decongestant. +20 RR vs common cold. Speeds recovery rate from respiratory ills by 5x. One dose per day.",null,null,638,"—","Active for 24 hrs","Easy"]
[null,null,null,null,null,null,null,null,null,null,null,null,null,3,"Arunya","Root/Brew","6 bp","Causes deep sleep (unconsciousness) for 1-4 hours. Every hour slept equals 4 hours of normal rest. User runs the risk of addiction if used for 2 or more consecutive days. ","Drawback causes addiction. First use has regular drawback factor. Second day use  increases drawback by 15. If user take more than one dose per 8 hour period it will act as a Mild conversion poison. ","0/15",801,"—","20 rnds/  1-4 hrs","Light"]
[null,null,null,null,null,null,null,null,null,null,null,null,null,10,"Athelas","Leaf/Brew","5 bp","Cures anything on the living. Full effect only in the hands of a true king, in which it may substitute nearly every other herb known. Hastens the healing process (x3), neutralizes minor poisons, slows major poisons and staves off supernatural maladies.","Does not bring back the dead.",null,639,"—","Varies","Hard"]
[null,null,null,null,null,null,null,null,null,null,null,null,null,4,"Attanar","Moss/Apply","6 sp","Cures fever in 24 hours.",null,null,640,"—","24 hours","Medium"]
[null,null,null,null,null,null,null,null,null,null,null,null,null,20,"Awn","Bark/Brew","750 sp","Joins limbs. Require complete immobility.","Drawback causes enormous and lasting pains from the joined limb, equaling a permanent -10 penalty to all activity including use of limb.",null,103,"—","8 hours","Absurd"]
[null,null,null,null,null,null,null,null,null,null,null,null,null,5,"Brorkwilb","Flower/Ingest","18 sp","Allows shared dreams with a family member within 100 miles/level. Lasts for 8 hours during which person is asleep and may communicate (full duplex) with his family member. ","Drawback results in either (01-33) that herb has no effect or (34-66) that the shared dreams is with an entirely random target or (67-100) that the user gets a vision of something else, important or unimportant.",15,802,"—","8 hrs","Light"]
[null,null,null,null,null,null,null,null,null,null,null,null,null,10,"Cicino","Leaf/Brew","7 sp","1 dose provide +40 RR vs disease for 3 days and will provide a second RR for anyone already incubated.",null,null,null,1,"3 days","Very Hard"]
[null,null,null,null,null,null,null,null,null,null,null,null,null,3,"Delrean","Bark/Apply","1 bp","Repels any insect. Smells foul within a 50 feet radius.",null,null,641,"—","12 hrs","Easy"]
[null,null,null,null,null,null,null,null,null,null,null,null,null,12,"Faghiu","Flower/Brew","100 sp","Love potion made from the magical Vanimelda flower. If imbibed the target will be faithful and loving versus the one who administers the potion or has worn it close to his heart for a prolonged period of time. The effect will last for 1-100 days (1 day per 1 failure up to 100). For more rules on Love Potions, see the Hands of the Healer p.147.","Drawback will cause equally strong emotions, but of other types: i.e hate, anxiety, fear, sorrow etc, in target.",10,null,"—","1-100 days","Very Hard"]
[null,null,null,null,null,null,null,null,null,null,null,null,null,7,"Felmather","Leaf/Ingest","50 sp","Mental summons of 1 friend (folk or beast) within 300' per level of user. This herb also serve as a powerful coma relief, awakening the comatose victim within 1-10 minutes of ingestion. ","Drawback will cause the attention of other, maybe hostile, beasts of the area.",15,642,"—","Varies","Hard"]
[null,null,null,null,null,null,null,null,null,null,null,null,null,10,"Fleabane","Leaves/Apply","3 bp","Repels blood sucking insects. Comes in powder and juice form. The powder keeps for several months while the juice must be used with one week.",null,null,null,"—","1 day","Extremely hard"]
[null,null,null,null,null,null,null,null,null,null,null,null,null,10,"Fukavar","Flower/Smoke","22 sp","Allows mental summons of 1 friend within 20 miles. The summons take 20 rounds to perform and user may NOT communicate with the summoned friend by use of this herb. The summoned friend will know the distance and direction towards his friend for 24 hours.","Drawback awakens the interrest of someone else than desired. Perhaps a Faerië or other being of the twilight world?",20,112,"—","Varies","Very Hard"]
[null,null,null,null,null,null,null,null,null,null,null,null,null,13,"Harlindar","Plant/Brew","24 sp","Assures safe childbirth. Harlindar tea shall be consumed one cup every morning the entire labor for full effect. The price noted covers a whole 9 months.","Drawback need only be rolled for once during the entire treatment. If drawback occur, child will be delivered safely, but mother might die (10% risk, depending on circumstances).",null,115,"—","9 months","Hard"]
[null,null,null,null,null,null,null,null,null,null,null,null,null,10,"Hevik","Leaves/Ingest","12 sp","Intoxicant. Induces sleep for 11-20 hours. RR vs 10th lvl if ingested. RR vs 3rd lvl if smoked.","Drawback causes spastical cramps, user will be out/prone for 1-10 rounds, thereafter at -10 to all activity. Nerve damage.",null,218,"—","11-20 hours","Very Hard"]
[null,null,null,null,null,null,null,null,null,null,null,null,null,6,"Hugar","Root/Ingest","1 sp","Harmless circulatory poison. Causes sleep and deep unconsciousness within 6-12 rounds of ingesting. Sleep lasts for 1 hour per 10 failure, but no longer than 3 hours maximum. 1 hours sleep equals 4. ","Drawback equals the same effects as from a Mild circulatory poison.",10,805,"Mild","Varies","Medium"]
[null,null,null,null,null,null,null,null,null,null,null,null,null,10,"Joef","Plant/Ingest","20 sp","Allows mental summons of 1 sentient friend from up to 1 mile'/lvl. The friend know that he has been summoned but has no obligation to go to the summoner (i.e he is in no way forced). The process take 3 rounds of concentration. The summoned friend will know the distance and direction towards his friend for 24 hours.",null,null,683,"—","3 rounds","Light"]
[null,null,null,null,null,null,null,null,null,null,null,null,null,4,"Klynyk","Oyster/Apply","2 sp","Removes hair for several days. Take 12-24 hours to take effect.",null,null,119,"—","12-24 hours","Easy"]
[null,null,null,null,null,null,null,null,null,null,null,null,null,2,"Latha","Stem/Brew","3 sp","Cures common cold in 1-10 hours depending on severity. Provide +10 to RR vs disease for 24 hours. Heals 1-2 hit points over 20 rnds.",null,null,643,"—","1-10 hours","Medium"]
[null,null,null,null,null,null,null,null,null,null,null,null,null,18,"Lestagii","Crystal/Ingest","75 sp","When ingested the user falls into a deep sleep lasting for 24 hours. During that time any stat loss other than due to age will be restored (up to a full potential). Each dose affects only one stat. ","Drawback indicate herb has no beneficial effect and user falls asleep 25-34 hours (24 + 1d10) within 1-10 minutes of ingestion.",15,694,"—","24 hours","Absurd"]
[null,null,null,null,null,null,null,null,null,null,null,null,null,9,"Lichen Gloriosa","Lichen/Apply","2 sp","Sharpens swords to cut even stone. The effects last for 1-10 strokes. Provide non-magical weapons with an additional +5 OB for 1-10 attacks, depending mostly on what armor the enemy wears.",null,null,null,"—","Varies","Extremely hard"]
[null,null,null,null,null,null,null,null,null,null,null,null,null,10,"Lu-jy-Mirenna","Berry/Ingest","10 sp","Beneficial visions. Powerful hallucinogen that puts user at -15 to all actions for 1-10 hours during which he has visions of the future, the present and the past. ","The herb still work even if drawback is rolled, but the visions are then so disturbing that the character must resist (with SD-bonus) not to act upon them.",20,null,"—","1-10 hours","Extremely hard"]
[null,null,null,null,null,null,null,null,null,null,null,null,null,1,"Nelthandon","Plant/Ingest","1 bp","Emetic. Induces vomiting in 20 mins. Vomitting lasts for 1-2 hours and puts victim at -20 while it lasts.",null,null,126,"—","20 mins/    1-2 hours","Routine"]
[null,null,null,null,null,null,null,null,null,null,null,null,null,1,"Red Willow","Leaf/Brew","5 bp","Herb commonly found in Dagorlad swamp. Cures fever. Also doubles the effect of the common healing herb Thurl. Relieves pain and swelling. Only 1 dose can have effect per day. ","If drawback occur, or more than 5 doses are used at the same time, user (1-50) suffer nausea (-20), (51-75) falling blood pressure (25% risk each round of passing into unconsciousness) or (76-100) coma.",null,127,1,"6 hours/ 24 hours","Easy"]
[null,null,null,null,null,null,null,null,null,null,null,null,null,3,"Silraen","Plant/Brew","5 bp","Analgesic. Smells so strong that it cannot be hidden in food or drink. When consumed target must resist vs 4th lvl (poison) or fall asleep. The sleep is deep and unwakable. Usually used during surgical operations due to it's lack of harmless side-effects. ","Drawback does not interfere with the herbs positive qualities, but adds a terrible headache (-15) for 1-10 hours after awakening.",5,129,"—","20 rnds/   1-10 hours","Easy"]
[null,null,null,null,null,null,null,null,null,null,null,null,null,"1N","Sulimquelote","Flower/Brew","2 sp","Fragrant scent for 1-4 hours. \"For the Ladies\". Rub some on the skin. One bottle lasts for 4 weeks for a day-to-day user.",null,null,null,"—","1-4 hours","Medium"]
[null,null,null,null,null,null,null,null,null,null,null,null,null,1,"Tharm","Kelp/Apply","15 bp","Sun lotion. Protects versus the extreme sun in the deserts of southern Middle Earth. The price noted is for a 8 oz bottle (225 gr) which lasts for about 1 week during normal use.",null,null,135,"—","Instant/   24 hours","Routine"]
[null,null,null,null,null,null,null,null,null,null,null,null,null,8,"Tukamur","Grass/Brew","9 sp","Euphoric. Allows shared dreams with friend(s) similarly affected within 50 miles/level. The range is counted on the highest level friend. This herb causes addiction in all cases (see rules for withdrawal) which lower its popularity.",null,100,810,"—",null,"Medium"]
[]
[]
[null,null,null,null,null,null,null,null,null,null,null,null,null,"Level","Herb","Form/Prep","Cost","Effect","Sideeffects/drawbacks","Risk","CL","Max effect","Time/ Duration","Finding"]
[null,null,null,null,null,null,null,null,null,null,null,null,null,null,"Physical Enhancement"]
[null,null,null,null,null,null,null,null,null,null,null,null,null,10,"Agaath","Berry/Ingest","10 sp","Enable user to act normal without having to breath. Protects against inhalable poisonous gases and provide the ability to be under water for 5 minutes. ","Drawback confers a lung disease breaking out within 1-4 days of  ingesting the Agaath. User is at -25 until a RR is made (minimum two full days).",null,675,"—","5 min","Easy"]
[null,null,null,null,null,null,null,null,null,null,null,null,null,4,"Alshana","Bread/Ingest","12 sp","Dwarven bread, provided to the guests of dwarven underground cities to aid them in the dark caverns. Provide nightvision 300' (i.e user still need a torch or lantern to see) for 1 hour. Keeps 6-8 weeks. Seldom sold on the open market.",null,null,701,"—","1 hr","Easy"]
[null,null,null,null,null,null,null,null,null,null,null,null,null,8,"Atigax","Root/Brew","10 sp","Prevents blindness due to sudden or blinding light. Lasts 9 hours. User is immune to Sudden Light.",null,null,677,"—","9 hrs","Medium"]
[null,null,null,null,null,null,null,null,null,null,null,null,null,15,"Blue Eyes","Flower/Brew","14 sp","x3 vision (+25 visual perception) and 50' infravision for 3 hours. Usable once per day.",null,null,679,1,"3 hours","Extremely hard"]
[null,null,null,null,null,null,null,null,null,null,null,null,null,17,"Boskone","Powder/Inhale","12 sp","Effect equals a Nature's Awareness spell lasting for 11-20 rounds. Require concentration.","Drawback confers a severe headache that puts user at -10 for 1-8 hours.",5,null,"—","11-20 rnds","Sheer Folly"]
[null,null,null,null,null,null,null,null,null,null,null,null,null,12,"Breldiar","Flower/Ingest","50 sp","Euphoric. Subtracts 30 from moving maneuvers and melee. Add +50 to missile attacks and directed spells. Lasts for 1 hour.",null,null,678,"—","1 hour","Medium"]
[null,null,null,null,null,null,null,null,null,null,null,null,null,8,"Chrume","Mushroom/Ingest","15 sp","Imbiber has +20 to CO & PR for 1-10 hours. -10 to AG & QU for the same time period. Euphoric and addictive.","Drawback indicate an addiction to the herb. See addiction rules in Gamemaster Law, p. 90.",null,null,"AF","1-10 hours","Medium"]
[null,null,null,null,null,null,null,null,null,null,null,null,null,12,"Ecsasse","Clove/Brew","16 sp","Imbiber is immune to mind attacks and mind disease for the duration (1-10 hours).",null,null,null,"—","1-10 hrs","Very Hard"]
[null,null,null,null,null,null,null,null,null,null,null,null,null,6,"Feduilas","Flower/Smoke","11 cp","Intoxicant. Provide +20 to RR vs Mentalism and Essence, but also -10 to Agility and Quickness stats for 1-5 hours.","Drawback indicate an addiction to the herb. See addiction rules in Gamemaster Law, p. 90.",15,null,"AF","1-5 hrs","Hard"]
[null,null,null,null,null,null,null,null,null,null,null,null,null,4,"Galenas","Leaf/Smoke","1 bp","Relaxing intoxicant. User feels happy, but is slow and acts at -75 for 1-10 rounds. The euphoric feeling continue for 1-6 hours, during which user is at a mere -10.","Drawback indicate an addiction to the herb. See addiction rules in Gamemaster Law, p. 90.",null,803,"AF","1-10 rnds","Medium"]
[null,null,null,null,null,null,null,null,null,null,null,null,null,5,"Gort","Leaf/Ingest","13 cp","Narcotic intoxicant. User has +10 to Presence and Appearance stat-bonus for 2 hours. After that user will be at -50 to all activities for 1-10 hours.","Drawback indicate an addiction to the herb. See addiction rules in Gamemaster Law, p. 90.",5,803,"AF","Varies","Hard"]
[null,null,null,null,null,null,null,null,null,null,null,null,null,12,"Gylvir","Algae/Ingest","62 sp","Enables imbiber to breathe under water for 4 hours. ","If drawback occurs, user is not able to breathe air for the entire duration of the herb.",null,681,"—","4 hours","Very Hard"]
[null,null,null,null,null,null,null,null,null,null,null,null,null,13,"Kilmakur","Root/Brew","19 sp","Protects versus flame and heat for 1-10 hrs. Character has a +30 DB vs all heat attacks.",null,null,685,"—","1-10 hours","Extremely hard"]
[null,null,null,null,null,null,null,null,null,null,null,null,null,7,"Klagul","Bud/Brew","15 sp","Provides elven eyesight for 6 hours. Imbiber can see perfectly at night (300') without lightsource as long as there is starlight. Also confers a slight infravision (30') so that things that emanate heat are more visible in darkness. ","If drawback occurs, user gets a horrible migraine, beginning within 6-10 hours and lasting 1-10 hours. This head ache gives user a -25 to all actions.",null,686,"—","6 hrs","Light"]
[null,null,null,null,null,null,null,null,null,null,null,null,null,6,"Kykykyl","Bread/Ingest","66 sp","Haradrim bread, secret recipe. Made from a plethora of quite common herbs. Allows one to see with perfect clarity for 1 hour regardless of environment or injuries. Keeps 2-20 weeks.",null,null,714,"—","1 hour","Easy"]
[null,null,null,null,null,null,null,null,null,null,null,null,null,12,"Lothnimgil","Flower/Ingest","26 sp","Elven flower, grows in and near Lothlorien. Heals user of 1-10 hit points. Provide extended self-confidence and allows additonal +5 to all actions for 24 hours.",null,null,null,"—","20 rnds/ 24 hrs","Extremely hard"]
[null,null,null,null,null,null,null,null,null,null,null,null,null,10,"Marku","Nut/Ingest","22 sp","Provides user with infravision (100') for 6 hours. This vision is able to see through even magical darkness.",null,null,687,"—","6 hours","Very Hard"]
[null,null,null,null,null,null,null,null,null,null,null,null,null,10,"Megillos","Leaf/Ingest","4 sp","Aka. Megilloth. If eaten fresh: increases visual perception by 50-500% for 10 mins. If roasted  the range of vision lasts for 4-8 hours. Usually this herb confers a +10 perception modification for the duration. ","Drawback confers headache and dizziness (-10 penalty for all manuevers other than perception) for the duration.",null,688,"—","Varies","Light"]
[null,null,null,null,null,null,null,null,null,null,null,null,null,12,"Merrig","Thorn/Brew","2 sp","Daily ingestion for 10 consecutive days increases PR and AP-stat by 5 (cannot exceed 102). Interruption and withdrawal from a habit of Merrig use means loss of stats (-10 CO, -5 RE, -5 PR and -5 AP).","Drawback indicate an addiction to the herb. See addiction rules in Gamemaster Law, p. 90.",15,695,"AF","10 days","Sheer Folly"]
[null,null,null,null,null,null,null,null,null,null,null,null,null,10,"Phacalus","Root/Ingest","3 sp","A herb used by the Beffraen in their religious ceremonies. PR, IN, EM, RE & EQ are increased by 1 permanently (cannot exceed 102). The Beffraen have, due to genetic differences, no increased drawback risk on this herb.","Drawback puts user into coma for 4 days all stats are decreased by 15. Complex description, see Hands of the Healer p.128.",10,"p.128","—","1 hr","Light"]
[null,null,null,null,null,null,null,null,null,null,null,null,null,11,"Rud-tekma","Fruit/Ingest","38 sp","Magical herb from the east. Increases Base Spell Casting by +20 for 1 hour. All moving maneuvers and OB are at -20. There is 10% chance for every spell cast while under effect of Rud-Tekma that the spell unintenionally is cast on nearest target.",null,null,689,"—","1 hour","Very Hard"]
[null,null,null,null,null,null,null,null,null,null,null,null,null,8,"Sha","Flower/Brew","8 sp","Provide a 300' nightvision for 1-5 hours.","Drawback causes user to suffer a (-20 penalty)  diahorrea, starting 11-20 hours after consumption, lasting for 1-5 days. Many of the Hillmen of the Trollshaws are immune to this side effect.",10,null,"—","1-5 hours","Very Hard"]
[null,null,null,null,null,null,null,null,null,null,null,null,null,3,"Sweet Galenas","Leaf/Smoke","1 sp","Euphoric relaxant. All within 10' radius are relaxed and anyone directly inhaling the smoke will be stoned (-75 to all maneuvers for 1-10 rounds).","Drawback indicate an addiction to the herb. See addiction rules in Gamemaster Law, p. 90.",10,132,"AF","1-10 rnds","Easy"]
[null,null,null,null,null,null,null,null,null,null,null,null,null,4,"Tartiella","Leaf/Smoke","8 bp","Euphoric. All stats drop by 10 for 1-10 hours. For more detailed description, see Hands of the Healer p. 139.","Drawback indicate an addiction to the herb. See addiction rules in Gamemaster Law, p. 90.",10,null,"AF","1-10 hours","Light"]
[null,null,null,null,null,null,null,null,null,null,null,null,null,12,"Thembitul","Flower/Ingest","36 sp","Provide +50 RR vs disease and poisons.",null,null,null,"—","24 hours","Sheer Folly"]
[null,null,null,null,null,null,null,null,null,null,null,null,null,5,"Trudurs","Moss/Brew","2 sp","Provide +10 to RR versus disease for 6-10 days.",null,null,644,"—","6-10 days","Medium"]
[null,null,null,null,null,null,null,null,null,null,null,null,null,2,"Yaran","Pollen/Ingest","17 bp","Increased sensitivity to smell and taste allows user to detect poisons (and other things) on blades or in food. +50 to all perception based on smell/taste for 1 hour, including Poison perception.",null,null,691,"—","1 hour","Easy"]
[null,null,null,null,null,null,null,null,null,null,null,null,null,6,"Zur","Fungus/Brew","27 sp","Enhances smell and hearing for 1 hour. The hearing range is increased by x3 and that will provide +50 to perception based on hearing.",null,null,693,"—","1 hour","Medium"]
[]
[]
[null,null,null,null,null,null,null,null,null,null,null,null,null,"Level","Herb","Form/Prep","Cost","Effect","Sideeffects/drawbacks","Risk","CL","Max effect","Time/ Duration","Finding"]
[null,null,null,null,null,null,null,null,null,null,null,null,null,null,"Burn and Exposure Relief"]
[null,null,null,null,null,null,null,null,null,null,null,null,null,6,"Alambas","Grass/Apply","6 sp","Heals 4 square feet of any burns. Relieving any hit points and penalties from that injury. As a rule of thumb, one dose of Alambas is enough to heal the injuries from one heat critical.",null,null,613,"—","8 hrs","Medium"]
[null,null,null,null,null,null,null,null,null,null,null,null,null,1,"Aloe","Leaf/Apply","1 bp","Double healing rate for minor burns. Immediately heals 5 hit points from burns. For medium or major burns five or ten times the dosage is needed for the same healing effect.",null,null,614,"—","Active for 24 hrs","Medium"]
[null,null,null,null,null,null,null,null,null,null,null,null,null,10,"Culkas","Leaf/Apply","36 sp","1 dose heals the effects of any type of burns (one critical). This herb completely negate any hit points and penalties taken from burns. Full healing take 1 hour but the wound is tender for a few more days.",null,null,615,"—","1 hour","Medium"]
[null,null,null,null,null,null,null,null,null,null,null,null,null,9,"Himros","Leaves/Apply","15 sp","Cures burns. Will heal the injuries from 1 wound in 8 hours (including penalties and hits). Also relieves Pangwood inflammation.",null,null,116,"—","8 hours","Very Hard"]
[null,null,null,null,null,null,null,null,null,null,null,null,null,6,"Jojojopo","Leaf/Apply","5 sp","Cures frostbite. Heals 2-20 hits and relieves penalties by 10 from wounds caused by cold.",null,null,616,"—","20 rnds","Medium"]
[null,null,null,null,null,null,null,null,null,null,null,null,null,8,"Kelventari","Berry/Rub","9 sp","1 dose heals the effects of a 1st or 2nd degree burn (one critical, \"A\" take 1 hour, \"B\" take 2 hours, \"C\" take 4 hours, \"D\" take 6 hours and \"E\" take 8 hours to heal). The herb also instantly relieves 1-10 hit points delivered by burns.",null,null,617,"—","1-8 hours","Light"]
[null,null,null,null,null,null,null,null,null,null,null,null,null,12,"Telek","Berry/Apply","48 sp","Cures frostbite in 10 rounds. Can be used on one wound inflicted by frostbite. Halves penalties and bleeding by half and heal 3-30 hit points resulting from cold.",null,null,null,"—","10 rnds","Very Hard"]
[null,null,null,null,null,null,null,null,null,null,null,null,null,10,"Veldurak","Kelp/Apply","32 sp","Cures frostbite. Heals 1-50 hits and lowers a penalty by 15 from a wound resulting from cold.",null,null,618,"—","20 rnds","Hard"]
[null,null,null,null,null,null,null,null,null,null,null,null,null,10,"Vessin","Clams/Apply","30 sp","Cures 2nd degree burns (a burn from either an \"A\", \"B\" or \"C\" severity critical) in 20 rnds or 3rd degree burns (\"D\" or \"E\" severity critical) in 8 hours. Vessin will completely remove all hits and penalties resulting from burn.",null,null,140,"—","20 rnds   (8 hours)","Hard"]
[]
[]
[null,null,null,null,null,null,null,null,null,null,null,null,null,"Level","Herb","Form/Prep","Cost","Effect","Sideeffects/drawbacks",null,"CL","Max effect","Time/ Duration","Finding/ Preparing"]
[null,null,null,null,null,null,null,null,null,null,null,null,null,null,"Poisons and Rotten things"]
[null,null,null,null,null,null,null,null,null,null,null,null,null,10,"Acaana","Flower/Paste","350 sp","Nerve poison. Black paste that destroys nervous system. RR failure by 01-15 results in a destroyed nervous system and incapacitated victim. RR failure by 16-30 sends victim into a coma. RR failure by 31+ results in instant death.",null,"—",916,"N/A","Instant","Absurd"]
[null,null,null,null,null,null,null,null,null,null,null,null,null,10,"Adder Venom","Venom/Paste","80 sp","Muscle poison. RR failure with 1-25 results in a pseudoparalysis causing -2 per 1 failure for 5-10 rounds. Failure with 26-50 results in similar paralysis for 11-20 rounds. RR failure by 51+ equals death due to heart failure in 6 rounds.",null,"—",201,"N/A","1 round/  Varies","Extremely hard"]
[null,null,null,null,null,null,null,null,null,null,null,null,null,2,"Ancalthur","Grass/Liquid","25 sp","Circulatory poison. RR failure by 1-15 incapacitates victim for 1-5 hours (-100). RR failure by 16-30 results in incapacitation for 6-10 hours. RR failure by 31+ results in death due to oxygen starvation.",null,"—","N/A","N/A","3-6 rnds/  1-5 hrs or 6-10 hrs","Sheer Folly"]
[null,null,null,null,null,null,null,null,null,null,null,null,null,2,"Angurth","Bacteria/Paste","N/A","Bubonic disease. Cause fever and nausea for 2-10 days. RR failure by 01-15 leaves victim at -15. RR failure by 16-30 put victim at -25. RR failure by 31+ results in -50 and a slow, painful death over 1-6 days.","Some armies deliberately defile their weapons to cause epidemic diseases amongst enemies.","—",203,"N/A","1-3 hrs/     2-10 days","Routine"]
[null,null,null,null,null,null,null,null,null,null,null,null,null,3,"Asgurash","Snake/Paste","28 sp","Nerve poison. Brownish snake venom. RR failure causes a gradual paralysis of the inflicted area over 6-10 rnds, lasting for 5 minutes/10 failure. Paralysed area is useless. If head or chest is poisoned, the upper body is paralysed and target is incapacitated for the duration.",null,"—",917,"Mild","6-10 rnds/ varies","Extremely hard"]
[null,null,null,null,null,null,null,null,null,null,null,null,null,5,"Asp Venom","Venom/Paste","25 sp","Nerve poison. Clear fluid made into a paste. Struck limb is numb and useless for 1 day/10 failure. RR failure by 51+ means either loss of affected limb (i.e amputation is necessary) or death within 11-20 hours.",null,"—",204,"Moderate","6-10 rnds/ varies","Medium"]
[null,null,null,null,null,null,null,null,null,null,null,null,null,3,"Athanar","Snake/Liquid","15 sp","Reduction poison. Reduces CO-stat (temp) by 50 over the course of 6-10 hours. If CO-stat falls beneath zero, victim dies.",null,"—",205,"Mild","6-10 hours","Medium"]
[null,null,null,null,null,null,null,null,null,null,null,null,null,7,"Black Vines","Leaf/Liquid","7 sp","Intoxicant. Euphoria and inactivity for 2-20 hours. It confers no pain, but othervise acts as a respiratory poison. May be used as a medical anaestethic since it lowers the targets consciousness and receptibility to pain. ","Not very useful as a poison since it require target to drink large amounts.","—",null,"AF","2-20 hrs","Sheer Folly"]
[null,null,null,null,null,null,null,null,null,null,null,null,null,6,"Blade Hemlock","Plant/Paste","42 sp","Muscle poison. Incapacitation (-100) for 5 minutes per 10 failure, starting in 3 rounds. Failure by 26+ results in unconsciousness. Failure by 51+ results in instant unconciousness and death within 1-10 hours.",null,"—",216,"Mild","3 rnds/       Varies","Very Hard"]
[null,null,null,null,null,null,null,null,null,null,null,null,null,5,"Bragolith","Juice/Ingest","90 sp","Conversion poison. Phosphorescent green firefly juice. RR failure by 01-25 incapacitates (-100) victim until healed of the internal burns. Failure by 26+ causes victim to spontaneously combust, taking 20 hit points per round until dead.",null,"—",907,"N/A","6-10 rnds","Sheer Folly"]
[null,null,null,null,null,null,null,null,null,null,null,null,null,2,"Brithagurth","Roots/Paste","18 sp","Conversion poison. Venom causes hardening of tendons in 1-4 appendages. Areas affected become useless for 10 minutes/10 failure. Victim is at -25 per useless appendage. ","The -25 penalty from useless appandages are not cumulative with any penalties from the 11.2.3 Poison Severity Chart.","—",908,"Moderate","3 rnds/ varies","Sheer Folly"]
[null,null,null,null,null,null,null,null,null,null,null,null,null,3,"Bukandas Bulch","Wolves/Juice","12 sp","Respiratory poison. Gland juice induces asthma attack. Victim that fails RR by 01-25 is at -15 to all physical actions for 11-20 rnds. Victims that fail RR by 26+ is at -25 to all physical actions for 21-30 rnds. Movement is cut by 50% for the duration.",null,"—",207,"Mild","1-10 rnds/ varies","Extremely hard"]
[null,null,null,null,null,null,null,null,null,null,null,null,null,4,"Carcalen","Moss/Brew","36 sp","Nerve poison. RR failure by 01-25 results in a random limb being unusable for 1-100 days. RR Failure by 26-50 results in nerve damage: victim is out until nerves are healed. Failure by 51+ equals death in 20 rounds.",null,"—",null,"Moderate","20 rnds","Sheer Folly"]
[null,null,null,null,null,null,null,null,null,null,null,null,null,1,"Carnegurth","Flower/Liquid","5 sp","Circulatory poison. RR failure by 51+ equals massive internal blood clotting and death in 1-100 hours. If RR fails by less, check the results in table 11.2.3 Poison Descriptions Effect Descriptions.",null,"—",901,"Extreme","1-100 hours","Medium"]
[null,null,null,null,null,null,null,null,null,null,null,null,null,1,"Cathaana","Nut/Ingest","21 sp","Nerve poison. \"Sly viper\", white powder that causes euphoria for 1-10 rounds, thereafter victim acts normally for 1-10 minutes, after which he has to roll another RR. If that fails by 26+, he dies instantly.","If second RR is successful, there is no harm to victim.","—",918,"N/A","Instant","Very Hard"]
[null,null,null,null,null,null,null,null,null,null,null,null,null,7,"Craeg-Curfluin","Plant/Liquid","210 sp","Conversion poison. Magical poison extracted from Gargoyle blood. Very rare. RR failure by 1-15 causes unconsciousness for 1-10 rounds. RR failure by 16-30 confer a permanent coma and RR failure by 31+ turns victim to stone (also quite permanent).",null,"—",null,"Mild","Instant","Absurd"]
[null,null,null,null,null,null,null,null,null,null,null,null,null,5,"Cyclic Fever","Ticks/Paste","3 sp","Reduction poison. Paste made from ticks. Causes 3-4 cycles of fever spread over 5-10 days. During fever periods (lasting 6-10 hours) victim is at -10 per 10 RR failure.",null,"—",208,"N/A","1-10 days","Medium"]
[null,null,null,null,null,null,null,null,null,null,null,null,null,3,"Daxamas","Leaves/Ingest","42 sp","Muscle poison. Also named \"Sly Leaf\". The initial effects are often mild (or not even noticed), but this poisonous leaf causes a heart disease. If RR fails by 26+ the target will die in 1-100 days without warning.",null,"—",210,"N/A","1-100 days","Sheer Folly"]
[null,null,null,null,null,null,null,null,null,null,null,null,null,4,"Deadly Milkwhite Trumpet","Flower/contact/ inhalation","30 sp","Respiratory poison. Causes nausea and headache (-15) for 1-10 hours on a RR failure of 1-25. On a higher failure, follow the results in 11.2.3 Poison descriptions.",null,"—",null,"Moderate","20 rnds/    1-10 hours","Sheer Folly"]
[null,null,null,null,null,null,null,null,null,null,null,null,null,10,"Deadly Milkwhite Trumpet","Seed/Ingest","90 sp","Respiratory poison. On a RR failure by 26+ coma for 1-10 days. A severe RR failure by 51+ equals death in 1-10 days.",null,"—",null,"Extreme","20 rnds/   1-10 days","Sheer Folly"]
[null,null,null,null,null,null,null,null,null,null,null,null,null,8,"Din fuinen","Moss oil/Ingest","48 sp","Grows at the banks of Gûlduin in Mirkwood. Target failing by 1-25 will suffer total amnesia for 1 hour per 1 failure (i.e will forget anything that happened during the hours affected by the herb). Targets failing RR by 26+ will fall asleep for 2-20 hours and suffer amnesia for 2 hours per 1 failure.",null,"—",211,"—","6 rnds/     1-10 hrs","Hard"]
[null,null,null,null,null,null,null,null,null,null,null,null,null,6,"Dolimor","Fungus/Ingest","62 sp","Respiratory poison. RR failure by 21+ causes lungs to fail. Victim is immobilized within 1-10 minutes and dies in 1-3 hours if no antidote is applied.",null,"—",null,"Moderate","1-10 mins/ 1-3 hours","Very Hard"]
[null,null,null,null,null,null,null,null,null,null,null,null,null,3,"Dynallca","Leaf/Paste","1 sp","Muscle poison. Tan paste. Delivers 10 hits instanly and destroys victims hearing over 10 minutes. Bleeding from ears shows the effect.",null,"—",913,"Mild","10 mins/ permanent","Light"]
[null,null,null,null,null,null,null,null,null,null,null,null,null,2,"Etarka","Fish/Liquid","16 sp","Conversion poison. Heart is embedded in sick tissue and fat. Foe is at a cumulative -10 per day that passes since his poisoning. Death in 10-100 days unless antidote is applied.","When penalty reaches -100 (i.e in 10 days from poisoning) victim is incapacitated and waiting for death.","—",212,"Mild","1-100 days","Medium"]
[null,null,null,null,null,null,null,null,null,null,null,null,null,1,"Falsereg","Blood/Paste","8 sp","Nerve poison. Prepared from fish blood. RR failure by 01-25 results in concentration disorders, loss of memory and anxiety, causing a -1 per 1 failure penalty to all actions. Failure by 26+ also results in immediate internal bleeding (3 hits/rnd for 6-60 rounds).",null,"—",null,"N/A","20 rnds/ 11-20 weeks","Extremely hard"]
[null,null,null,null,null,null,null,null,null,null,null,null,null,9,"Galenaana","Leaf/Powder","63 sp","Respiratory poison. Green powder which kill elves on RR failure of 51+. Other races suffer a coma for 1-100 weeks if RR fail by 51+. The effects is othervise as noted in Gamemaster Law p.94.",null,"—",929,"Moderate","20 rnds","Very Hard"]
[null,null,null,null,null,null,null,null,null,null,null,null,null,15,"Gartaan","Waters/Ingest","35 sp","Conversion poison. Causes hemophilia. Any bleeding will be doubled until cured of the disease.",null,"—",214,"Mild","Instant/ varies","Sheer Folly"]
[null,null,null,null,null,null,null,null,null,null,null,null,null,3,"Gorfang","Moss/Liquid","31 sp","Nerve poison. Take immediate effect. RR failure by 1-50 results in random extremity being useless (-25 penalty) for 1 day per 10 failure. RR failure by 51+ results in dissolving of nerves. Victim is a vegetable until nerves are regenerated.",null,"—",null,"Severe","Instant","Sheer Folly"]
[null,null,null,null,null,null,null,null,null,null,null,null,null,5,"Grelnixar","Leaves/Apply","50 sp","Magical poison. Confer \"running death\". If RR fails victim goes mad in 3 rounds, often with the result that he starts to run until exhaustion points are up. Whenever exhaustion points return, the running will continue. If not stopped, victim could actually run/starve himself to death. If RR succeed the poison has no effect at all.",null,"—",215,"N/A","3 rnds","Absurd"]
[null,null,null,null,null,null,null,null,null,null,null,null,null,3,"Greneldar","Flower/Apply","66 sp","Reduction poison. Touch causes rash and pains to the exposed skin and confer a -5 penalty per 10 failure (maximum -30) for 1-5 days. If Greneldar is instead ingested victim will \"burn inside\": a -50 penalty for 1-10 days, or on a RR failure of 26+ death due to organ damage.",null,"—",null,"N/A","3 rnds / varies","Hard"]
[null,null,null,null,null,null,null,null,null,null,null,null,null,3,"Gurth-nu-fuin","Virus/Anaerobic","41 sp","Disease. Causes severe nausea. Victim is at -75 for 1-100 hours. RR failure by 26+ causes death within 2-20 days, unless a second RR is successful.",null,"—",216,"Severe","6 rnds","Extremely hard"]
[null,null,null,null,null,null,null,null,null,null,null,null,null,2,"Gwin-win-Rynd","Bat/Liquid","54 sp","Reduction poison. RR failure by 1-25 results in total (and permanent) paralysis of the entire body. RR failure by 26+ confers death.",null,"—",null,"Moderate","6 rnds","Sheer Folly"]
[null,null,null,null,null,null,null,null,null,null,null,null,null,6,"Heen","Seeds/Ingest","18 sp","Circulatory poison. Instantly causes 5-50 hit points followed in 6 rounds by severe ulceration. Victim is at -10 per 10 failure (up to a maximum of -50) for 24 hours.",null,"—",null,"Mild","Instant/    24 hours","Sheer Folly"]
[null,null,null,null,null,null,null,null,null,null,null,null,null,6,"Henuial","Liquid/Inject","52 sp","Conversion poison. Yellow venom injected in blood stream. Victim starts to bleed from the eyes. If RR fails by 1-25 one eye is injured. RR failure by 26+ indicate both eyes damaged and foe permanently blind.",null,"—",909,"Mild","20 rnds/ permanent","Sheer Folly"]
[null,null,null,null,null,null,null,null,null,null,null,null,null,4,"Hith-i-girith","Leaf/Liquid","33 sp","Vapor from a live tree causes immediate and continuing sleep. Target cannot be awakened (except through magic or antidotes) and the sleep is permanent. Hard to find and extremely rare since the Hith-i-girith will only sustain for 12 hours after being harvested.",null,"—",930,"—","Instant/ permanent","Hard"]
[null,null,null,null,null,null,null,null,null,null,null,null,null,5,"Hulmiikak","Ants/Paste","28 sp","Muscle poison. Made from desert ants. RR failure by 26+ causes victims eyesight to be grumbled and all actions to be at -25 for 1 day per 1 failure. If RR failure is 51+ the effect is permanent.",null,"—",219,"Moderate","3-6 rnds/ varies","Extremely hard"]
[null,null,null,null,null,null,null,null,null,null,null,null,null,8,"Igturfas","Snakes/Liquid","80 sp","Muscle poison. Causes convulsions and muscle spasms. RR failure by 26+ puts victim at -50 to all actions for 1 hour per 1 failure (up to a maximum of 50 hours). RR failure by 51+ equals death in 6 hours due to shock and heart failure.",null,"—",220,"Mild","3-6 rnds/ up to 100 hrs","Absurd"]
[null,null,null,null,null,null,null,null,null,null,null,null,null,3,"Jadaras","Grass/Brew","15 sp","A disease confered via the Jadar Grass. A victim who fails RR has his AG-stat lowered by 30. The stat does not begin to rise until a second RR is made. Victim is entitled to one RR each week. The disease have a 24 hour incubation period. Any stat loss below zero kills victim.",null,"—",221,"Moderate","24 hours/ varies","Medium"]
[null,null,null,null,null,null,null,null,null,null,null,null,null,7,"Jegga","Bats/Paste","32 sp","Respiratory poison. Gives off a notable smell. Causes 1-100 hit points immediately when entering blood system.",null,"—",931,"Moderate","Instant","Hard"]
[null,null,null,null,null,null,null,null,null,null,null,null,null,6,"Jeggarukh","Bats/Powder","26 sp","Circulatory poison. Causes 10-100 hit points. Take 3-6 rnds to take effect.",null,"—",902,"Mild","3-6 rnds","Hard"]
[null,null,null,null,null,null,null,null,null,null,null,null,null,5,"Jitsu","Clams/Ingest","25 sp","Respiratory poison. Causes internal bleeding (at throat and mouth). Victim is instantly at -10, starts to caugh blood and after 5-10 rounds begin to take 2-5 hit points per round for 1 minute per 5 failure. RR failure of 51+ causes death in 2-20 minutes due to local hypoxia and/or blood loss.",null,"—",932,"Mild","varies","Medium"]
[null,null,null,null,null,null,null,null,null,null,null,null,null,2,"Jitsutyr","Clams/Paste","84 sp","Respiratory poison. Tan paste, destroys lungs. Victim bleed from mouth and is instantly nearly incapacitated (-75). If RR failure is 21+ victim will die in 10-100 rounds (+CO-bonus).",null,"—",933,"Moderate","Instant","Very Hard"]
[null,null,null,null,null,null,null,null,null,null,null,null,null,2,"Juth","Scorpion/Liquid","19 sp","Nerve poison. Causes gradual insanity over 1 week (see Hands of the Healer, p.112). Victim take 2-20 hits at the first round of poisoning.",null,"—",933,"Mild","Varies","Hard"]
[null,null,null,null,null,null,null,null,null,null,null,null,null,1,"Kaktu","Flower/Liquid","8 sp","Muscle poison. Victim suffers muscle spasms. RR failure by 1-15 confers a -20 penalty and increased fumble range for all moving maneuvers by +3. RR failure by 16-30 confers a -30 penalty and increases fumble range by +5. RR failure by 31-50 confers a -50 penalty and increases fumble range by +10. RR failure by 51+ nearly incapacitate foe (-75). All results last for 2-20 hours. ",null,"—",914,"N/A","20 rnds/   2-20 hrs","Extremely hard"]
[null,null,null,null,null,null,null,null,null,null,null,null,null,8,"Kalmogs Spoor","Leaves/Paste","10 sp","Nerve poison. Instantly causes 2-20 hit points. After the 24 hour incubation period victim is at -10 per 10 failure for 6-10 days. Maximum penalty is -50.",null,"—",null,"Mild","Instant/   24 hrs/         6-10 days","Hard"]
[null,null,null,null,null,null,null,null,null,null,null,null,null,7,"Karfar","Leaf/Paste","23 sp","Circulatory poison. Redish paste causes heart to shut down. On a result of extreme failure death will occur in 2-12 rounds. Othervise the effects follow the 11.2.3 Effect descriptions table in RM FRP Gamemaster Law.",null,"—",903,"Extreme","2-12 rnds","Extremely hard"]
[null,null,null,null,null,null,null,null,null,null,null,null,null,10,"Klabas","Buds/Ingest","40 sp","Nerve poison. Over a period of 1-10 hours victim increasingly suffers the effects from 11.2.3 Poison Effect descriptions table. When the initial incubation period has passed, if the RR failure was 21+, victim will be incapacitated and uncapable to perform any actions (-100) until cured.",null,"—",224,"Severe","1-10 hours","Medium"]
[null,null,null,null,null,null,null,null,null,null,null,null,null,3,"Kly","Berry/Paste","27 sp","Respiratory poison. Has effects according to the 11.2.3 Effect Descriptions Table. In addition the victim take 1-100 hit points on a failure between 1-25, 2-200 hit points on a failure by 26-50 and 3-300 hit points on a failure of 51+. These hits are distributed over a course of 6 rounds.",null,"—",934,"Extreme","varies","Hard"]
[null,null,null,null,null,null,null,null,null,null,null,null,null,5,"Klytun","Root/Paste","25 sp","Circulatory poison. A golden paste that initially stuns victim (without parry) for 1 rnd per 10 failure. Thereafter, showing gradually over 1-10 hours, the poisoning causes catatonia for 1 day/10 failure. Over 1-10 hours victim first become sluggish and slow, thereafter unresponsive and finally fully catatonic.",null,"—",904,"Mild","1-10 hours","Medium"]
[null,null,null,null,null,null,null,null,null,null,null,null,null,5,"Kuwurn Yorf","Mold/Ingest","25 sp","Respiratory poison. Slowly destroys lungs. Victim suffers incapacitation and painful death in 2-3 days on a a moderate RR failure (26+).",null,"—",225,"Medium","1-10 hours","Medium"]
[null,null,null,null,null,null,null,null,null,null,null,null,null,1,"Lawrim","Lichen/Paste","3 sp","Muscle poison. Causes rashes and pains, followed by muscle spasms. Victim take 3 hits per round, beginning 6 rounds after poisoning and lasting for 1 round per 1 failure. 12 rounds after poisoning, muscle spasms causes a -20 penalty.",null,"—",null,"N/A","6 rnds/ varies","Medium"]
[null,null,null,null,null,null,null,null,null,null,null,null,null,10,"Lhugruth","Dragon/Liquid","70 sp","Conversion poison. Dragon blood, dissolves afflicted area in 1-10 rounds. Affects metals & organic substances. If thrown, use the Acid Ball attack table with x2 concussion damage. If swallowed, death in 1-10 rounds. A successful RR means survival, but victim is incapacitated with severe internal organ damage.",null,"—",923,"Extreme","1-10 rnds","Very Hard"]
[null,null,null,null,null,null,null,null,null,null,null,null,null,1,"Lothfelag","Resin/Ingest","8 sp","Nerve poison. RR failure by 1-50 equals quick sleep for 1-10 hours. RR failure by 51+ equals coma for 1 month per 10 failure.",null,"—",null,"Moderate","20 rnds","Extremely hard"]
[null,null,null,null,null,null,null,null,null,null,null,null,null,6,"Lus","Flower/Paste","24 sp","Conversion poison. Victims that fail RR by 1-10 is temporary blinded for 1-4 hours. RR failure by 11-20 equals permanent blindness, failure by 21-50 equals coma and blindness and a RR failure by 51+ means coma, blindness and later death (21-30 hrs).",null,"—",null,"Moderate","20 rnds","Light"]
[null,null,null,null,null,null,null,null,null,null,null,null,null,4,"Madwort","Leaves/Paste","30 sp","Circulatory poison. RR failure by 01-25 induces madness for 11-20 rounds (irrational behaviour, mad screaming, suicidal tendencies etc). Victims failing their RR by 26-50 suffer 21-30 rounds of sensory disturbance during which the victim is at -50 (if in combat might attack allies due to confusion). RR failure by 51+ causes permanent brain damage and loss of 11-20 points from RE-stat.",null,"—",null,"Mild","3 rounds","Medium"]
[null,null,null,null,null,null,null,null,null,null,null,null,null,5,"Moourark","Venom/Paste","44 sp","Conversion poison. Powerful bat venom that slowly dissolves victims bones. Process starts in 20 rnds and causes incredible pain (-10 per 5 RR failure). Victim is immobilized (-100) in pain after 11-20 minutes. On an RR failure of 51+ victim will die within 11-20 days of intense pain and inactivity.",null,"—",229,"N/A","20 rnds","Absurd"]
[null,null,null,null,null,null,null,null,null,null,null,null,null,15,"Morgurth","Blood/Ingest","900 sp","Conversion poison. Extremely rare. One of Middle Earths most powerful poisons, causes the brain to dissolve. Even if victim pass his RR he will fall into a coma for 1-100 years.",null,"—",230,"Extreme","Instant/    1-100 years","Absurd"]
[null,null,null,null,null,null,null,null,null,null,null,null,null,2,"Muilfana","Sap/Liquid","17 sp","Reduction poison. Contact with saliva turns to acid. Destroys esophagus. Victim spits a lot of blood. RR failure by 01-25 results in loss of speech and causes internal bleeding at a rate of 1 hit per round for 11-20 rounds. Failure by 26+ causes internal bleeding at a rate of 1 hit point per 5 failure (and loss of speech).",null,"—",911,"Moderate","3 rnds/   11-20 rnds","Medium"]
[null,null,null,null,null,null,null,null,null,null,null,null,null,3,"Murnan","Sap/Apply","21 sp","Conversion poison. RR failure by 01-25 equals head ache and heavy fever (-25) for 1 day per 10 failure.","Can be used in several forms, including ingestion and injection into blood stream.","—",231,"Moderate","1-10 mins/ Varies","Extremely hard"]
[null,null,null,null,null,null,null,null,null,null,null,null,null,2,"Nen Calgalen","Root/Paste","16 sp","Circulatory poison. Victim gets convulsions. RR failure by 01-15 equals -50 for 10-100 rounds, RR failure by 16-30 equals 100 hits taken over 1-10 rounds and RR failure by 31+ lowers CO, EQ, RE, IN and PR by 1-100 points (temp). The results are cumulative.",null,"—",null,"Mild","10 rnds/  varies","Extremely hard"]
[null,null,null,null,null,null,null,null,null,null,null,null,null,3,"Nimnaur","Spider/Liquid","18 sp","Conversion poison. Destroys one kidney in 1-10 minutes if victim fails RR by 51+. A destroyed kidney leave victim at half pace, i.e halved movement, -50 to all physical actions.",null,"—",925,"Severe","1-10 mins/  varies","Hard"]
[null,null,null,null,null,null,null,null,null,null,null,null,null,3,"Ondohithui","Lichen/Paste","25 sp","Reduction poison. Blue-grey paste causes fatal dehydration in 11-20 minutes on a RR failure on 51+. Foe is at -10 per minute that pass from time of injection. Othervise see the regular effects for reduction poisons.",null,"—",924,"Severe","11-20 mins","Hard"]
[null,null,null,null,null,null,null,null,null,null,null,null,null,2,"Ondokamba","Bat/Liquid","60 sp","Conversion poison. Magical green venom that acts within 2-20 rounds. Severe effects (51+) turns 1-4 appendages (hands and feet) into heavy grey \"stone\". Appendages affected are useless; -25 for each. Victim suffers physcially and will, if not cured, lose the affected appendages within a week.",null,"—",910,"Severe","2-20 rnds/ permanent (until amputation or death).","Light"]
[null,null,null,null,null,null,null,null,null,null,null,null,null,5,"Orn","Sap/Apply","15 sp","Reduction poison. Gives 1-10 hits immediately and warts and scars within 24 hours. The scars are permanent, warts will dissappear over 3-10 days.",null,"—",232,"Mild","Instant/ varies","Very Hard"]
[null,null,null,null,null,null,null,null,null,null,null,null,null,"V","Pangwood","Tree/Contact","N/A","Complex description, see Hands of the Healer, p.127",null,"—","p.127","N/A","Varies","Medium"]
[null,null,null,null,null,null,null,null,null,null,null,null,null,1,"Pawlun","Sap/Ingest","3 sp","Reduction poison. Victim suffers loss of teeth.     50-100% of teeth fall out within 1 week.",null,"—",235,"Mild","24 hours","Medium"]
[null,null,null,null,null,null,null,null,null,null,null,null,null,5,"Rorkandiis","Saliva/Paste","25 sp","Reduction poison. Magical poison made from Great Hawk saliva. Dissolves cartilage in affected area. Take 2-20 minutes for full effect but pain increases gradually. RR Failure by 1-10 puts victim at -10, RR failure by 11-20 equals -20, RR failure by 21-30 equals -30, RR failure by 31-50 puts victim at -50 and RR failure by 51+ renders body part useless.",null,"—",240,"N/A","2-20 mins/ permanent","Medium"]
[null,null,null,null,null,null,null,null,null,null,null,null,null,4,"Ruth-i-Iaur","Drakes/Liquid","35 sp","Reduction poison. Cave drake saliva. Victim suffers a -10 penalty per 5 RR failure. RR failure by 51+ equals unconsciousness. The effect lasts for 2-20 minutes.","Also come in paste form to coat edged weapons, but usually priced at 20% higher cost.","—",920,"Medium","Instant/    2-20 mins","Extremely hard"]
[null,null,null,null,null,null,null,null,null,null,null,null,null,6,"Ruthin","Crystal/Liquid","48 sp","Conversion poison. On a failure of 51+ stomach contents turn to jagged glass, killing victim in 1-10 inactive and extremely painful rounds. ",null,"—",null,"Extreme","1-10 rnds","Extremely hard"]
[null,null,null,null,null,null,null,null,null,null,null,null,null,10,"Sarnumen","Eel/Liquid","65 sp","Muscle poison. Victim who fails RR suffers a -50 penalty for 1-10 minutes.","Also come in paste form to coat edged weapons, but usually priced at 20% higher cost.","—",241,"Mild","Instant/    1-10 mins","Extremely hard"]
[null,null,null,null,null,null,null,null,null,null,null,null,null,1,"Seregmor","Flower/Paste","61 sp","Conversion poison. Converts blood to Kalirion. Blood sucking insects will be drawn towards victim. All stats drop by 50 pts, but will rise at rate of 1 pt/day (unless victim is dead).",null,"—",null,"Mild","1-6 rnds","Very Hard"]
[null,null,null,null,null,null,null,null,null,null,null,null,null,3,"Sharduvaak","Berry/Liquid","18 sp","Circulatory poison. Brown liquid that slows blood flow. Victim is at -10 per 10 failure and needs double the normal sleep to function at all.",null,"—",906,"N/A","2-20 rnds/ 2-20 days","Hard"]
[null,null,null,null,null,null,null,null,null,null,null,null,null,10,"Sharkasar","Root/Paste","15 sp","Circulatory poison. Causes 3-30 hit points.",null,"—",905,"Mild","3 rnds","Very Hard"]
[null,null,null,null,null,null,null,null,null,null,null,null,null,10,"Shirilos","Seeds/Brew","90 sp","Truth serum/nerve poison. Victim who fails RR by 21+ is at -100 and suggestable for 1-100 rounds. Victim will spill anything asked about and is nearly physically incapacitated for the duration.",null,"—",242,"Mild","3 rnds/       1-100 rnds","Sheer Folly"]
[null,null,null,null,null,null,null,null,null,null,null,null,null,3,"Shutinis","Hultif Bug/Paste","27 sp","Disease. Victim who fails RR by 01-25 gets sick and is at -75 for 2-20 hours. RR failure by 26+ causes gradual mental insanity over 1-10 days in addition to the sickness.",null,"—",243,"Severe","1 hour/      Varies","Sheer Folly"]
[null,null,null,null,null,null,null,null,null,null,null,null,null,9,"Silmaana","Stalk/Powder","39 sp","Reduction poison. Also called Silmírë. Causes 5-50 hit points. ","Also come in paste form to coat edged weapons, but usually priced at 20% higher cost.","—",926,"Mild","Instant","Easy"]
[null,null,null,null,null,null,null,null,null,null,null,null,null,2,"Slird","Fruit/Paste","31 sp","Nerve poison. Acts in 1-2 rounds. Victim has 50% chance (minus SD-bonus) of \"blacking out\" each round. Poison is active for 6-10 rounds. During a black out victim is prone.",null,"—",921,"Severe","1-2 rnds/   6-10 rnds","Sheer Folly"]
[null,null,null,null,null,null,null,null,null,null,null,null,null,5,"Slota","Spider/Paste","33 sp","Reduction poison. Take 2-20 rounds to take effect and causes partial upper body paralysis for 6-10 minutes. Victim is at -50 for the duration. On a moderate RR failure (26+) the paralysis continues and slowly increases during a 24 hour period. RR failures of 51+ eventually results in death due to lung failure.",null,"—",927,"Severe","2-20 rnds/ Varies","Extremely hard"]
[null,null,null,null,null,null,null,null,null,null,null,null,null,1,"Spider Venom","Venom/Paste","7 sp","Nerve poison. Causes partial upper body paralysis for 6-10 rounds (take 2-20 rounds to take effect). Victim is at -50 for the duration.",null,"—",244,"Medium","2-20 rnds/ 6-10 rnds","Very Hard"]
[null,null,null,null,null,null,null,null,null,null,null,null,null,5,"Surlok","Fish Spines/Inject","23 sp","Rare disease. Victims fingers and toe's start to rot, causing -1 to all actions per day that passes from the poisoning. Penalty will go no higher than -75 at which point all toe's and fingers have fully rotted away. Hands and feet are then totally useless of course.",null,"—",245,"Moderate","1-10 days/ Varies","Medium"]
[null,null,null,null,null,null,null,null,null,null,null,null,null,5,"Thrang","Panther glands/Paste","15 bp","Nerve poison. RR failure results in loss of colour vision.",null,"—",247,"Mild","2-20 rnds","Medium"]
[null,null,null,null,null,null,null,null,null,null,null,null,null,6,"Thrayniis","Liquid/Ingest","16 sp","Nerve poison. Fleas blood. Causes total paralysis after 3-30 minutes. Victim will be paralysed for 10 minutes per 10 RR failure.",null,"—",248,"Medium","3-30 mins/ Varies","Medium"]
[null,null,null,null,null,null,null,null,null,null,null,null,null,20,"Thurviik","Gas/Gas","60 sp","Nerve poison. Alchemic mixture, powerful sleeping agent. Victim that fails RR by 101+ will go into coma. Others into unwakeable sleep for 3 hours. The price is for enough gas to cover a 10x10x10' room with full effect.",null,"—",249,"Mild","1-2 rnds/   3 hours","Sheer Folly"]
[null,null,null,null,null,null,null,null,null,null,null,null,null,4,"Trusa","Frog/Paste","36 sp","Muscle poison. RR failure by 01-15 causes blindness in one eye, RR failure by 16-30 causes blindness in both eyes, RR failure by 31-50 causes coma and RR failure by 51+ causes coma and eventually death in 6-10 hours.",null,"—",915,"Extreme","1-10 rnds","Sheer Folly"]
[null,null,null,null,null,null,null,null,null,null,null,null,null,20,"Ul-acaana","Flower/Paste","450 sp","Nerve poison. Total paralyses instantly as nervous system is destroyed. Victims failing RR by 01-25 is permanently paralysed. RR failure by 26-50 sends victim into coma and RR failure by 51+ first paralyses, then kills victim within 1-10 minutes.",null,"—",922,"Extreme","Instant/     Varies","Absurd"]
[null,null,null,null,null,null,null,null,null,null,null,null,null,6,"Uraana","Leaf/Paste","19 sp","Respiratory poison. Causes irritation in throat and lungs. Eventually lung damage. Victim take 3-30 hit points, all movement is halved and foe fights at -10 for the duration.",null,"—",935,"Moderate","6 rnds/     24 hrs","Light"]
[null,null,null,null,null,null,null,null,null,null,null,null,null,3,"Water Hemlock","Plant/Liquid","24 sp","Conversion poison. RR failure by 01-25 incapacitate victim for 1-10 hours. RR failure by 26+ confers quick death due to blood poisoning.",null,"—",253,"Extreme","6-10 rnds/ varies","Extremely hard"]
[null,null,null,null,null,null,null,null,null,null,null,null,null,5,"Vaxvarna","Snake/Apply","35 sp","Circulatory poison. The area touched will quickly get a blueish tint. Initially the poison stuns victim for 1 round/10 failure. Thereafter (within 2-20 rounds) it causes weakness, nausea and loss of    5-50 hit points. In 5-50 rounds the touched part will become useless.",null,"—",251,"Severe","Instant/   varies","Sheer Folly"]
[null,null,null,null,null,null,null,null,null,null,null,null,null,5,"Wek-baas","Fish/Liquid","55 sp","Nerve poison. Take 10 rounds plus victims CO-stat bonus to take effect. RR failure by 1-15 causes  unconscious for 1 hour/10 failure. An RR failure by 16-30 does the same, but also adds -75 to victim for 6-10 days (after waking from unconsciousness). RR failure by 31+ equals death within 1-10 hours of unconsciousness.",null,"—",923,"Extreme","10 + CO-statbonus rounds","Absurd"]
[null,null,null,null,null,null,null,null,null,null,null,null,null,1,"Vemaak","Hornets/Paste","5 sp","Reduction poison. Destroy foe's hearing. Foe is stunned for 1 round per 5 failure. -50 to perception rolls based partly on hearing.",null,"—",null,"Mild","6 rnds","Medium"]
[null,null,null,null,null,null,null,null,null,null,null,null,null,7,"Wolfstooth","Root/Paste","46 sp","Muscle poison. RR failure by 1-25 causes muscle spasms (-50 for 11-20 rounds). RR failure by 26-50 lowers CO-stat by 11-20 points in addition to the above result. RR failure by 51+ causes death in    11-20 rounds due to heart failure.",null,"—",null,"Severe","2-20 rnds/ 11-20 rnds","Extremely hard"]
[null,null,null,null,null,null,null,null,null,null,null,null,null,2,"Worlclivur","Lichen/Paste","18 sp","Muscle poison. RR failure by 01-25 results in tormenting pain, -50 for 1 minute per 10 failure. RR failure by 26-50 equals -50 for 1 hour per 10 failure, RR failure by 51-75 results in -75 for 1 hour per 10 failure, RR failure by 76-100 results in immobilization (-100) for 1 day per 10 failure and RR failure by 101+ equals death by heart attack.",null,"—",null,"Severe","20 rnds","Sheer Folly"]
[null,null,null,null,null,null,null,null,null,null,null,null,null,5,"Wt Berried Yew","Berry/Ingest","25 sp","Muscle poison. RR failure by 51+ equals death in   1-10 rounds. Othervise consult the Poison Descriptions table in Gamemaster Law, p. 94.",null,"—",null,"Extreme","1-10 rnds","Medium"]
[null,null,null,null,null,null,null,null,null,null,null,null,null,2,"Vuraana","Flower/Paste","15 sp","Respiratory poison. A smelly pinkish paste that causes 1-100 hit points one round after poisoning.",null,"—",936,"Mild","1 rnd","Medium"]
[null,null,null,null,null,null,null,null,null,null,null,null,null,10,"Yake Ferns","Sap/Ingest","50 sp","Conversion poison. Tongue rots off in 1-100 rounds.",null,"—",null,"Medium","1-100 rnds","Medium"]
[null,null,null,null,null,null,null,null,null,null,null,null,null,5,"Zaganzar","Root/Liquid","42 sp","Reduction poison. Instantly causes 1-10 hit points and on a severe failure (51+) turns optic nerves to water and blinds victim in 2-20 rounds.",null,"—",928,"Severe","Instant","Very Hard"]
[]
[]
[null,null,null,null,null,null,null,null,null,null,null,null,null,"Level","Herb","Form/Prep","Cost","Effect","Sideeffects/drawbacks","Risk","CL","Max effect","Time/ Duration","Finding"]
[null,null,null,null,null,null,null,null,null,null,null,null,null,null,"Life Preservation"]
[null,null,null,null,null,null,null,null,null,null,null,null,null,3,"Berterin","Moss/Brew","3 sp","Preservation of organic material up to body size for 1 day. This prevent the material (e.g the body) from deterioration but does not keep the soul in the body.",null,null,667,"—","Active for 24 hrs","Light"]
[null,null,null,null,null,null,null,null,null,null,null,null,null,13,"Carcatu","Grass/Apply","18 sp","Soulkeeping for 1 day. Must be administered within the span of soul departure.",null,null,646,1,"24 hrs","Extremely hard"]
[null,null,null,null,null,null,null,null,null,null,null,null,null,20,"Chebkuile","Moss/Ingest","180 sp","Lifekeeping for 6-10 days, unless heart is destroyed. Heart will continue to beat as victim enters a coma-like state. 75% chance of amnesia. Victim risks to forget a period of 1-12 months before he recieved the herb.",null,null,null,1,"6-10 days","Absurd"]
[null,null,null,null,null,null,null,null,null,null,null,null,null,10,"Degiik","Leaf/Ingest","150 sp","Stabilizes a victim with mortal wounds and keep him alive (heart beating), unless heart is detroyed, for 24 hours. All healing herbs have full effect while under the influence of a Degiik.",null,null,647,1,"1 day","Hard"]
[null,null,null,null,null,null,null,null,null,null,null,null,null,19,"Eddij","Berry/Juice","300 sp","Magical herb. Preserves life (i.e heart will continue to beat unless totally destroyed and target will enter a coma-like state) of a person threatened with imminent death. Duration varies with the level of the person that applies the herb, 1 day per level.",null,null,null,1,"Varies","Sheer Folly"]
[null,null,null,null,null,null,null,null,null,null,null,null,null,30,"Laurelin","Leaf/Ingest","1600 sp","Lifegiving for Elves within 28 days of death. The damage that caused death must have been restored before application. Revival takes 24 hours.",null,null,648,"—","24 hours","Absurd"]
[null,null,null,null,null,null,null,null,null,null,null,null,null,24,"Lothfelag","Flower/Ingest","777 sp","A rare flower sought after for its lifegiving and lifekeeping effect on dwarves. It has the power to revive (Lifegiving) any dwarf that has not been dead for more that 7 weeks (provided that his injuries were healed and the body preserved). It will also serve as a 7 week lifekeeper. On a non-dwarf the Lothfelag immediately heals all hits and stun effects.",null,null,null,"—","Immediate","Extremely hard"]
[null,null,null,null,null,null,null,null,null,null,null,null,null,26,"Mur","Resin/Apply","550 sp","Lifekeeping for 2-20 days. Must be applied when fresh and will keep its potency only for a few hours.","For every hour beyond the fourth, there is a -10 penalty to Herb Lore roll.",null,null,1,"2-20 days","Sheer Folly"]
[null,null,null,null,null,null,null,null,null,null,null,null,null,30,"Nur-Oiolosse","Clove/Ingest","1000 sp","Lifegiving if taken within one day. All mortal wounds must have been healed before herb is ingested, othervise target will die as soon as he is revived. Kills then one day later unless Sorul nut is ingested.",null,null,649,1,"20 rnds/  24 hours","Sheer Folly"]
[null,null,null,null,null,null,null,null,null,null,null,null,null,30,"Oiolosse","Clove/Ingest","1200 sp","Lifegiving for Elves if given within 7 days of death. Take 20 rounds to revive a dead elf.","The revived elf will be drowsy (-30) and slow for 10-100 days after revival.",null,650,1,"20 rnds/   7 days","Sheer Folly"]
[null,null,null,null,null,null,null,null,null,null,null,null,null,13,"Olvar","Flower/Ingest","56 sp","Soulkeeping for 2-10 days. Prevents the soul from leaving a dead body.",null,null,651,1,"2-10 days","Very Hard"]
[null,null,null,null,null,null,null,null,null,null,null,null,null,15,"Pargen","Berries/ingest","15 sp","Stops deterioration of organic material (bodies) for 4 days. During this period all magical healing and herbs will have full effect (i.e don't roll for effect, chose maximum).",null,null,670,1,"Instant/     4 days","Sheer Folly"]
[null,null,null,null,null,null,null,null,null,null,null,null,null,8,"Pathur","Nodule/Brew","6 sp","Soulkeeping for 1 hour. Must be administered before the soul has departed the body, i.e within the number of rounds equal to the victims soul departure. The soul stays in the \"dead\" body for 1 hour. If the body is healed of its mortal wound within that hour the person survives.",null,null,652,1,"Instant/     1 hour","Medium"]
[null,null,null,null,null,null,null,null,null,null,null,null,null,10,"Siriena","Grass/Brew","23 sp","Preservation of organic material up to body size for 1 week.",null,null,672,"—","1 week","Hard"]
[null,null,null,null,null,null,null,null,null,null,null,null,null,30,"Tyr-fira","Leaf/Apply","1100 sp","Lifegiving if given within 56 days.",null,null,653,1,"56 days","Absurd"]
[null,null,null,null,null,null,null,null,null,null,null,null,null,30,"Vulcurax","Berry/Apply","1500 sp","Lifegiving if given within 30 days. This mythical berry grows only in the forests of Taur Galen in southern middle earth. They do not work on elves. All damages must be healed by other means before the berry is applied.",null,null,654,1,"Recovery time is 1 day per day dead","Absurd"]
[]
[]
[null,null,null,null,null,null,null,null,null,null,null,null,null,"Level","Herb","Form/Prep","Cost","Effect","Sideeffects/drawbacks","Risk","CL","Max effect","Time/ Duration","Finding"]
[null,null,null,null,null,null,null,null,null,null,null,null,null,null,"Pain Reduction"]
[null,null,null,null,null,null,null,null,null,null,null,null,null,1,"Camomile","Flower/Brew","1 sp","x3 healing rate when recovering from penalties. Patient is likely (85% chance) to fall asleep for 2-6 hours. Usage = 3 doses per day for full effect. If AF roll is under 26, patient will get sick and be at -15 for 1-4 days.",null,25,null,"—","Active for 24 hrs","Medium"]
[null,null,null,null,null,null,null,null,null,null,null,null,null,14,"Corfura","Root/Brew","60 sp","Powerful anaesthetic. The Corfura halves any penalties by effectively reducing the body's sensivity to pain. The effect is instant and last for 3 hours. Using more than 1 dose per 8 hour period is dangerous and user must make an RR. RR failure by 1-25 causes drowsiness (-25) for 3 hours while RR failures above 26 causes 3 hours of unconsciousness. AF failure causes the user to become sluggish and slow, operating at -10 (subtracted from all actions, but the herb still halves any penalties from wounds).",null,10,"—",1,"Instant/      3 hours","Extremely hard"]
[null,null,null,null,null,null,null,null,null,null,null,null,null,4,"Margath","Leaf/Paste","8 sp","Astringent lotion. When placed on a wound it lowers the penalties from that wound by 10. Only one dose can affect each wound. Margath also prevent infections. AF failure causes the herb to only have effect for 1-10 minutes, thereafter the pain (and penalties) return.",null,20,123,"—","3 rnds","Easy"]
[null,null,null,null,null,null,null,null,null,null,null,null,null,10,"Tarfeg","Flower/Ingest","38 sp","Reduces pain. Lower penalties by 10. Tarfeg also repairs a sprain if victim rests for 8 hours. Using more than 3 doses in an 8 hour period simply does nothing good.",null,3,661,3,"20 rnds/   8 hours","Extremely hard"]
[null,null,null,null,null,null,null,null,null,null,null,null,null,1,"Teldalion","Bark/Apply","3 bp","Cures infections and reduces inflammations. If used continously during healing period it reduce the risk of permanent injuries.",null,0,133,"—","24 hours","Light"]
[null,null,null,null,null,null,null,null,null,null,null,null,null,5,"Witch-Hazel","Flower/Brew","25 sp","Anesthetic. Reduce pain from small cuts and relieves muscle aches. Heals 1 hit point per minute (up to a maximum of 15 hit points) and lowers pains by 10. ",null,0,null,"—","6 rnds","Light"]
[null,null,null,null,null,null,null,null,null,null,null,null,null,10,"Ylvort","Flower/Brew","50 sp","Taken before user enters combat, the Ylvort lowers all penalties taken by 10 for the duration. All penalties return when duration ends. ","If drawback occurs, user become sluggish and unbalanced, fighting at -10 until the herb wears off. The positive effects still apply.",5,null,"—","30 min","Sheer Folly"]
[]
[]
[null,null,null,null,null,null,null,null,null,null,null,null,null,"Level","Herb","Form/Prep","Cost","Effect","Sideeffects/drawbacks","Risk","CL","Max effect","Duration","Finding"]
[null,null,null,null,null,null,null,null,null,null,null,null,null,null,"Stun Relief"]
[null,null,null,null,null,null,null,null,null,null,null,null,null,16,"Bergamot","Flower/Brew","25 sp","User ignores all stun from critical injuries, no matter how grave, during the duration. Stun no parry results are converted to merely stun.","If drawback occurs, user will suffer insomnia during the night after he used Bergamot. The lack of sleep puts user at a -20 penalty the day after.",null,null,"—","30 min","Very Hard"]
[null,null,null,null,null,null,null,null,null,null,null,null,null,10,"Gramursh","Moss/Powder","12 sp","Stun Relief. When mixed with water and drunk this herb allows imbiber to reduce all stun and stun no parry results from critical injuries by 1 round.",null,null,null,"—","1 hr","Medium"]
[null,null,null,null,null,null,null,null,null,null,null,null,null,11,"Januk-ty","Root/Brew","10 sp","Stun Relief. Removes 3 rounds of stun or stun no parry from one critical. Duration is 12 hours or until first critical that causes stun.",null,null,696,"—","12 hrs","Very Hard"]
[null,null,null,null,null,null,null,null,null,null,null,null,null,2,"Laurus","Tobacco/Insert","3 sp","Putting Laurus under the lip provide +25 bonus to Stunned Maneuver.",null,null,null,"—","1 hr","Medium"]
[null,null,null,null,null,null,null,null,null,null,null,null,null,1,"Suranie","Berry/Ingest","2 sp","Stun Relief. Removes 1 round of stun or stun no parry from one critical. Duration is 1 hour or until first critical that causes stun.",null,null,697,"—","1 hr","Light"]
[null,null,null,null,null,null,null,null,null,null,null,null,null,11,"Welwal","Leaf/Ingest","6 sp","Leaf put on the tongue acts as stun relief. Removes 3 rounds of stun or stun no parry from one critical. Duration is 1 hour or until first critical that causes stun.",null,null,699,"—","1 hr","Extremely hard"]
[null,null,null,null,null,null,null,null,null,null,null,null,null,6,"Vinuk","Root/Brew","14 sp","Stun Relief. Removes 1-10 rounds of stun or stun no parry from one critical. Duration is 1 hour or until first critical that causes stun.",null,null,698,"—","1 hr","Medium"]
[null,null,null,null,null,null,null,null,null,null,null,null,null,8,"Witav","Leaf/Ingest","5 sp","Stun relief. Allows ingester to ignore 2 rounds of stun or stun no parry from the first critical taken within 12 hours.",null,null,700,"—","12 hrs","Very Hard"]
[]
[]
[null,null,null,null,null,null,null,null,null,null,null,null,null,"Level","Herb","Form/Prep","Cost","Effect","Sideeffects/drawbacks","Risk","CL","Max effect","Duration","Finding"]
[null,null,null,null,null,null,null,null,null,null,null,null,null,null,"Combat Enhancement"]
[null,null,null,null,null,null,null,null,null,null,null,null,null,10,"Dragul","Root/Brew","28 sp","Brew provide +10 to Combat maneuvers (including OB), Perceptions & Athletics for 1 hour.","If drawback occurs, user will be at -30 after the initial positive effects. Drawback fades over the course of 2-20 hours.",15,null,"—","1 hr","Very Hard"]
[null,null,null,null,null,null,null,null,null,null,null,null,null,12,"Elbens Basket","Root/Brew","7 sp","Heart stimulant. User may act at double speed (200% action) for one round. He may select this round freely within the span of 1 hour. Effect can only be used once per dose taken and no more than 3 doses can be taken simultaneously.","If drawback occurs, user will be at 50% activity after his round of double speed.",5,680,3,"1 hour","Extremely hard"]
[null,null,null,null,null,null,null,null,null,null,null,null,null,16,"Eledena","Bud/Ingest","42 sp","User is hasted (200% action) for 5 continous rounds. The \"hasted\" rounds must start within 5 minutes of taking the herb, othervise it is forfeit.","If drawback occurs, sideeffects of varying degree may take place: (1-50) user is speeded, but after the 5 rounds of double speed has passed, user will be at 50% for 5 rounds, (51-70) no effect at all, (71-90) no speed, but instant unconsciousness for 1-10 hours, (91-95) immediate heart failure results in organ damage; -50 for 6 days or (96-100) immediate death by heart attack.",5,null,"—","5 rnds","Extremely hard"]
[null,null,null,null,null,null,null,null,null,null,null,null,null,6,"Hesguratu","Bread/Ingest","20 sp","4 oz slice is one dose. Once eaten a person might increase his strength for one minute (6 rnds) within the next 24 hours. The strength gain provide +10 OB and double concussion hits delivered in melee combat.","If drawback occurs, user take an \"A\" Stress Critical simultaneously with the effect (only first round). Dwarves are immune to this drawback.",5,752,"—","6 rnds","Light"]
[null,null,null,null,null,null,null,null,null,null,null,null,null,16,"Kaskamak","Leaves/Ingest","13 sp","Chewing the leaves before combat ensures greater stamina and pain resistance. Add CON-bonus as a percentage to the characters hit total (equal to an Unpain spell, lasting for 1 hour) and ignore any exhaustion points spenditure during this hour.",null,null,223,1,"1 hour","Absurd"]
[null,null,null,null,null,null,null,null,null,null,null,null,null,8,"Kathkusa","Leaf/Ingest","16 sp","User gets +10 OB and deliver double concussion damage in melee for 1-10 rounds.","If drawback occurs, user take an \"A\" Stress Critical simultaneously with the effect (only first round). Dwarves are immune to this drawback.",15,684,"—","1-10 rnds","Light"]
[null,null,null,null,null,null,null,null,null,null,null,null,null,9,"Kirsemal","Bark/Brew","8 sp","Allows for Adrenal maneuvers to be prolonged for 3 consecutive rounds (must roll for skill each round). The effect of Kirsemal wears off after the adrenal move have been used, or 12 hours pass (i.e Adrenal Move must be performed within 12 hours of intake).","If drawback occurs, user will have the option to abandon his Adrenal Move or take an \"A\" Stress Critical for the first round, \"B\" for the second round and \"C\" for the third round.",null,117,"—","3 rounds","Medium"]
[null,null,null,null,null,null,null,null,null,null,null,null,null,10,"Kirtir","Buds/Inhale","5 sp","Powerful stimulant. Characters QU (stat bonus) is raised by +10 while AG is lowered by -5 for 1 hour. ","If drawback occurs, temp CO-value is reduced by 2-20 for 1-10 hours.",null,null,"—","1 hour","Hard"]
[null,null,null,null,null,null,null,null,null,null,null,null,null,"13N","Sailchas","Flower/Wear","N/A","Eriadorian flower. If worn it provide +10 to morale & all RR's and +5 to DB for 1D5+2 days if it has been given by someone who loves the wearer. If sold it has no effect, it has to be given with love for effect, thus it has no price.",null,null,"p.133",1,"3-7 days","Sheer Folly"]
[null,null,null,null,null,null,null,null,null,null,null,null,null,12,"Splayfoot","Seeds/Brew","80 sp","Aka Goodwort. For those \"good of heart\" instills confindence and strength. Provide +25 to all skills (not OB or DB) used for a single purpose. Bonus lasts for 1-4 hours.",null,null,690,1,"Instant/    1-4 hours","Medium"]
[null,null,null,null,null,null,null,null,null,null,null,null,null,10,"Swigmakril","Flower/Brew","45 bp","Relaxant. User can take 200% concussion hits before passing out (i.e he die) but acts at -10 for the duration.","If drawback occurs, penalty is either -20 (1-50) or -30 (51-100) instead. Also herb is slightly addictive, 10% chance.",10,808,"AF","1-2 hours","Very Hard"]
[null,null,null,null,null,null,null,null,null,null,null,null,null,"1N","Waters of Fire","Acid/Liquid","15 sp","Acid. Can be thrown at enemies. Attacks with a -20 penalty on the Fireball attack table (all criticals are Acid). Garments dissolve in 1-6 rounds.",null,null,null,"—","1-6 rnds","Hard"]
[null,null,null,null,null,null,null,null,null,null,null,null,null,11,"Zulsendura","Mushroom","30 sp","A rare mushroom that grows in vulcanic caves. It provides extreme quickness (equals Haste) for 3 rounds, ","If drawback occurs, user will lapse into deep sleep at the end of the 3 round effect. The sleep will last for 10 minutes per dose taken and it is impossible to rouse the user for the first 3-30 rounds.",10,692,"—","3 rounds","Medium"]

{"sheet":"Spells","index":5,"n_rows":19,"n_cols":15,"rows_kept":19,"cut":false,"hidden":false,"merged":[]}
[]
["Known Spell Lists",null,null,null,"Favourite Spells or entire spell lists",null,null,null,null,null,"Favourite Spells"]
["Lvl","Spell list","Book",null,"Lvl","Spell","Book","A","Duration",null,"Lvl","Spell list","Book","A","Duration"]
[20,"Weapon enchantments","Öberg",null,13,"Hammerstrike II, x2 damage","Öberg",null,{"$f":"CONCATENATE(Level*2,\" rnd\")","v":"2 rnd"},null,1,"Sly ears","RMCII","x",{"$f":"CONCATENATE(Level*10*2,\" min\")","v":"20 min"}]
[10,"Earth law","SpLaw",null,16,"Eldritch weapon II","Öberg",null,{"$f":"CONCATENATE(Level,\" rnd\")","v":"1 rnd"},null,2,"Nightvision","RMCII",null,{"$f":"CONCATENATE(Level*10*2,\" min\")","v":"20 min"}]
[10,"Sense enhanchement","RMCII",null,3,"Stoneskin I, AT12","RMCVII",null,{"$f":"CONCATENATE(Level*2,\" rnd\")","v":"2 rnd"},null,3,"Smelling","RMCII","x","20 min"]
[10,"Movement enhancement","RMCII",null,5,"Earthmight II, +20 ST","RMCVII",null,{"$f":"CONCATENATE(Level*2,\" rnd\")","v":"2 rnd"},null,4,"Sidevision","RMCII","x","20 min"]
[5,"Invisible ways","SpLaw",null,3,"Stun relief I*","SpLaw",null,null,null,5,"Tasting","RMCII",null,"20 min"]
[10,"Earth forms","RMCVII",null,9,"Stun relief III*","SpLaw",null,null,null,6,"Sharp eyes","RMCII","x","20 min"]
[20,"Body renewal","SpLaw",null,1,"Blur*","Ess.C",null,{"$f":"CONCATENATE(Level*2,\" min\")","v":"2 min"},null,7,"Fine touch","RMCII","x","20 min"]
[10,"Highriding","RMCII",null,7,"Mirror image I","Ess.C","x",{"$f":"CONCATENATE(Level*2,\" min\")","v":"2 min"},null,9,"Watervision","RMCII","x","20 min"]
[10,"Minds touch","RMCII",null,9,"Displacement III*, 30%","Ess.C","x",{"$f":"CONCATENATE(Level*2,\" min\")","v":"2 min"},null,10,"Darkvision","RMCII","x","20 min"]
[null,"Rapid ways","SpLaw",null,10,"Parry illusion*","Ess.C",null,{"$f":"CONCATENATE(Level*2,\" rnd\")","v":"2 rnd"},null,4,"Silent movement*","RMCII",null,{"$f":"CONCATENATE(Level*10*2,\" min\")","v":"20 min"}]
[null,"Unbarring ways","SpLaw",null,null,null,null,null,null,null,5,"Suggestion","RMCII"]
[20,"Familiar mastery","Ess.C",null,null,null,null,null,null,null,9,"Master of kind","RMCII",null,{"$f":"CONCATENATE(Level*10*2,\" min\")","v":"20 min"}]
[5,"Sustain body","Ess.C",null,null,null,null,null,null,null,4,"Leaving I","RMCII"]
[10,"Combat illusions","Ess.C",null,null,null,null,null,null,null,7,"Leaving II, 200'","RMCII"]
[null,null,null,null,null,null,null,null,null,null,10,"Long door I","RMCII"]
[null,null,null,null,null,null,null,null,null,null,2,"Shadow","Ess.C","x",{"$f":"CONCATENATE(Level*10*2,\" min\")","v":"20 min"}]

{"sheet":"Rasbonus","index":6,"n_rows":295,"n_cols":39,"rows_kept":295,"cut":false,"hidden":false,"merged":[]}
[null,"Dwarf","Noldo (Academic)","Noldo (Martial)","Sinda","Silvan","Half-elf","Hobbit","Northman","Eothraim","Lesser Dunadan","Common (rural)","Common (city-folk)","Corsair","Dorwinadan","Wose","Woodman","Beorning","Greater Dunadan","Dunlending","Black Numenorean","Easterling","Sagath/Logath","Gathmarim","Variag","Orc","Uruk-Hai","Half-orc","Half-troll","Forest Troll","Stone Troll","Hill Troll","Snow Troll","Mountain Troll","Cave Troll","Olog-Hai","Haruze","Umbarean","Mornedain"]
["Constitution",15,10,10,5,0,5,15,5,5,5,5,5,5,5,5,5,15,10,10,10,5,5,5,5,10,15,10,15,20,35,25,30,30,40,35,5,10,5]
["Agility",-5,15,15,10,10,5,15,0,0,0,0,0,0,0,0,5,0,0,0,0,5,0,0,0,0,0,0,0,0,-10,-10,-10,-10,-10,-5,5,0,5]
["Self Discipline",5,0,0,0,0,0,0,5,5,5,0,0,0,5,0,0,0,5,0,5,-5,0,-5,-5,-5,0,0,0,-5,-10,-10,-10,-10,-10,-5,0,0,-5]
["Reasoning",0,5,5,0,0,0,0,0,0,0,0,0,0,0,0,0,0,0,0,0,0,0,0,0,-5,0,0,-5,-10,-15,-15,-15,-15,-15,-5,0,0,0]
["Eloquence",0,0,0,0,0,0,0,0,0,0,0,0,0,0,0,0,0,0,0,0,0,0,0,0,0,0,0,0,0,-5,0,0,0,-5,0,0,0,0]
["Strength",10,0,0,0,0,5,-15,10,10,5,5,5,5,5,5,5,15,10,10,10,5,5,5,5,5,10,5,15,15,30,20,25,25,35,30,5,5,5]
["Quickness",-5,5,5,10,10,5,15,0,0,0,0,0,5,0,0,0,-5,0,0,0,5,5,10,5,0,0,0,-5,-5,-10,-10,-15,-15,-15,-10,5,5,5]
["Presence",-5,15,15,10,5,5,-5,0,0,5,0,0,0,0,-5,0,5,10,0,10,0,0,0,0,-10,0,-5,-5,-10,-10,-10,-10,-10,-10,-10,0,0,0]
["Intuition",0,5,5,5,5,0,-5,0,0,0,0,0,0,0,5,0,0,0,0,0,0,0,0,0,-10,0,-5,-5,-10,-10,-10,-10,-10,-10,-10,0,0,0]
["Empathy",-5,5,5,0,0,0,0,0,0,0,0,0,0,0,0,0,0,5,0,0,-5,0,-5,-5,-10,-5,-5,-5,-10,-10,-10,-10,-10,-10,-10,0,0,0]
["Appearance"]
["Hit D type","D10","D10","D10","D8","D8","D10","D8","D10","D10","D8","D8","D8","D8","D8","D8","D8","D10","D10","D10","D10","D8","D8","D8","D8","D8","D10","D8","D10","D10","D12","D12","D12","D12","D12","D12","D8","D8","D8"]
["Soul Departure",18,1,1,2,3,5,18,12,12,12,12,12,12,12,12,12,12,10,12,10,12,12,12,12,2,2,6,8,3,3,3,3,3,3,6,12,12,12]
["Rec. Mult",0.5,3,3,2,1.5,1.5,0.5,1,1,null,1,1,1,1,1,1,0.75,0.75,1,0.75,1,1,1,1,0.8,0.8,1,0.8,0.5,0.5,0.5,0.5,0.5,0.5,0.5,1,1,1]
["Max Hits",120,120,120,110,100,130,60,130,130,120,120,120,120,120,120,120,150,140,120,140,120,120,110,120,120,140,120,160,150,170,180,200,180,240,200,120,130,120]
["RR Fear",0,0,0,0,0,0,0,0,0,0,0,0,0,0,0,0,0,0,0,0,0,0,0,0,0,0,0,0,0,0,0,0,0,0,0,0,0,0]
["RR Disease",10,100,100,100,100,50,30,0,0,0,0,0,0,0,0,0,0,5,0,5,0,0,0,0,0,0,0,0,0,10,0,20,0,0,0,0,0,0]
["RR Poison",10,10,10,10,10,5,15,0,0,0,0,0,0,30,0,0,0,5,0,5,0,0,0,0,0,0,0,0,0,10,0,20,0,0,0,0,0,0]
["RR Essence",40,0,0,0,0,0,50,0,0,0,0,0,0,0,20,0,0,0,0,0,0,0,0,0,0,0,0,0,0,0,0,0,0,0,0,0,0,0]
["RR Channeling",0,0,0,0,0,0,20,0,0,0,0,0,0,0,10,0,0,0,0,0,0,0,0,0,0,0,0,0,0,0,0,0,0,0,0,0,0,0]
["RR Mentalism",40,0,0,0,0,0,40,0,0,0,0,0,0,0,0,0,0,0,0,0,0,0,0,0,0,0,0,0,0,0,0,0,0,0,0,0,0,0]
["B. opt",350,275,275,300,325,300,450,375,350,350,425,425,400,400,400,400,300,300,375,300,400,375,375,400,200,300,300,250,200,200,200,200,200,200,300,400,375,425]
["vs Cold",30,20,20,15,10,5,0,0,0,0,0,0,0,0,0,0,0,0,0,0,0,0,0,0,0,0,0,0,0,10,0,30,0,20,20,-10,0,-10]
["vs Heat",30,0,0,0,0,0,0,0,0,0,0,0,0,0,0,0,0,0,0,0,0,0,0,0,30,0,0,15,0,10,0,0,0,10,20,10,0,10]
["Spell list",0.03,0.5,0.3,0.3,0.2,0.1,"N/A",0,0,0.1,0.03,0.15,0.05,0.1,0.05,0.03,0.03,0.25,0.02,0.25,0.02,0.02,0.02,0.02,0,0,0,0,0,0,0,0,0,0,0,0.05,0.1,0.05]
[]
["Adolescent skills"]
["1H Crush",4,null,null,null,null,null,null,null,null,null,null,null,null,1,2,null,null,null,2,null,null,null,null,null,3,1,3,2,2,null,3,2,3,3,3,null,null,1]
["1H Slash",null,null,2,2,2,2,null,2,2,2,1,1,2,1,null,1,null,3,null,3,1,2,2,2,null,4,null,null,null,null,null,null,null,null,3,2,2]
["1H Thrust",null,null,null,1,null,null,null,null,null,null,null,null,1,null,null,null,null,1,null,1,null,null,null,null,null,1,null,null,null,null,null,null,null,null,null,null,null,1]
["2 Handed",2,null,2,null,null,null,null,2,null,1,null,null,null,null,null,null,2,3,null,3,null,null,null,null,null,1,null,4,3,3,3,3,3,4,5]
["AM Balance",null,null,null,null,1,null,null,null,null,null,null,null,2,null,null,1,null,null,null,null,1,1,2,null,null,null,null,null,null,null,null,null,null,null,null,null,1]
["AM Speed",null,null,null,null,null,null,1,null,null,null,null,null,1,null,null,null,null,null,null,null,1,null,1,null,null,null,null,null,null,null,null,null,null,null,null,null,null,1]
["AM Strength",2,null,null,null,null,null,null,null,null,null,null,null,null,null,null,null,2,null,null,null,null,null,null,null,null,null,null,1,1,1,2,2,2,2,2]
["Ambush",null,null,null,null,null,null,null,null,null,null,null,null,null,null,2,null,null,null,null,null,null,null,null,null,1,1,1]
["Body Development",3,1,2,1,1,1,2,2,2,2,2,1,2,1,3,2,3,3,3,3,2,2,1,2,2,3,2,4,4,5,5,5,5,5,5,2,2,2]
["Bow",1,null,1,2,3,2,2,1,1,1,1,1,1,1,null,2,null,1,1,1,2,2,1,1,null,1,1,null,null,null,null,null,null,null,null,1,1,2]
["Climbing",1,null,null,1,2,1,2,1,null,null,1,null,2,null,3,3,2,null,5,null,null,null,1,null,1,1,1,1,1,1,1,1,2,1,1,null,null,1]
["Disarm traps",1,null,null,null,null,null,1]
["General perception",1,3,3,3,3,1,4,1,1,1,1,1,1,1,2,1,1,1,1,1,1,2,1,1,1,1,1,1,1,null,1,1,1,1,1,1,1,1]
["MA Strikes",2,null,null,null,null,null,null,null,null,null,null,null,null,null,null,null,2,null,null,null,null,null,2,null,null,null,null,2,2,4,3,3,3,4,4]
["MA Sweeps",null,null,null,null,null,null,null,null,null,null,null,null,null,null,null,null,null,null,null,null,null,null,2]
["Man. Chain",3,null,null,null,null,1,null,2,2,2,1,null,null,null,null,null,null,3,null,3,null,null,null,2,2,3,1,3,null,null,null,null,null,null,2,1,2]
["Man. Plate",1,null,null,null,null,1,null,null,null,null,null,null,null,null,null,null,null,2,null,2,null,null,null,null,null,2,null,3,null,null,null,null,null,null,2]
["Man. Rigid L",1,null,null,null,null,1,null,1,1,1,1,null,2,1,null,null,null,1,1,1,1,1,null,1,3,2,3,2,null,null,null,null,null,null,null,1,1,2]
["Man. Soft L",1,null,null,1,1,null,null,1,1,1,1,1,1,1,3,2,1,null,1,null,1,1,1,1,2,1,1,1,null,null,null,null,null,null,null,1,null,1]
["Pick locks",2,null,null,null,null,null,1]
["Polearm",null,null,null,1,1,null,null,null,2,1,1,null,null,1,1,1,2,null,2,null,2,null,null,2,1,1,1,null,null,null,null,2,null,null,2,1,null,2]
["Riding",null,1,1,1,1,1,null,1,8,1,1,1,null,2,null,null,null,1,null,1,5,5,null,1,null,null,null,null,null,null,null,null,null,null,null,1,null,1]
["Runes",null,2,1,1,null,1,null,null,null,1,null,null,null,null,null,null,null,2,null,2]
["Shield",2,null,2,1,1,1,null,1,1,1,1,null,1,null,null,null,null,2,1,2,1,1,1,1,1,2,1,null,null,null,null,null,null,null,2,1,1]
["Stalk & Hide",null,1,2,3,4,2,5,1,1,null,1,1,null,null,4,4,4,null,2,null,1,null,2,null,1,null,null,null,1,null,null,null,null,null,null,1,null,1]
["Staves & wands",2,2,2,1,1,1,null,null,null,1,null,1,null,null,null,null,null,2,null,2,null,null,null,null,null,null,null,null,null,null,null,null,null,null,null,null,2]
["Swimming",null,1,2,2,3,1,null,null,null,1,1,1,2,null,2,1,2,1,1,1,null,null,1]
["Thrown",1,null,null,null,null,null,2,null,null,null,1,null,1,1,4,1,1,null,2,null,1,2,null,2,1,1,1,2,2,1,2,1,2,2,2,1,null,2]
[]
["Total",{"$f":"SUM(B29:B56)","v":30},{"$f":"SUM(C29:C56)","v":11},20,21,24,17,20,16,22,17,15,9,19,11,26,19,22,26,22,{"$f":"SUM(U29:U56)","v":26},20,19,18,16,19,26,17,26,17,15,20,20,21,22,34,14,13,18]
[]
["Racial bonuses"]
["AM Balance",null,null,null,null,10,null,null,null,null,null,null,null,10,null,null,20,null,null,20,null,null,5,10,null,null,null,null,null,null,null,null,null,null,null,null,null,null,10]
["AM Landing"]
["AM Leaping"]
["AM Speed"]
["AM Strength",null,null,null,null,null,null,null,null,null,null,null,null,null,null,null,null,null,null,null,null,null,null,null,null,null,null,null,10,10,20,10,15,20,20,20]
["Adrenal Defense"]
["Armored AD"]
["Ambush",null,null,null,null,null,null,null,null,null,null,null,null,null,null,10]
["Sniping",null,null,null,null,null,null,null,null,null,null,null,null,null,null,10]
["Body Development",null,null,null,null,null,null,null,null,null,null,null,null,null,null,null,null,null,null,null,null,null,null,null,null,null,null,null,10,15,20,20,20,20,20,20]
["Channeling",null,null,null,null,null,null,null,null,null,null,null,null,null,null,10]
["Climbing",null,null,null,null,null,null,null,null,null,null,null,null,null,null,null,20,null,null,20,null,null,null,10]
["Directed Spells"]
["Disarm Traps"]
["General Perception",null,20,20,20,20]
["MA Strikes"]
["MA Sweeps"]
["Man. Soft L"]
["Man. Rigid L"]
["Man. Chain"]
["Man. Plate"]
["Pick locks"]
["Riding",null,null,null,null,null,null,null,null,20,null,null,null,null,null,null,null,null,null,null,null,10,null,null,10,null,null,null,null,null,null,null,null,null,null,null,null,null,5]
["Runes",null,20]
["Staves & Wands",null,20,20]
["Stalk & Hide",null,null,null,null,10]
["Swimming"]
["Administration",null,10,null,null,null,null,null,null,null,null,null,null,null,null,null,null,null,10,null,10]
["Alchemy",null,10]
["Architecture",null,10,null,null,null,null,null,null,null,null,null,null,null,null,null,null,null,10,null,10]
["Basic Mathematics",null,10,null,null,null,null,null,null,null,null,null,null,null,null,null,null,null,10,null,10]
["Biochemistry",null,10]
["Boat Pilot",null,10,null,10,null,null,null,null,null,null,null,null,10,10]
["Cryptography",null,10]
["Demon/Devil Lore",null,10]
["Drafting",null,10]
["Dragon Lore",null,10]
["Engineering",null,10]
["Faerie Lore",null,10]
["Fauna Lore",null,10,null,null,10,null,null,null,null,null,null,null,null,null,null,10,20]
["Flora Lore",null,10,null,null,10,null,null,null,null,null,null,null,null,null,10,10]
["Heraldry",null,10,null,null,null,null,null,null,null,null,null,null,null,5,null,null,null,10,null,10]
["Herb Lore",null,10,null,null,10,null,null,null,null,null,null,null,null,5,10]
["Lock Lore",10,10]
["Mapping",null,10]
["Mechanition",null,10]
["Metal Lore",10,10]
["Military Organization",null,10,null,null,null,null,null,null,null,null,null,null,10,null,null,null,null,10,null,10,null,null,null,null,null,5]
["Mining",10,10]
["Navigation",null,10,null,10,null,null,null,null,null,null,null,null,15,10,null,null,null,null,null,25,null,null,null,null,null,null,null,null,null,null,null,null,null,null,null,null,10]
["Phil/Relig. Doctrine",null,10]
["Poison Lore",null,10,null,null,null,null,null,null,null,null,null,null,null,10,10,null,null,null,null,null,null,null,null,null,null,null,null,null,null,null,null,null,null,null,null,5,null,10]
["Racial History",null,10,null,null,null,null,null,null,null,null,null,null,null,null,null,null,null,10,null,10]
[null,null,10]
["Sanity Healing Lore",null,10]
["Siege Engineer",null,10]
["Spec. know. Lore",null,10]
[null,null,10]
["Star-gazing",null,10,null,null,null,null,null,null,null,null,null,null,10,5,null,null,null,null,null,null,null,null,null,null,null,null,null,null,null,null,null,null,null,null,null,5]
["Stone Lore",10,10]
["Tactics",null,10,null,null,null,null,null,null,null,null,null,null,null,null,null,null,null,10,null,10,null,null,null,null,null,5]
["Trading lore",null,10,null,null,null,null,null,null,null,null,null,null,null,10,null,null,null,null,null,null,null,null,null,null,null,null,null,null,null,null,null,null,null,null,null,10,10]
["Weather Watching",null,10,null,10,null,null,null,null,null,null,null,null,25,5,10,null,10,null,null,null,null,null,null,null,null,null,null,null,null,null,null,null,null,null,null,5]
["Animal handling",null,null,null,null,10,null,null,null,10,null,null,null,null,null,null,5,15,null,null,null,10,20,null,null,null,null,null,null,null,null,null,null,null,null,null,5]
["Animal training",null,null,null,null,10,null,null,null,10,null,null,null,null,null,null,5,15,null,null,null,10,20]
["Beast Master",null,null,null,null,10,null,null,null,null,null,null,null,null,null,5,null,25,null,null,null,null,null,null,null,null,null,null,null,10]
["Driving",null,null,null,null,null,null,null,null,null,null,null,null,null,5,null,null,null,null,10,null,10,10]
["Herding",null,null,null,null,null,null,null,null,null,null,null,null,null,null,null,null,10]
["Loading"]
["Athletic Games",null,null,null,null,null,null,null,null,null,null,null,null,null,null,null,15]
["Dancing",null,null,null,null,null,null,null,null,null,null,null,null,null,null,null,null,null,null,null,null,null,null,null,null,null,null,null,null,null,null,null,null,null,null,null,10]
["Distance Running",null,null,null,null,null,null,null,null,null,null,null,null,null,null,null,null,15,null,null,null,null,null,null,null,10,10,null,null,null,null,null,null,null,null,null,null,null,5]
["Diving"]
["Flying/Gliding"]
["Holding Breath"]
["Portaging",10,null,null,null,null,null,null,null,null,null,null,null,null,null,null,null,10,null,null,null,null,null,null,null,null,null,null,10,20,30,25,null,25,25,25]
["Rappelling",null,null,null,null,null,null,null,null,null,null,null,null,15,null,null,10]
["Rowing",null,null,null,null,null,null,null,null,null,null,null,null,10,10]
["Sailing",null,null,null,20,null,null,null,null,null,null,null,null,20,10,null,null,null,null,null,25,null,null,null,null,null,null,null,null,null,null,null,null,null,null,null,null,10]
["Skating"]
["Skiing"]
["Sprinting"]
["Brawling",20,null,null,null,null,null,null,null,null,null,null,null,null,null,null,null,20,null,null,null,null,null,null,null,null,null,null,10,20,30,25,30,25,30,30]
["Defensive Technique"]
["Defensive Weaving"]
["Disarm, Armed"]
["Disarm, Unarmed"]
["Donning/Doffing Chain"]
["Donning/Doffing Plate"]
["Donning/Doffing RL"]
["Donning/Doffing SL"]
["Expertise"]
["Feinting",null,null,null,null,null,null,null,null,null,null,null,null,10]
["Grappling Hook",null,null,null,null,null,null,null,null,null,null,null,null,25,null,null,null,null,null,null,null,null,null,null,null,null,null,null,null,null,null,null,null,null,null,null,null,null,5]
["Honing",null,null,null,null,null,null,null,null,null,null,null,null,null,null,10,null,null,null,null,null,null,null,null,null,null,null,null,null,null,null,null,null,null,null,null,5,null,5]
["Iai"]
["Instinctive Maneuver"]
["Lancing"]
["Melee Scuffle",10,null,null,null,null,null,null,null,null,null,null,null,null,null,null,null,20,null,null,null,null,null,null,null,null,null,null,15,25,30,25,30,25,30,30]
["Missile Artillery",null,null,null,null,null,null,null,null,null,null,null,null,10]
["SeaBorn Combat",null,null,null,15,null,null,null,null,null,null,null,null,20,5,null,null,null,null,null,15,null,null,null,null,null,null,null,null,null,null,null,null,null,null,null,null,10]
["Shield Bash",null,null,null,null,null,null,null,null,null,null,null,null,null,null,null,null,null,null,null,null,null,null,null,null,null,null,null,null,25,null,25,15,25,null,30]
["Shield Expertise"]
["Stunned Maneuver",null,null,null,null,null,null,null,null,null,null,null,null,null,null,null,null,null,null,null,null,5,null,5,5,5,null,null,15,25,30,25,30,30,30,30,null,null,5]
["Subduing"]
["Tackling",10,null,null,null,null,null,null,null,null,null,null,null,null,null,null,null,20,null,null,null,null,null,null,null,null,null,null,15,25,30,25,30,30,30,30]
["Unarmed Expertise"]
["Weapon Brawling"]
["Weapon Kata"]
["Yado"]
["AM Quickdraw"]
["Blind Fighting",null,null,40,20]
["Body Damage Stabilization",null,null,null,null,null,null,null,null,null,null,null,null,null,null,null,null,null,null,null,null,null,null,null,null,null,20,null,null,20]
["Control Lycantrophy"]
["Dowsing"]
["Frenzy",null,null,null,null,null,null,null,null,null,null,null,null,null,null,null,null,15,null,10,null,null,null,null,null,null,5,null,null,15,null,15,15,15,20,15]
["Meditation Cleansing",null,null,null,null,null,null,null,null,null,null,null,null,null,null,10]
["Meditation Death",null,null,null,null,null,null,null,null,null,null,null,null,null,null,10]
["Meditation Healing",null,null,null,null,null,null,null,null,null,null,null,null,null,null,10]
["Meditation Ki",null,null,null,null,null,null,null,null,null,null,null,null,null,null,10]
["Meditation Sleep",null,null,null,null,null,null,null,null,null,null,null,null,null,null,10]
["Meditation Trance",null,25,25,20,20]
["Mnemonics"]
["Prepared Shot",null,null,null,null,null,null,null,null,null,null,null,null,null,null,10]
["WOW Fatigue",10,null,null,null,null,null,null,null,null,null,null,null,null,null,10,null,10,null,5,null,5,null,5,5,5,15,null,null,20,30,20,30,30,30,30,null,null,5]
["WOW Pain",10,null,null,null,null,null,null,null,null,null,null,null,null,null,null,null,10,null,5,null,5,null,5,5,5,15,null,null,20,30,20,30,30,30,30,null,null,5]
["WOW Unconsciousness",10,null,null,null,null,null,null,null,null,null,null,null,null,null,null,null,10,null,5,null,5,null,5,5,5,15,null,null,20,30,20,30,30,30,30,null,null,5]
["WOW Will",10,null,null,null,null,null,null,null,null,null,null,null,null,null,10,null,null,null,null,null,null,null,null,null,null,5]
["Silent Kill",null,null,null,null,null,null,null,null,null,null,null,null,null,null,10]
["Use/Remove Poison",null,null,null,null,null,null,null,null,null,null,null,null,null,10,10,null,null,null,null,null,null,null,null,null,null,5,null,null,null,null,null,null,null,null,null,null,null,10]
["Appraisal",5,10,null,null,null,null,null,null,null,null,null,null,null,5,null,null,null,null,null,null,null,null,null,null,null,null,null,null,null,null,null,null,null,null,null,5]
["Armor Evaluation",5,10,10,null,null,null,null,null,null,null,null,null,null,5,null,null,null,null,null,null,null,null,null,null,null,5]
["Metal Evaluation",5,10,null,null,null,null,null,null,null,null,null,null,null,5,null,null,null,null,null,null,null,null,null,null,null,5]
["Stone Evaluation",5,10,null,null,null,null,null,null,null,null,null,null,null,5]
["Weapon Evaluation",5,10,10,null,null,null,null,null,null,null,null,null,null,5]
["Advertising"]
["Cookery",null,null,null,null,null,null,10,null,null,null,null,null,null,null,5]
["Crafting"]
["Fletching",null,null,null,null,10,null,null,null,null,null,null,null,null,null,null,5]
["Gimmickry"]
["Horticulture"]
["Hygien"]
["Leatherworking",null,null,null,null,null,null,null,null,null,null,null,null,null,null,5,5]
["Painting"]
["Play instrument #1",null,20,20,null,10]
["Play instrument #2",null,20,20,null,10]
["Play instrument #3",null,20,20,null,10]
["Rope Mastery",null,null,null,null,null,null,null,null,null,null,null,null,10]
["Sculpting",null,null,null,null,null,null,null,null,null,null,null,null,null,null,10]
["Skinning",null,null,null,null,null,null,null,null,null,null,null,null,null,null,5]
["Smithing",null,null,10]
["Stonecrafts",10,null,10,null,null,null,null,null,null,null,null,null,null,null,15]
["Tactical Games"]
["WA Maintenance"]
["Woodcrafts",null,null,null,null,null,null,null,null,null,null,null,null,null,null,null,5]
["Acrobatics",null,null,null,null,null,null,15,null,null,null,null,null,null,null,null,10,null,null,10,null,null,null,null,null,null,null,null,null,null,null,null,null,null,null,null,null,null,5]
["Calisthenics"]
["Contortions"]
["Juggling"]
["Jumping",null,null,null,null,null,null,null,null,null,null,null,null,10]
["Pole Vaulting"]
["Stilt Walking"]
["Tightrope Walking",null,null,null,null,null,null,null,null,null,null,null,null,10,null,null,10]
["Tumbling",null,null,null,null,null,null,15,null,null,null,null,null,10,null,null,5,null,null,10,null,null,null,10,null,null,null,null,null,null,null,null,null,null,null,null,5,5,10]
["Language"]
["Lip Reading"]
["Mimicry",null,null,null,null,null,null,null,null,null,null,null,null,null,null,10]
["Music",null,20,20,5,10]
["Poetic Improvisation",null,20,20,5,null,null,null,null,null,null,null,null,null,null,null,null,null,null,10]
["Propaganda",null,null,null,null,null,null,null,null,null,null,null,null,null,15]
["Public Speaking",null,10,10,10,null,10,null,null,null,null,null,null,null,15,null,null,null,10,10,10]
["Signaling",null,null,null,null,null,null,null,null,null,null,null,null,10,null,null,null,null,null,null,null,null,null,null,null,null,null,null,null,null,null,null,null,null,null,null,null,5]
["Singing",null,10,10,5,10]
["Tale Telling",null,null,null,null,null,null,null,null,null,null,null,null,null,15,null,null,null,null,10]
["Trading",null,null,null,null,null,null,null,null,null,null,null,null,null,15,null,null,null,null,null,null,null,null,null,null,null,null,null,null,null,null,null,null,null,null,null,10,10]
["Ventriloquism"]
["Circle Lore",null,10]
["Divination",null,10]
["Magical Rituals",null,10]
["Magnitude",null,10]
["Overcasting",null,10]
["Power Manipulation",null,10]
["Power Perception",null,10]
["PP Development",null,10]
["Power Projection",null,10]
["Rejuvenation",null,10]
["Scrying",null,10]
["Spell Artistery",null,10]
["Spell Mastery",null,10]
["Summoning",null,10]
["Symbol Lore",null,10]
["Targeting Skill",null,10]
["Transcend Armor",null,10]
["Warding Lore",null,10]
["Animal healing",null,null,null,null,10]
["Dentistry"]
["Diagnostics"]
["Drug Tolerance",null,null,null,null,null,null,null,null,null,null,null,null,null,null,null,null,null,null,null,null,null,null,null,null,null,null,null,null,25]
["First Aid"]
["Hypnosis"]
["Midwifery"]
["Second Aid"]
["Surgery"]
["Awakening"]
["Direction Sense"]
["Lie Perception"]
["Poison Perception",null,null,null,null,null,null,null,null,null,null,null,null,null,10,10,null,null,null,null,null,null,null,null,null,null,null,null,null,null,null,null,null,null,null,null,10,null,10]
["Sense Ambush",null,20,20,20,20,null,null,null,null,null,null,null,null,null,5,null,null,null,null,null,null,null,null,null,null,null,null,null,10]
["Surveillance",null,null,null,null,null,null,null,null,null,null,null,null,null,null,10]
["Time Sense"]
["Tracking",null,null,null,null,10,null,null,null,null,null,null,null,null,null,25,5,10,null,null,null,null,null,null,null,null,null,null,null,10,null,null,null,null,null,null,5,null,10]
["Diplomacy",null,null,null,null,null,10,null,null,null,null,null,null,null,15,null,null,null,10]
["Duping",null,null,null,null,null,null,null,null,null,null,null,null,null,null,null,null,null,null,null,10]
["Gambling"]
["Interrogation"]
["Intimidation",null,null,null,null,null,null,null,null,null,null,null,null,null,null,null,null,10,null,null,10]
["Leadership",null,15,15,null,null,10,null,null,null,null,null,null,null,null,null,null,null,10]
["Seduction"]
["Acting",null,null,null,null,null,null,null,null,null,null,null,null,null,15,null,null,null,null,10]
["Begging",null,null,null,null,null,null,null,null,null,null,null,null,null,10,null,null,null,null,10]
["Bribery"]
["Camouflage",null,null,null,null,10,null,null,null,null,null,null,null,null,null,null,10]
["Disguise"]
["Falsification"]
["Hide Item",null,null,null,null,10]
["Mimery"]
["Pick Pockets"]
["Set Traps"]
["Trickery",null,null,null,null,10]
["Caving",15]
["Fire Starting",null,null,null,null,null,null,null,null,null,null,null,null,null,null,5]
["Foraging",null,null,null,null,null,null,null,null,null,null,null,null,null,null,15,10,null,null,null,null,null,null,null,null,null,null,null,null,15,null,null,null,null,null,null,5,null,10]
["Hostile Environment",null,null,null,null,null,null,null,null,null,null,null,null,null,null,null,null,null,null,null,null,null,null,null,null,null,null,null,null,15,null,null,null,null,null,null,10,null,15]
["Region Lore"]
["Streetwise",null,null,null,null,null,null,null,null,null,null,null,null,null,5]

{"sheet":"Diverse","index":7,"n_rows":186,"n_cols":14,"rows_kept":186,"cut":false,"hidden":false,"merged":[]}
["Stat value","Bonus","Dev.pts","Baserate","Alchemist","Beorning","Valt yrke","Nada",null,"Frågor, din dumma djävulsdyrkande och löjliga rollspelsfåne!","Svar på tal, din jävla tattare… du med så sparsam intellektuell begåvning ska passa dig noga!",1]
[1,-25,1,25,"Archer","Black Numenorean",{"$f":"INDEX(Diverse!E1:E84,'Ny NPC'!A2)","v":"Alchemist"},"Ett varannan level",null,"Hur kan man sätta tre kryss på två levlar?","Du sätter ett nu och två nästa level…"]
[2,-23,1.3,30,"Archmage","Cave Troll",null,"Ett varje level",null,"Vad kostar det för varje level att sätta tre kryss varannan level?","Det kostar hälften av vad det gör totalt."]
[3,-21,1.6,35,"Assassin","Common (city-folk)","Vald ras","Tre på två levlar",null,"Kan jag redigera en gubbe som jag trodde att jag var klar med?","Nä, är du klar så är du klar. Du kan gå in på bladet Master NPC table och ändra själv om du vill."]
[4,-19,1.8,35,"Astrologer","Common (rural)",{"$f":"INDEX(Diverse!F1:F94,'Ny NPC'!C2)","v":"Beorning"},"Två varje level",null,"Jag kan välja att slå högre på hits än vad jag borde kunna med den ras jag valt…","Ja, jag vet… men eftersom du har märkt det så antar jag att du inte vill fuska så mycket. Att du alls är i närheten av max-slaget är orimligt!"]
[5,-17,2,40,"Barbarian","Corsair",null,null,null,"Kan jag fortfarande göra gubben trots att jag gjort av med mer dev.pts än jag har?","Ja, det finns ingen sån spärr. Du är SL, du får bända på reglerna lite grann."]
[6,-15,2.2000000000000002,40,"Bard","Dorwinadan","Karaktärens level","Dev.pts primary",null,"Varför är kalkylen så onödigt stor? Den är ju på över en MB…","Bra fråga, svaret är att det är ganska mycket text som har skrivits in och att Excelkalkyler kan både svälla och bli långsamma efter ett tag."]
[7,-14,2.4,40,"Bashkar","Dunlending",1,{"$f":"SUM('Ny NPC'!W3:W12)/2","v":35},null,"Måste man verkligen skriva så här mycket själv och räkna hela tiden?","Du har nog valt att spelleda i fel rollspel, du kan nog ta att köra systemlöst och utan papper… latmask!"]
[8,-13,2.6,40,"Beastmaster","Dwarf",null,"Dev.pts secondary",null,"Jag kan ju välja samma vapentyp på olika kategorier!","…och vad har du tjänat på det då? Du har istället förlorat dev.pts och respekt!"]
[9,-12,2.7,40,"Bounty Hunter","Easterling","Medelhits-slag",{"$f":"70+H8","v":105},null,"Varför är vissa kalkylblad låsta och/eller dolda?","Risken är att om du skulle få gå in i dem så gör du större skada än nytta…"]
[10,-11,2.8,45,"Burglar","Eothraim",35,null,null,"Jag vill lägga in egna raser, egna yrken och egna skills… går det bra?","Visst, ta dig in i rätt blad och ändra det du vill (gärna i alfabetisk ordning) men du har ju lika lite support från mig vilket som…"]
[11,-10,2.9,45,"Cavalier","Forest Troll",{"$f":"G11/10+1","v":4.5},null,null,"Jag vill ha några secondary skills också, har inte alla Stunned Maneuver nuförtiden?","Jo, men det är lite trångt redan nu med 33 skills. Tror du inte att något av vapen-skillsen är lika höga som Stunned… borde vara?"]
[12,-10,2.9,45,"Channeler","Gathmarim",null,null,null,"Såhär kan man väl inte göra en NPC, det är ju sterilt, fånigt och utan känsla!","Jodå, det kan man. Jag kan göra mina riktiga karaktärer här ända tills jag kommer till skills med bara ett rank eller de över 30 då det inte är värt de poäng det kostar."]
[13,-9,3,45,"Conjuror","Greater Dunadan","Vapengrupp/stats",null,null,"Det saknas skillranks för level noll på trollen, orcherna och jättarna!","Ja, antingen hade de ingen barndom eller så har ingen orkat göra level noll för dem. Har du nåt förslag så hör av dig!"]
[14,-9,3,45,"Craftsman","Half-elf","1H Crush",{"$f":"(ST+ST+EQ)/3","v":15},null,"Fan va smått det är med alla knappar, text osv…","Ja, antingen det eller sprida ut sig mer på bredden. Det är inte perfekt, men alla har varken 21\"-skärmar eller upplösning som matchar. Använd Excels zoom-funktion eller låt bli…"]
[15,-9,3,45,"Crystal mage","Half-orc","1H Slash",{"$f":"(ST+ST+AG+EQ)/4","v":12.5}]
[16,-8,3.3,45,"Cultist","Half-troll","1H Thrust",{"$f":"(AG+QU+ST+EQ)/4","v":7.5}]
[17,-8,3.3,45,"Dancer","Haruze","2 Handed",{"$f":"(ST+ST+EQ)/3","v":15}]
[18,-8,3.3,45,"Dervish","Hill Troll","Polearm",{"$f":"(ST+ST+AG+EQ)/4","v":12.5}]
[19,-7,3.6,45,"Druid","Hobbit","Staff",{"$f":"(ST+ST+AG+EQ)/4","v":12.5}]
[20,-7,3.6,45,"Duelist","Lesser Dunadan","Bow",{"$f":"(AG+AG+ST)/3","v":10}]
[21,-7,3.6,45,"Enchanter","Mornedain","Crossbow",{"$f":"AG","v":5}]
[22,-6,3.8,45,"Farmer","Mountain Troll","Blowgun",{"$f":"(CO+AG)/2","v":12.5}]
[23,-6,3.8,45,"Feldsher","Noldo (Academic)","Thrown",{"$f":"(AG+ST)/2","v":12.5},null,"Är du så jävla bra själv då?","Nä, men är du så jävla bra själv då?  (jag har också hört på Riskradion)"]
[24,-6,3.8,45,"Fighter","Noldo (Martial)"]
[25,-5,4,45,"Forcemage","Northman","Primärt vapen",4,null,null,null,"Channeling","Essence","Mentalism"]
[26,-5,4,50,"Healer","Olog-Hai","Sekundärt vapen",5,null,"None",1,0,0,0]
[27,-5,4,50,"High War monk","Orc","Tertiärt vapen",10,null,"Leather",2,0,16,20]
[28,-4,4.3,50,"Horseman","Sagath/Logath","Fjärde vapen",2,null,"Leather and metal",3,6,22,30]
[29,-4,4.3,50,"Houri","Silvan","Femte vapen",3,null,"Metal",4,12,32,50]
[30,-3,4.5999999999999996,50,"Hunter","Sinda","Sjätte vapen",7]
[31,-3,4.5999999999999996,50,"Illusionist","Snow Troll"]
[32,-3,4.5999999999999996,50,"Indurate","Stone Troll","Armor Type","MMP","Maximum Penalty","Missile Attack Penalty","Quickness Penalty","Reverse","Channeling","Essence"]
[33,-2,4.8,50,"Lancer","Umbarean",1,0,0,0,0,0,0,0]
[34,-2,4.8,50,"Leader","Uruk-Hai",2,0,0,0,0,0,0,0]
[35,-2,4.8,50,"Macabre","Variag",3,0,0,0,0,0,0,0]
[36,-2,4.8,50,"Magician","Woodman",4,0,0,0,0,0,0,0]
[37,-1,5,50,"Mentalist","Wose",5,0,0,0,0,0,0,8]
[38,-1,5,50,"Monk",null,6,0,-20,-5,0,0,0,12]
[39,-1,5,50,"Montebanc",null,7,-5,-40,-5,-5,5,0,16]
[40,-1,5,50,"Moon Mage",null,8,-10,-50,-10,-5,10,0,20]
[41,0,5.5,50,"Mystic",null,9,-5,-50,0,0,5,0,12]
[42,0,5.5,50,"Necromancer",null,10,-10,-70,-10,-5,10,0,24]
[43,0,5.5,50,"Nightblade",null,11,-15,-90,-20,-15,15,0,32]
[44,0,5.5,50,"No Profession",null,12,-15,-110,-30,-15,15,0,40]
[45,0,5.5,50,"Outrider",null,13,-10,-70,0,-5,10,15,28]
[46,0,5.5,50,"Paladin",null,14,-15,-90,-10,-10,15,22,36]
[47,0,5.5,50,"Ranger",null,15,-25,-120,-20,-20,25,36,56]
[48,0,5.5,50,"Rogue",null,16,-25,-130,-20,-20,25,36,56]
[49,0,5.5,50,"Romantic",null,17,-15,-90,0,-10,15,20,32]
[50,0,5.5,50,"Sage",null,18,-20,-110,-10,-20,20,32,40]
[51,0,5.5,50,"Sailor",null,19,-35,-150,-30,-30,35,38,60]
[52,0,5.5,50,"Scholar",null,20,-45,-165,-40,-40,45,45,72]
[53,0,5.5,50,"Seer"]
[54,0,5.5,50,"Shadow Mage",null,"Length","Baserate"]
[55,0,5.5,50,"Shaikan",null,1,-10]
[56,0,5.5,50,"Shaman",null,100,-5]
[57,0,5.5,50,"Sleuth",null,163,0]
[58,0,5.5,50,"Sorceror",null,194,5]
[59,0,5.5,50,"Swordsman",null,208,10]
[60,1,6,50,"Templar",null,223,15]
[61,1,6,50,"Thief",null,238,20]
[62,1,6,50,"Trader"]
[63,1,6,50,"Trench Fighter",null,"Weapon Type"]
[64,2,6.3,50,"War Monk",null,"Unencumbered",null,75]
[65,2,6.3,50,"Warlock",null,"1H weapon (no shield)",null,55]
[66,2,6.3,50,"Warrior",null,"1H thrust & shield",null,35]
[67,2,6.3,50,"Warrior Mage",null,"1H weapon & shield",null,25]
[68,3,6.6,50,"Witch",null,"2w Combo (small weapons)",null,35]
[69,3,6.6,50,"Witch Hunter",null,"2w Combo (large weapons)",null,25]
[70,3,6.6,50,"Wizard",null,"Twohanded weapon",null,25]
[71,3,6.6,50]
[72,4,6.8,50,null,null,"Channeling"]
[73,4,6.8,50,null,null,"Essence"]
[74,4,6.8,50,null,null,"Mentalism"]
[75,5,7,50,null,null,"Hybrid: Channeling/Essence"]
[76,5,7,50,null,null,"Hybrid: Channeling/Mentalism"]
[77,5,7,50,null,null,"Hybrid: Mentalism/Essence"]
[78,6,7.4,50,null,null,"Arcane"]
[79,6,7.4,50]
[80,6,7.4,50,null,null,"Stat value","PP Recovery"]
[81,7,7.7,50,null,null,1,0]
[82,7,7.7,50,null,null,2,0]
[83,7,7.7,50,null,null,3,0]
[84,8,8,50,null,null,4,0]
[85,8,8,50,null,null,5,0]
[86,8,8,50,null,null,6,0]
[87,9,8.1999999999999993,50,null,null,7,0]
[88,9,8.1999999999999993,50,null,null,8,0]
[89,9,8.1999999999999993,50,null,null,9,0]
[90,10,8.4,50,null,null,10,0]
[91,11,8.6,51,null,null,11,0]
[92,12,8.6999999999999993,52,null,null,12,0]
[93,13,8.8000000000000007,53,null,null,13,0]
[94,14,8.9,54,null,null,14,0]
[95,15,9,55,null,null,15,0]
[96,17,9.1999999999999993,56,null,null,16,0]
[97,19,9.4,57,null,null,17,0]
[98,21,9.6,58,null,null,18,0]
[99,23,9.8000000000000007,59,null,null,19,0]
[100,25,10,60,null,null,20,0]
[101,30,10.5,62,null,null,21,0]
[102,35,11,64,null,null,22,0]
[103,40,11.5,66,null,null,23,0]
[104,45,12,68,null,null,24,0]
[105,50,12.5,70,null,null,25,1]
[106,55,13,72,null,null,26,1]
[107,60,13.5,74,null,null,27,1]
[108,65,14,76,null,null,28,1]
[109,70,14.5,78,null,null,29,1]
[110,75,15,80,null,null,30,1]
[111,80,15.5,82,null,null,31,1]
[112,85,16,84,null,null,32,1]
[113,90,16.5,86,null,null,33,1]
[114,95,17,88,null,null,34,1]
[115,100,17.5,90,null,null,35,1]
[116,105,18,92,null,null,36,1]
[117,110,18.5,94,null,null,37,1]
[118,115,19,96,null,null,38,1]
[119,120,19.5,98,null,null,39,1]
[120,125,20,100,null,null,40,1]
[121,130,20.5,102,null,null,41,1]
[122,135,21,104,null,null,42,1]
[123,140,21.5,106,null,null,43,1]
[124,145,22,108,null,null,44,1]
[125,150,22.5,110,null,null,45,1]
[126,155,23,112,null,null,46,1]
[127,160,23.5,114,null,null,47,1]
[128,165,24,116,null,null,48,1]
[129,170,24.5,118,null,null,49,1]
[130,175,25,120,null,null,50,1]
[null,null,null,null,null,null,51,1]
[null,null,null,null,null,null,52,1]
[null,null,null,null,null,null,53,1]
[null,null,null,null,null,null,54,1]
[null,null,null,null,null,null,55,1]
[null,null,null,null,null,null,56,1]
[null,null,null,null,null,null,57,1]
[null,null,null,null,null,null,58,1]
[null,null,null,null,null,null,59,1]
[null,null,null,null,null,null,60,1.5]
[null,null,null,null,null,null,61,1.5]
[null,null,null,null,null,null,62,1.5]
[null,null,null,null,null,null,63,1.5]
[null,null,null,null,null,null,64,1.5]
[null,null,null,null,null,null,65,1.5]
[null,null,null,null,null,null,66,1.5]
[null,null,null,null,null,null,67,1.5]
[null,null,null,null,null,null,68,1.5]
[null,null,null,null,null,null,69,1.5]
[null,null,null,null,null,null,70,1.5]
[null,null,null,null,null,null,71,1.5]
[null,null,null,null,null,null,72,1.5]
[null,null,null,null,null,null,73,1.5]
[null,null,null,null,null,null,74,1.5]
[null,null,null,null,null,null,75,2]
[null,null,null,null,null,null,76,2]
[null,null,null,null,null,null,77,2]
[null,null,null,null,null,null,78,2]
[null,null,null,null,null,null,79,2]
[null,null,null,null,null,null,80,2]
[null,null,null,null,null,null,81,2]
[null,null,null,null,null,null,82,2]
[null,null,null,null,null,null,83,2]
[null,null,null,null,null,null,84,2]
[null,null,null,null,null,null,85,2]
[null,null,null,null,null,null,86,2]
[null,null,null,null,null,null,87,2]
[null,null,null,null,null,null,88,2]
[null,null,null,null,null,null,89,2]
[null,null,null,null,null,null,90,3]
[null,null,null,null,null,null,91,3]
[null,null,null,null,null,null,92,3]
[null,null,null,null,null,null,93,3]
[null,null,null,null,null,null,94,3]
[null,null,null,null,null,null,95,3]
[null,null,null,null,null,null,96,3.5]
[null,null,null,null,null,null,97,3.5]
[null,null,null,null,null,null,98,3.5]
[null,null,null,null,null,null,99,3.5]
[null,null,null,null,null,null,100,4]
[null,null,null,null,null,null,101,4.5]
[null,null,null,null,null,null,102,5]
[null,null,null,null,null,null,103,5.5]
[null,null,null,null,null,null,104,6]
[null,null,null,null,null,null,105,6.5]

{"sheet":"Levelbonus","index":8,"n_rows":22,"n_cols":96,"rows_kept":22,"cut":false,"hidden":false,"merged":[]}
["Profession","Alchemist","Animist","Archer","Archmage","Arcist","Arms Master","Assassin","Astral Traveller","Astrologer","Barbarian","Bard","Bashkar","Beastmaster","Bounty Hunter","Burglar","Cavalier","Chaotic Lord","Channeler","Conjuror","Crafter","Craftsman","Creator","Crystal mage","Cultist","Dancer","Delver","Dervish","Doppelgänger","Dream Lord Illusionist","Dream Lord Shaman","Druid","Duelist","Elementalist","Enchanter","Farmer","Feldsher","Fighter","Forcemage","Free Thinker","Gypsy","Healer","High War monk","Horseman","Houri","Hunter","Illusionist","Indurate","Lancer","Lay Healer","Leader","Macabre","Magician","Magus Chan","Magus Chan/Ess","Magus Ess","Maleficant","Mentalist","Monk","Montebanc","Moon Mage","Mystic","Necromancer","Nightblade","No Profession","Noble Warrior","Outrider","Paladin","Ranger (old)","Ranger","Rogue","Romantic","Runemaster","Sage","Sailor","Scholar","Seeker","Seer","Shadow Mage","Shaikan","Shaman","Sleuth","Sorceror","Swordsman","Tarotmage","Templar","Thief","Trader","Trench Fighter","War Monk","Warlock","Warrior","Warrior Mage","Witch","Witch Hunter","Wizard"]
["Academic skills",3,1,0,3,3,0,0,3,2,0,2,0,0,0,0,0,0,2,3,3,1,2,2,1,0,2,0,0,1,1,1,0,2,1,0,1,0,3,3,0,2,0,0,0,0,3,0,0,1,1,1,3,2,2,2,2,2,1,0,0,2,2,0,1,0,0,0,0,0,0,0,3,1,0,3,3,2,2,0,1,0,2,0,1,1,0,0,0,0,2,0,0,2,0,2]
["Animal",0,3,0,0,0,1,0,0,1,2,0,0,2,2,0,1,0,0,0,0,1,0,1,0,0,0,0,0,0,3,3,0,0,0,3,0,1,0,0,1,0,0,3,0,2,0,0,1,0,0,0,0,0,0,0,1,0,0,0,0,0,0,0,1,1,2,0,3,2,1,0,0,0,0,0,0,0,0,0,3,0,0,0,0,2,1,1,1,2,0,0,0,1,2,0]
["Athletic",0,0,1,0,0,2,1,0,0,2,0,2,1,1,3,2,1,0,0,0,1,0,0,0,3,0,1,0,0,0,0,2,1,1,0,0,2,0,0,0,0,2,1,0,0,0,2,2,0,2,0,0,0,0,0,0,0,2,0,1,0,0,2,1,2,0,1,1,1,2,1,0,0,2,0,0,0,0,1,0,0,0,2,0,1,2,0,1,2,0,3,1,0,0,0]
["Combat",0,0,3,0,0,3,2,0,0,3,0,3,2,2,1,3,2,1,0,0,1,0,0,2,1,2,2,0,0,0,0,3,2,0,0,2,3,0,0,0,0,3,3,0,2,0,3,3,0,3,1,0,0,0,0,0,0,1,1,1,0,0,2,1,3,2,3,1,2,3,3,0,0,3,0,0,0,0,3,0,1,0,3,1,3,2,1,3,2,0,3,2,0,2,0]
["Concentration",0,1,1,2,2,0,0,2,1,0,1,2,0,0,1,0,0,0,0,0,1,0,1,0,0,0,0,0,2,2,0,2,0,0,0,1,0,0,2,0,2,2,0,0,0,0,1,1,1,0,0,1,0,0,0,0,2,1,0,1,3,0,1,1,0,0,0,0,0,0,0,1,3,0,2,0,2,0,2,1,0,1,1,1,0,0,0,2,2,0,0,0,0,0,1]
["Deadly",0,0,0,0,0,0,3,0,0,0,0,0,1,1,0,0,1,0,0,0,0,1,0,1,0,0,2,0,0,0,0,0,0,0,0,1,1,0,0,0,1,0,0,1,2,0,0,0,0,0,0,0,0,0,0,0,0,0,0,0,0,0,3,0,0,0,0,1,0,0,0,0,0,0,0,0,0,0,0,0,0,0,0,0,0,1,0,0,1,1,1,1,0,0,0]
["Evaluation",2,0,1,0,0,1,0,0,0,0,3,0,1,0,2,0,0,2,0,3,1,0,0,0,0,2,0,1,2,2,0,0,1,0,2,0,0,0,0,2,0,0,0,0,0,0,0,0,1,0,0,0,0,0,0,0,0,0,1,0,0,0,0,1,1,0,0,2,2,1,0,0,0,2,1,0,0,0,1,1,0,0,1,1,1,0,2,0,0,0,0,0,1,0,0]
["General",2,1,1,0,0,1,0,0,0,0,3,0,2,0,0,0,0,2,0,3,1,0,0,0,0,2,0,1,2,2,0,0,1,0,2,0,0,0,0,2,0,0,1,0,2,0,0,0,1,0,0,0,0,0,0,0,0,0,0,0,0,0,0,1,1,0,0,2,2,1,0,0,0,2,1,0,0,0,1,1,0,0,1,1,1,0,2,0,0,0,0,0,1,0,0]
["Gymnastic",0,0,1,0,0,2,1,0,0,2,0,2,1,1,3,3,2,0,0,0,1,0,0,0,3,0,1,0,0,0,0,2,1,0,0,0,2,0,0,0,0,3,1,0,0,0,2,2,0,2,0,0,0,0,0,0,0,2,0,1,0,0,2,1,2,0,1,1,1,2,1,0,0,2,0,0,0,0,3,0,0,0,1,0,1,2,0,1,2,0,3,1,0,0,0]
["Linguistic",0,1,0,0,0,0,0,0,0,0,3,0,0,0,0,0,0,0,2,0,1,0,0,0,0,0,0,1,0,0,0,0,0,2,0,0,0,0,3,2,0,0,0,2,0,0,0,0,0,1,0,0,2,2,2,0,1,0,1,1,1,0,0,1,0,0,0,0,0,0,1,2,3,0,3,0,0,0,0,1,0,0,0,0,0,0,2,0,0,0,0,0,1,0,0]
["Magical",3,1,0,2,2,0,0,1,2,0,0,0,0,0,0,0,1,2,3,0,1,2,2,2,0,1,1,2,2,2,2,0,1,2,0,0,0,3,0,1,2,0,0,1,0,3,0,0,1,0,2,3,3,3,3,3,2,0,0,2,2,2,0,1,0,0,0,0,0,0,0,3,1,0,0,3,2,3,0,1,0,3,0,3,0,0,0,0,0,3,0,2,1,1,3]
["Medical",0,1,1,0,0,0,0,0,0,0,0,0,0,0,0,0,0,1,0,0,0,3,0,0,0,0,0,0,1,1,2,0,0,0,0,3,0,0,2,1,3,0,0,0,0,0,0,1,3,0,0,0,0,0,0,2,0,1,0,0,0,3,0,0,0,1,0,0,0,0,0,0,0,0,1,0,0,3,0,1,0,0,0,0,0,0,0,0,0,0,0,0,1,0,0]
["Perception",1,2,2,0,0,0,1,0,1,1,0,0,1,3,2,0,0,2,1,0,1,0,2,1,0,1,0,0,0,0,1,0,1,0,0,2,0,2,0,1,2,0,1,1,2,2,0,1,1,1,0,0,1,1,1,0,1,1,2,0,1,0,1,1,0,2,1,1,1,1,0,1,0,1,0,3,3,0,1,0,3,1,1,0,0,1,1,0,1,2,0,1,1,3,1]
["Social",0,0,0,0,0,1,0,1,0,0,0,0,0,0,0,1,1,0,0,0,1,0,0,0,2,0,2,3,0,0,0,0,0,2,0,0,0,0,0,1,1,0,0,3,0,0,0,0,0,2,0,0,0,0,0,0,0,0,2,1,0,0,0,1,1,2,1,0,0,0,3,0,0,0,0,0,0,0,0,1,3,0,0,0,1,0,1,0,0,1,0,0,0,0,0]
["Subterfuge",0,0,0,0,0,0,2,0,0,0,0,0,1,1,3,0,0,0,0,1,1,0,0,1,2,0,0,3,0,0,2,0,0,1,0,0,0,0,0,1,0,0,1,1,2,1,0,0,0,0,1,0,0,0,0,0,0,1,3,0,0,0,1,1,0,2,0,1,1,2,0,0,0,2,0,0,0,0,1,0,2,0,0,0,0,3,1,0,0,0,0,0,1,1,0]
["Directed Spells",0,0,0,0,0,0,0,1,1,0,0,0,0,0,0,0,1,0,0,0,0,0,0,0,0,0,0,0,1,1,0,0,0,0,0,0,0,1,0,0,0,0,0,0,0,1,0,0,0,0,1,3,1,1,1,0,1,0,0,1,0,1,0,0,0,0,0,0,0,0,0,0,0,0,0,0,0,0,0,0,0,2,0,1,0,0,0,0,0,0,0,0,0,0,2]
["Base Spell Casting",2,2,0,3,3,1,0,2,2,0,1,0,1,0,0,0,1,2,2,1,0,2,2,1,0,1,1,2,2,2,2,0,1,2,0,1,0,2,0,0,2,0,0,1,0,2,0,0,2,0,2,2,2,2,2,2,2,1,1,1,2,2,1,0,1,0,1,0,1,0,0,2,2,0,0,2,2,2,0,2,1,2,0,2,0,0,0,0,0,2,0,1,2,1,2]
["Body Development",0,0,0,0,0,2,1,0,0,3,0,3,1,1,0,3,2,0,0,0,0,0,0,1,2,1,1,0,0,0,0,3,2,0,2,2,3,0,0,0,1,3,2,0,1,0,3,2,0,2,1,0,0,0,0,0,0,2,1,1,0,0,1,0,3,1,3,0,1,1,2,0,0,1,0,0,0,0,1,0,0,0,3,0,2,0,0,3,2,0,3,2,0,1,0]
["Survival",0,3,1,0,0,1,0,0,1,2,0,0,2,3,1,0,0,0,0,0,1,0,1,0,0,0,0,0,0,3,3,0,0,0,3,0,1,0,0,1,0,0,3,0,3,0,0,1,0,0,0,0,0,0,0,1,0,1,0,0,0,0,0,1,1,2,0,3,2,1,0,0,0,0,0,0,0,0,0,3,0,0,0,0,1,1,1,1,2,0,0,0,1,2,0]
[null,{"$f":"SUM(B2:B20)","v":13},{"$f":"SUM(C2:C20)","v":16},12,10,10,15,11,10,11,15,13,12,16,15,16,13,12,14,11,11,14,10,11,10,13,12,11,13,13,19,16,12,13,11,12,{"$f":"SUM(AK2:AK20)","v":13},13,11,10,13,16,13,16,10,16,12,11,14,11,14,9,12,11,11,11,11,11,14,12,11,11,10,14,14,16,14,{"$f":"SUM(BP2:BP20)","v":11},16,16,15,11,12,10,15,11,11,11,10,14,16,10,11,13,11,14,13,12,12,16,11,13,11,13,13,11]
["Class",null,null,null,null,null,"S","N",null,null,"N","S","N","S","N","N","N","S","P",null,"S","N","H",null,"S","N","S","S","P","H","H","P","N","S","H","N","S","N","P",null,"N",null,"N","N","S","N","P","N","N","P","N","S","P","P","H","P","H","P","S","S","S","H",null,"S","N","S","N","S","S","S","N","N",null,null,"N","N",null,null,"H","N","P","S","H","N",null,"N","N","N","N","N",null,"N","S","H","S","P"]

{"sheet":"AllaSkills","index":9,"n_rows":319,"n_cols":75,"rows_kept":319,"cut":false,"hidden":false,"merged":[]}
["Skill","Grupp","Stats","Alchemist","Archer","Archmage","Assassin","Astrologer","Barbarian","Bard","Bashkar","Beastmaster","Bounty Hunter","Burglar","Cavalier","Channeler","Conjuror","Craftsman","Crystal mage","Cultist","Dancer","Dervish","Druid","Duelist","Enchanter","Farmer","Feldsher","Fighter","Forcemage","Healer","High War monk","Horseman","Houri","Hunter","Illusionist","Indurate","Lancer","Leader","Macabre","Magician","Mentalist","Monk","Montebanc","Moon Mage","Mystic","Necromancer","Nightblade","No Profession","Outrider","Paladin","Ranger","Rogue","Romantic","Sage","Sailor","Scholar","Seer","Shadow Mage","Shaikan","Shaman","Sleuth","Sorceror","Swordsman","Templar","Thief","Trader","Trench Fighter","War Monk","Warlock","Warrior","Warrior Mage","Witch","Witch Hunter","Wizard","Wizard"]
["Administration","Academic","Re/Pr","2/5","2/6","2/5","2/6","2/5",7,"1/5","6","7","5","2/6","2/6","2/4","2/5","2/6","2/4","2/4","2/5","2/5","6","2/6","2/5","2/6","1/4","2/6","2/5","2/5","6","2/6","2/5","2/6","2/5","4/9","2/6","1/3","2/5","2/5","2/5","3/7","2/6","2/5","2/5","2/5","2/5","2/6","1/3","2/5","5","2/6","2/6","1/2","2/6","1/3","2/5","2/5","2/6","6","1/5","2/5","2/6","2/6","2/5","1/3","3/7","3/7","2/4","6","2/5","5","5","2/5","2/5"]
["Advanced math","Academic","Re","2/5","4/8","3/7","4/7","2/3",7,"3/6","7","7","3/7","3/7","4/8","3/6","3/7","3/7","3/7","3/6","5","3/7","3/7","4/8","3/6","3/7","3/7","4/8","2/5","3/6","7","4/7","3/6","4/7","3/5","4/8","4/8","4/8","3/7","3/7","3/6","3/6","4/7","3/7","3/6","3/7","3/8","3/7","4/7","3/7","3/7","4/7","4/8","1/3","4/7","1/4","3/6","3/7","4/8","3/7","3/6","3/6","4/8","4/8","3/8","2/4","4/7","4/7","3/7","6","3/7","3/7","3/7","3/7","3/7"]
["Alchemy","Academic","Re","1/3","3/7","2/4","3/5","2/4","3/9","2/4","3/6","3/5","3/7","2/6","3/7","2/4","2/5","2/6","3/5","2/4","3/7","3/7","3/6","3/7","2/4","2/6","3/7","3/7","2/4","3/6","3/6","3/5","2/5","3/5","2/7","3/7","3/7","3/7","2/6","2/4","2/6","2/5","3/5","3/7","2/4","2/6","2/6","2/6","3/5","2/7","3/7","3/5","3/7","1/3","3/5","1/4","2/6","2/6","3/7","3/6","2/4","2/5","3/7","3/7","2/6","2/5","3/9","3/9","2/6","6","3/5","1/4","3/7","2/4","2/4"]
["Anthopology","Academic","In/Em","2/5","3","2/5","3","2/5","7","1/4","3/7","6","2/6","3","3","2/5","2/5","2/6","2/7","2/5","3","3","2/5","3","1/4","2/6","2/6","3","2/5","2/5","3/7","3","2/5","3","2/5","3","3","3","2/5","2/5","2/5","2/6","3","3","2/5","2/5","3/6","2/6","3","2/6","2/6","3","3","1/3","3","1/4","2/5","2/5","3","2/5","1/4","2/5","3","3","3","3","2/6","2/6","1/5","6","2/6","2/5","2/6","2/5","2/5"]
["Architecture","Academic","Re/Em","2/5","3/6","2/5","2/5","2/5","5","2/5","4","5","3/6","2/5","3/6","2/4","2/5","2/6","4","2/4","3","4","3/6","3/6","2/5","2/6","3/5","3/6","2/5","2/5","4","2/5","2/5","2/5","2/5","3/6","3/6","2/5","2/5","2/5","2/5","3/6","2/5","4","2/5","2/5","2/4","2/6","2/5","2/5","3/6","2/5","3/6","1/3","2/5","1/3","2/5","2/5","3/6","3/6","2/5","2/5","3/6","3/6","2/4","2/5","3/6","3/6","4","6","3/5","2/5","3/6","2/5","2/5"]
["Astronomy","Academic","Re/Em","3/7","3/7","3/7","3/7","2/3","3/7","3/6","7","3/7","3/5","3/7","3/7","2/4","2/5","3/7","6","2/4","3/7","3/7","2/5","3/7","2/5","3/7","2/8","3/7","3/7","2/5","7","3/7","3/6","3/7","3/7","3/7","3/7","3/7","3/6","3/7","3/7","3/5","3/7","3/7","2/5","3/6","3/7","3/7","3/7","3/6","3/5","3/7","3/7","1/3","3/7","1/4","2/4","3/6","3/7","2/4","3/6","2/5","3/7","3/7","3/7","2/5","3/7","3/7","1/5","6","2/8","2/4","3/5","3/7","3/7"]
["Basic Mathematics","Academic","Re","1/4","3/7","2/6","3/6","1/2","3/7","2/5","6","3/6","2/6","2/6","3/7","2/5","2/6","2/6","2/6","2/5","3/9","2/6","2/6","3/7","2/5","2/6","2/6","3/7","1/4","2/6","6","3/6","2/5","3/6","2/4","3/7","3/7","3/7","2/6","2/6","2/5","2/5","3/6","2/6","2/5","2/6","2/7","2/6","3/6","2/6","2/6","3/6","3/7","1/2","3/6","1/4","2/5","2/6","3/7","2/6","2/5","1/5","3/7","3/7","2/7","1/3","3/6","3/6","2/6","6","2/6","2/5","2/6","2/6","2/6"]
["Biochemistry","Academic","In/Re","5","5","5","5","5","4","5","5","4","5","5","5","5","5","4","3/7","5","4","4","2/5","5","5","4","3/5","5","5","2/4","5","5","5","5","5","5","5","5","6","5","5","5","5","4","5","6","5","4","5","5","5","5","5","1/3","5","1/4","5","6","5","2/7","5","7","5","5","5","5","5","5","2/6","6","3/5","2/6","5","5","5"]
["Boat pilot","Academic","Re/Ag","2/6","2/6","2/6","2/6","2/4","1/3","2/6","3/6","2/4","1/4","2/6","2/6","2/5","2/6","2/6","3/7","2/5","3/7","3/7","1/5","2/6","2/6","2/6","2/5","2/6","2/6","3/6","3/6","2/6","2/6","2/6","2/6","2/6","2/6","2/6","2/6","2/6","2/6","2/6","2/6","3/7","2/6","2/6","2/6","2/6","2/6","2/6","1/4","2/6","2/6","1/3","1/4","1/4","1/4","2/6","2/6","2/5","2/6","2/6","2/6","2/6","2/6","2/3","2/6","2/6","3/7","6","2/5","2/5","1/4","2/6","2/6"]
["Cryptography","Academic","In/Re","2/6","6","2/6","2/5","2/4","2/6","1/2","3","2/6","2/6","2/5","6","2/5","1/5","2/6","2/5","2/6","1/4","1/4","2/5","6","2/5","2/6","2/6","6","2/6","2/6","3","2/5","1/5","2/5","2/5","6","6","6","2/6","2/6","2/5","2/6","2/5","1/4","2/5","2/6","2/5","2/6","4/10","2/6","2/6","2/5","6","1/2","2/5","1/3","2/4","2/6","6","1/5","2/6","2/6","6","6","2/5","1/4","2/6","2/6","1/5","6","2/6","1/4","2/6","2/6","2/6"]
["Demon/Devil Lore","Academic","Re","1/3","5","1/2","4","2/5","5","2/5","4","5","2/5","3","5","1/3","1/3","2/6","2/4","1/3","3","2/4","1/4","5","2/5","2/6","2/6","5","1/2","2/5","4","4","2/5","4","1/2","5","5","5","1/3","1/2","1/4","1/3","4","2/4","1/3","1/3","3","2/6","4","2/4","2/5","4","5","1/3","4","1/4","1/4","1/3","5","1/3","2/5","1/2","5","5","3","4","4","4","1/3","6","2/6","1/2","1/3","1/2","1/2"]
["Drafting","Academic","Re","1/3","3/6","2/4","2/5","2/4","3/6","2/4","2/4","2/5","3/7","2/5","3/6","1/4","2/5","2/6","3/7","1/4","2/5","3","1/3","3/6","2/4","2/6","2/5","3/6","2/4","2/5","2/4","2/5","2/5","2/5","2/5","3/6","3/6","2/5","2/5","2/4","2/4","1/3","2/5","3","2/4","2/5","2/4","2/6","2/5","3/7","3/7","2/5","3/6","1/3","2/5","1/4","2/4","2/5","3/6","1/5","2/4","2/5","3/6","3/6","2/4","2/4","2/4","2/4","3/7","6","2/5","3/6","3/7","2/4","2/4"]
["Dragon Lore","Academic","Re","1/3","2","1/3","2","1/4","2","2/5","5","4","3","4","2","1/4","1/3","2/6","2/5","1/4","5","2/5","1/3","2","1/4","2/6","2/7","2","1/3","2/5","5","2","2/5","2","1/3","2","2","2","2/4","1/3","2/4","2/5","2","2/5","1/4","2/4","2","2/6","2","1/4","1/3","2","2","1/3","2","1/4","3/4","2/4","2","1/5","2/5","1/3","2","1","4","4","3","3","2/4","6","2/7","1/4","1/3","1/3","1/3"]
["Engineering","Academic","In/Re","1/2","3/6","2/6","2/5","2/5","3/6","2/4","2","2/5","3/7","1/4","3/6","2/6","2/6","2/6","4","2/6","3","4","4","3/6","2/6","2/6","3/5","3/6","2/6","3/7","2","2/5","2/5","2/5","2/6","3/6","3/6","2/4","2/6","2/6","2/6","2/5","2/5","4","2/6","2/6","1/4","2/6","2/5","3/5","3/7","2/5","3/6","1/2","2/5","1/3","2/6","2/6","3/6","4","2/4","2/6","3/6","3/6","1/4","2/5","2","2","4","6","3/5","4","3/7","2/6","2/6"]
["Faerie Lore","Academic","Re","1/3","6","1/2","4","1/3","3","1/4","4","6","1/4","4","1/5","1/4","1/4","2/6","2/4","1/4","5","2/5","1/4","6","1/2","2/6","3/7","6","1/2","2/5","4","4","2/5","4","1/3","6","6","6","2/4","1/2","1/4","2/4","4","2/5","1/2","2/4","3","2/6","4","2/5","1/4","4","6","1/3","4","1/4","1/4","2/4","6","1/4","1/4","1/3","6","6","3","4","3","3","1/4","6","3/5","1/4","1/4","1/2","1/2"]
["Fauna Lore","Academic","Re","1/4","3","2/5","2","2/6","2/4","1/4","3","2","1/4","5","1/5","1/4","2/5","2/6","2/4","1/4","4","2/5","1/5","3","1/4","1/4","2/6","3","2/5","1/3","3","2","2/5","1/4","2/5","3","3","3","2/6","2/5","2/6","2/4","2","2/5","1/4","2/6","3","2/6","2","2/5","1/4","2","3","1/3","2","1/4","2/5","2/6","3","1/2","1/4","2/6","3","3","2","1/4","2/6","2/6","1/5","6","2/6","1/4","1/4","2/5","2/5"]
["Flora Lore","Academic","Re","1/4","3","2/5","2","2/6","2/4","2/4","3","2","1/2","5","1/5","1/4","2/5","2/6","2/5","1/4","4","2/5","1/5","3","1/5","1/4","2/6","3","2/5","1/3","3","2","2/5","2","2/5","3","3","3","2/6","2/5","2/5","2/5","2","2/5","1/5","2/6","3","2/6","2","2/4","1/2","2","3","1/3","2","1/4","2/5","2/6","3","1/2","2/4","2/6","3","3","2","1/4","4/12","2/6","1/5","6","2/6","1/4","1/2","2/5","2/5"]
["Heraldry","Academic","Re","3/5","1/5","3/5","2/5","2/4","3/5","1/2","2/4","2/5","1/4","2/6","1/3","2/4","3/5","2/6","2/6","2/4","3/5","2/5","3/5","1/5","2/4","2/6","2/4","1/5","3/5","2/4","2/4","2/5","2/5","2/5","2/5","1/5","1/5","1/4","3/5","3/5","2/5","2/6","2/5","2/5","2/4","3/5","2/5","2/6","1/3","1/3","1/4","2/5","1/5","1/3","2/5","1/3","1/4","3/5","1/5","3/7","2/5","3/5","1/5","1/5","2/5","2/6","3/6","3/6","2/4","3/7","2/4","3/6","1/4","3/5","3/5"]
["Herb Lore","Academic","Re","1/3","2/6","2/6","2/6","2/4","2/6","1/4","2/4","2/6","1/3","2/6","1/5","2/4","1/4","2/6","1/4","2/4","3/6","2/4","1/2","2/6","1/4","1/5","1/4","2/6","2/6","1/2","2/4","2/6","2/5","2/6","2/6","4/9","2/6","2/6","2/6","2/6","2/5","2/4","2/6","2/4","1/4","2/6","2/6","2/6","2/6","1/4","1/3","2/6","2/6","1/3","2/6","1/4","2/4","2/6","2/6","1/2","1/4","2/6","2/6","2/6","2/6","2/5","4/8","2/4","1/4","6","2/5","1/2","1/3","2/6","2/6"]
["Lock Lore","Academic","Re","1/3","2/6","2/4","2/4","2/6","3/7","1/3","2/6","2/6","3/7","1/2","1/5","2/6","2/5","2/6","3/6","2/6","1/4","4","2/7","2/6","2/5","2/6","2/6","2/6","2/4","3/7","2/6","1/3","2/5","1/3","2/5","2/6","2/6","2/6","2/6","2/4","3/6","1/4","1/3","4","2/5","2/6","1/2","2/6","1/3","3/7","1/4","1/3","2/6","1/4","1/3","1/5","2/5","2/6","2/6","3/7","1/3","2/6","2/6","2/6","1/2","2/4","2/5","2/5","2/5","6","2/6","3/7","1/4","2/5","2/5"]
["Mapping","Academic","Re","2","7","3","6","2/5","7","3","5","6","2/6","5","7","4","5","2/6","1/4","4","4","3","2/6","7","3","2/6","3/7","7","3","5","5","6","3","6","4","7","7","2/4","4","3","4","3","6","3","3","4","5","2/6","6","3","2/6","6","7","2","6","1/4","2/6","4","7","4","3","4","7","7","5","2/4","5","5","4","6","2/6","4","2/6","3","3"]
["Mechanition","Academic","Ag/Re","1/2","3/6","2/6","2/5","2/4","3/7","2/4","2","2/5","3/7","1/4","3/6","2/6","2/6","2/6","3/8","2/6","3/9","4","3/8","3/6","2/6","2/6","3/7","3/6","2/6","3/7","2","2/5","2/5","2/5","2/6","3/6","3/6","3/6","2/6","2/6","2/6","2/5","2/5","4","2/6","2/6","1/4","2/6","2/5","3/5","3/7","2/5","3/6","2/5","2/5","2/4","2/6","2/6","3/6","3/8","2/4","2/6","3/6","3/6","1/4","2/5","2","2","3/9","6","2/6","3/8","3/7","2/6","2/6"]
["Metal Lore","Academic","Re","1/2","2/6","1/4","2/5","1/4","3/6","2/4","3","2/6","2/5","2/4","1/5","2/6","2/4","2/6","1/4","2/6","2/5","3","2/6","2/6","2/5","2/6","2/5","2/6","1/4","3/7","3","2/5","2/5","2/5","2/4","2/6","2/6","2/6","2/4","1/4","3/6","2/6","2/5","3","2/5","2/4","2/4","2/6","2/5","2/4","2/5","2/5","2/6","1/3","2/5","1/4","3/6","2/4","2/6","3/7","2/4","2/4","2/6","2/6","2/4","2/4","2","2","2/6","6","2/5","2/6","2/5","2/4","2/4"]
["Military Organization","Academic","Pr/Re","3/6","1/3","3/6","1/4","3/6","2/4","2/5","2/5","2/5","2/5","1/4","1/3","3/6","3/6","3/6","2/4","3/6","3/6","3/6","3","1/5","3/6","3/6","1/4","1/3","3/6","4","1/5","1/4","2/5","2/5","3/6","1/3","1/3","1/2","3/6","3/6","3/6","2/5","1/4","3/6","3/6","3/6","2/5","3/6","1/2","1/4","2/5","1/4","1/3","1/3","1/4","1/4","3/6","3/6","1/3","2/6","2/5","3/6","1/3","1/3","1/4","3/6","2/5","1/5","2/4","2/5","1/5","4","2/5","3/6","3/6"]
["Mining","Academic","Re/In","3","2/6","3","2/4","3","2/6","2/6","6","2/6","2/6","1/4","2/6","3/7","3","2/6","1/4","3/7","4","5","2/7","2/6","3","2/6","3/6","2/6","3","2/7","6","2/4","2/6","2/4","3","2/6","2/6","2/5","2/5","3","3","2/6","2/4","5","3","2/5","3/6","2/6","2/4","3/6","2/6","2/4","2/6","2/4","2/4","2/4","1/2","2/5","2/6","2/7","2/6","3","2/6","2/6","1/4","2/6","2/5","2/5","4","6","3/6","2/7","2/6","3","3"]
["Navigation","Academic","Re/In","2/6","2/6","2/6","2/5","1/3","2/6","2/6","6","2/5","1/4","2/6","2/6","2/4","2/6","2/6","3/7","2/4","2/6","2/4","1/4","2/6","2/6","2/6","2/6","2/6","2/6","2/4","6","2/5","2/6","2/5","2/6","2/6","2/6","2/5","2/6","2/6","2/6","2/6","2/5","2/4","2/6","2/6","2/6","2/6","1/3","2/5","1/4","2/5","2/6","1/4","2/4","2/5","1/2","2/6","2/6","1/4","2/6","2/6","2/6","2/6","2/6","1/4","2/6","2/6","2/5","6","2/6","2/5","1/4","2/6","2/6"]
["Phil/Relig. Doctrine","Academic","In/Re","1/2","2","1/2","2","1/2","7","1/3","3","2","1/3","2","2","1/2","1/2","2/6","1/2","1/2","3","1/2","1/2","2","1/2","2/6","1/4","2","1/2","1/2","1/3","2","2/5","2","1/2","4","2","1/5","1/2","1/2","1/2","1/3","2","1/2","1/2","1/2","2","2/6","2","1/2","1/3","2","2","1/2","2","1/3","1/2","1/2","2","1/2","2/6","1/2","2","1/2/2","2","2","1/4","1/4","1/2","6","1/4","1/2","1/3","1/2","1/2"]
["Physics","Academic","Re","2/5","4/8","3/7","4/7","2/3","7","3/6","7","7","3/7","3/7","4/8","3/6","3/7","3/7","3/7","3/6","5","5","5","4/8","3/6","3/7","3/7","4/8","1/3","3/6","7","4/7","3/6","4/7","3/5","4/8","4/8","4/8","3/7","3/7","3/6","3/6","4/7","5","3/6","3/7","3/8","3/7","4/7","3/7","3/7","4/7","4/8","1/3","4/7","1/4","3/6","3/7","4/8","4/7","3/6","3/6","4/8","4/8","3/8","2/4","4/7","4/7","3/7","6","3/7","4/7","3/7","3/7","3/7"]
["Planetology","Academic","Re/Em","4","6","4","6","3","5","5","6","5","5","6","6","4","4","4","4","4","6","6","2/7","6","4","4","3/7","6","4","4","6","6","5","6","4","6","6","6","4","4","4","5","6","6","4","4","5","4","6","5","5","6","6","1/4","6","1/4","4","4","6","4","5","4","6","6","6","6","6","6","5","6","3/7","4","5","4","4"]
["Poison Lore","Academic","Re","1/3","1/4","2/6","1/2","2/6","2/4","1/4","3/6","1/4","1/3","1/4","1/5","2/5","2/6","2/6","1/4","2/5","1/4","1/4","1/3","1/4","1/3","2/6","2/5","1/4","2/6","1/2","3/6","1/4","2/5","1/4","2/6","1/4","1/4","1/4","1/3","2/6","2/6","2/4","1/4","1/4","1/4","1/3","1/3","2/6","1/4","2/4","1/3","1/4","1/4","1/3","1/4","1/4","2/5","1/3","1/4","1/2","1/4","1/3","1/4","1/4","1/4","1/4","2/5","2/5","1/3","6","2/5","1/2","1/3","2/6","2/6"]
["Racial History","Academic","Re","1/4","3","1/4","3","1/4","7","1/2","2/6","3","2/4","3","3","1/4","1/4","2/6","2/5","1/4","4","2/5","1/4","3","1/4","2/6","2/6","3","1/4","1/4","2/6","3","2/5","3","1/4","3","3","1/5","1/4","1/4","1/4","2/4","3","2/5","1/4","1/4","3","2/6","3","2/4","2/4","3","3","1/2","3","1/3","1/4","1/4","3","1/4","2/6","1/4","3","3","3","3","2/6","2/6","1/4","6","2/6","1/4","2/4","1/4","1/4"]
["Research","Academic","Re/In","1/2","2","1/2","2","1/2","7","1/3","3","2","1/3","2","2","1/2","1/2","2/6","1/2","1/2","3","1/2","1/2","2","1/2","2/6","1/4","2","1/2","1/2","1/3","2","2/5","2","1/2","4","2","1/5","1/2","1/2","1/2","1/3","2","1/2","1/2","1/2","2","2/6","2","1/2","1/3","2","2","1/2","2","1/3","1/2","1/2","2","1/2","2/6","1/2","2","1/2/2","2","2","1/4","1/4","1/2","6","1/4","1/2","1/3","1/2","1/2"]
["Sanity Healing Lore","Academic","Re/Em","2","8","2","6","2/5","10","3/6","3","8","2/5","7","8","2/5","2","2/6","3/5","2/5","7","2","1/4","8","1/3","2/6","2/5","8","2","1/2","3","6","3/6","6","2/5","8","8","6","2/5","2","1/3","2/5","6","2","1/3","2/5","7","2/6","6","1/5","2/5","6","8","1/3","6","2/5","1/4","2/5","8","1/3","3/6","2","8","8","7","7","3","3","1/3","8","4","1/5","2/5","2","2"]
["Siege Engineer","Academic","Re/In","2/4","1/2","2/4","1/4","2/5","3/6","2/4","3/6","1/3","1/4","2/6","1/2","2/5","1/4","2/6","2/4","2/5","2/6","2/6","2/5","1/2","2/4","2/6","1/4","1/2","2/4","2/5","3/6","1/4","2/5","1/4","1/4","1/2","1/2","1/2/2","1/4","2/4","2/4","2/4","1/4","2/6","2/4","1/4","1/3","2/6","1/4","1/3","1/4","1/4","1/2","1/3","1/4","1/4","2/5","1/4","1/2","1/6","2/4","2/4","1/2","1/2","2/6","2/5","2/6","2/6","1/3","4","1/4","2/6","1/4","2/4","2/4"]
["Spec. Know. Lore","Academic","Re","1/3","1/3","1/3","1/3","1/3","1/3","1/3","1/3","1/3","1/3","1/3","1/3","1/3","1/3","1/3","1/3","1/3","1/3","1/3","1/3","1/3","1/3","1/3","1/3","1/3","1/3","1/3","1/3","1/3","1/3","1/3","1/3","1/3","1/3","1/3","1/3","1/3","1/3","1/3","1/3","1/3","1/3","1/3","1/3","1/3","1/3","1/3","1/3","1/3","1/3","1/3","1/3","1/3","1/3","1/3","1/3","1/3","1/3","1/3","1/3","1/3","1/3","1/3","1/3","1/3","1/3","1/3","1/3","1/3","1/3","1/3","1/3"]
["Star-gazing","Academic","In/Re","2/6","2/6","2/6","2/6","1/2","2/6","2/5","6","2/6","2/4","2/6","2/6","1/3","1/4","2/6","2/6","1/3","3/9","2/5","1/2","2/6","1/4","2/6","2/6","2/6","2/6","1/4","6","2/6","2/5","2/6","2/6","2/6","2/6","2/6","2/5","2/6","2/6","2/5","2/6","2/5","1/4","2/5","2/6","2/6","2/6","2/5","2/4","2/6","2/6","1/3","1/4","1/4","1/3","2/5","4/12","1/2","2/5","1/3","2/6","2/6","2/6","1/4","2/5","2/5","1/4","6","2/6","1/2","2/4","2/6","2/6"]
["Stone Lore","Academic","Re","1/2","2/6","1/4","2/5","1/4","3/7","2/4","3","2/5","2/5","2/4","1/5","2/6","2/4","2/6","1/4","2/6","2/5","2/5","2/5","2/6","2/5","1/5","3/7","2/6","1/4","3/7","3","2/5","2/5","2/5","2/4","2/6","2/6","2/6","2/4","1/4","3/6","2/6","2/5","2/5","2/5","2/4","2/4","2/6","2/5","2/4","2/5","2/5","2/6","1/3","2/5","1/4","3/6","2/4","2/6","2/5","2/4","2/4","2/6","2/6","2/4","2/4","2","2","2/6","6","2/4","2/6","2/5","2/4","2/4"]
["Tactics","Academic","In/Re","2/4","1/2","2/4","2/5","2/5","1/2","2/4","5","1/3","1/4","1/3","1/2","2/5","1/4","2/6","2/4","2/5","2/7","2/6","2/5","1/2","2/4","2/6","1/4","1/2","2/4","2/5","1/4","1/3","2/5","1/3","1/4","1/2","1/2","1/2/2","1/4","2/4","2/4","2/4","1/3","2/6","2/4","1/4","1/3","2/6","1/3","1/3","1/4","1/3","1/2","1/4","1/3","1/4","2/5","1/4","1/2","1/6","2/4","2/4","1/2","1/2","1/3","2/5","1/4","1/4","2/4","4","1/4","2/6","1/4","2/4","2/4"]
["Trading Lore","Academic","Re","2/6","2/7","2/5","2/7","2/6","2/6","1/4","2/7","1/3","1/2","2/5","1/5","2/4","2/5","2/6","2/4","2/4","2/4","2/6","2/4","2/7","1/4","1/5","2/6","2/7","2/5","2/4","2/7","2/7","2/5","1/2","2/5","4/9","2/7","2/7","2/6","2/5","2/6","2/5","2/7","2/6","2/4","2/6","2/5","2/6","2/7","1/4","1/2","2/7","2/7","1/3","2/7","1/3","2/5","2/6","2/7","2/4","1/4","2/6","2/7","2/7","2/5","1/2","2/6","2/6","2/4","6","2/6","3/5","1/2","2/5","2/5"]
["Weather Watching","Academic","In/Em","1/4","3/7","1/4","3/7","1/2","3/7","2/6","6","1/4","1/5","3/7","3/7","1/3","1/4","2/6","3/7","1/3","3/7","2/5","1/3","3/7","1/4","1/3","2/5","3/7","1/4","1/3","6","3/7","2/6","3/7","1/4","3/7","3/7","2/6","2/6","1/4","2/6","1/5","3/7","2/5","1/4","2/6","3/7","2/6","3/7","2/5","1/5","3/7","3/7","1/4","2/4","2/5","1/2","2/6","3/7","1/3","2/6","1/3","3/7","3/7","3/7","2/5","2/7","2/7","1/4","6","2/5","1/3","1/5","1/4","1/4"]
["Xeno lore","Academic","varies","4/6","6","4/7","6","4/7","6","3/5","6","4","4","6","1/5","4/7","4/7","6","4/7","4/7","6","6","4/7","6","4/7","6","5","6","4/7","4/7","6","6","3/5","6","4/7","6","6","6","4/7","4/7","4/7","4","6","6","4/7","4/7","4","6","6","4","4","6","6","3/6","6","3/8","4/7","4/7","6","4/7","3/5","4/7","6","6","5","5","6","6","4/7","6","5","4/7","4","4/7","4/7"]
["Animal Handling","Animal","Em/Pr/Ap","2/5","2/8","4","3","2","1/3","1/5","4","1/2","1/3","3/6","1/4","2","2/4","2/6","3","1/3","2/7","3","1/2","1/4","2/6","1/3","1/5","1/4","2/5","2","2/6","1/2","1/5","1/4","2/5","1/4","1/4","1/4","2","2/5","2","2/5","1/4","2/7","2/6","2","2/5","2/6","1/4","1/4","1/3","1/4","1/4","3","2/4","2/5","2","2","1/4","2/4","1/5","2/7","1/4","1/4","2/5","1/3","2/6","2/6","24","6","1/5","1/4","1/3","2/5","2/5"]
["Animal Training","Animal","Em/Pr/Ap","4","3/7","4","3","4","1/3","3/7","4","1/2","3/7","3/8","3/7","4","4","2/6","4","3/7","2/7","5","1/3","3/7","4","1/3","2/6","3/7","4","4","3/8","2/3","3/7","2/3","4","3/7","3/7","3/7","4","4","3","4","3/6","3","4","4","3/8","2/6","3/6","3/7","3/6","3/6","3/7","3","4","2/6","3","4","3/7","4","3/7","4","3/7","3/7","3/7","1/4","3/8","3/8","4","6","2/6","2","3/7","4","4"]
["Beast Master","Animal","Em/Pr","5","4","2/5","3","5","3/7","4","4","1/2","4","5","4","5","4","2/6","5","4","3/8","4","2/4","4","4","1/3","4","4","4","5","4","4","4","8","4","4","4","4","5","4","4","4","4","3/5","4","5","5","2/6","4","4","4","4","4","4","4","4","4","5","4","3/6","4","5","4","4","4","2/5","4","4","1/4","6","4","2/5","4","4","4"]
["Driving","Animal","Ag/Qu","3","1/4","4","3","3","1/3","2/7","4","1/4","2/7","2/6","1/4","3","3","2/6","5","2/7","2/7","3","2","1/4","3","1/3","2/4","1/4","3","3","2/6","1/5","2/7","1/5","3","1/4","1/4","1/4","3","3","3","2/7","1/5","2/7","3","3","3","2/6","1/5","2/6","2/7","1/5","1/4","3","2/6","2/6","3","3","1/4","3","2/7","3","1/4","1/4","2/6","1/2","2/6","2/6","3","6","2/4","3","2/7","3","3"]
["Herding","Animal","Em/Pr","2/6","1/4","2/5","3","3/7","1/4","2/7","4","1/2","2/7","2/5","1/4","2/5","2/5","2/6","4","2/7","2/5","3/6","1/3","1/4","3/5","1/3","3/7","1/4","2/6","2/5","6","1/4","2/7","1/4","2/6","1/4","1/4","1/4","2/6","2/6","3/7","3/7","1/4","2/5","3/5","2/6","2","2/6","1/4","2/6","2/7","1/4","1/4","3/7","2/4","2/6","3/7","2/6","1/4","2/5","2/7","2/7","1/4","1/4","2/5","2/4","2/6","2/6","3/6","6","3/7","2/5","2/7","2/6","2/6"]
["Loading","Animal","Em/Re","3","1/4","4","3","3","1/3","2/7","4","1/4","2/7","2/6","1/4","2","3","2/6","4","2/7","3/6","3","2","1/4","3","1/3","2/4","1/4","3","2","2/6","1/5","2/7","1/5","3","1/4","1/4","1/4","3","3","3","2/7","1/5","2/6","3","3","3","2/6","1/5","2/6","2/5","1/5","1/4","4","2/4","3","3","3","1/4","3","2/7","3","1/4","1/4","2/6","1/2","2/6","2/6","3","6","2/4","3","2/7","3","3"]
["Riding","Animal","Em/Ag","3","2/6","4","3","3","2/6","2/7","2/6","1/3","2/6","3","2/5","3","3","2/6","4","2/6","3/7","3","1/4","2/6","4","1/5","2/6","2/6","3","3","3","1/3","2/7","2/5","3","2/6","1/3","2/4","6","3","2","3","2/6","3","3","3","3","2/6","2/5","2/5","2/6","2/5","2/5","3","3/7","3","2","3","2/6","2/4","2/6","3","2/6","1/3","2/6","1/4","2/7","2/7","3","3","2/6","3","2/6","3","3"]
["Athletic Games","Athletic","St/Ag/Qu","7","1/4",7,"1/5","7","1/4","2/6","1/5","1/5","1/4","1/5","1/4","5","6","2/6","8","1/4","1/4","3/6","3","1/4","7","2/6","2/6","1/4","6","6","1/5","1/5","2/6","1/5","7","1/4","1/4","1/4","7","6","5","1/5","2/6","3/6","7","7","2/6","2/6","1/5","1/5","1/4","1/5","1/4","9","1/5","7","4","7","1/4","7","2/6","7","1/4","1/4","1/5","2/6","1/5","1/5","4","2/6","2/6","7","1/4","6","6"]
["Body Development","Athletic","Co/10","6","2/6","6","2/7","6","1/3","3/8","1/3","2/7","1/5","3/7","1/4","4/8","6","4","6","2/5","1/5","2/6","4/8","1/5","6","1/4","2/6","1/3","6","3/7","2/5","2/5","3/9","2/5","6","1/3","1/5","1/4","3/7","6","6","3/7","3/7","3/5","6","6","3/7","2/6","2/5","2/5","2/6","2/5","2/7","6","2/5","6","6","6","2/5","2/4","3/8","6","1/5","2/5","2/6","2/6","1/4","2/7","6","1/3","2/8","6","2/7","8","6"]
["Climbing","Athletic","Ag","7","3/7",7,"1/5","7","2/6","3/9","2/6","2/5","3/6","1/3","5","5","6","3/7","5","3/9","2/5","2/5","4","3/7","7","2/5","2/7","3/7","6","6","2/6","3/7","3/9","3/7","7","2/4","3/7","4","4","6","5","3/7","3/9","5","7","7","3/7","3/6","3/7","6","3/9","3/7","3/7","7","1/4","6","4","5","3/7","5","3/9","7","3/7","3/7","2/5","4","2/4","3/7","4","2/6","3/9","5","5","6","6"]
["Dancing","Athletic","Ag/In","2/6","2/6","2/6","2/4","2/5","2/6","1/3","6","2/6","2/6","2/4","2/6","1/5","2/6","2/6","2/6","2/5","1/2","1/5","1/5","2/6","1/3","2/6","2/6","2/6","2/6","2/4","6","2/4","1/3","2/4","2/6","2/6","2/6","2/6","2/6","2/6","2/6","1/5","1/3","1/5","2/4","2/6","2/4","2/6","2/4","2/5","2/5","2/4","2/6","2/6","2/4","2/6","2/5","2/6","2/6","1/4","1/5","2/7","2/6","2/6","2/4","2/6","2/4","2/4","2/6","6","2/6","1/4","2/5","2/6","2/6"]
["Distance Running","Athletic","Co","3","2/4",3,"2/5","3","2/4","2/6","1/2","2/5","2/4","1/3","2/4","3","3","2/6","3","2/6","1/4","1/2","3","2/4","3","2/6","2/5","2/4","3","3","1/4","2/5","2/6","2/5","3","2/4","2/4","2/4","3","3","3","2/6","2/6","1/2","3","3","1/3","2/6","2/5","2/5","2/6","2/5","2/4","3","2/5","3","3","3","2/4","3","2/6","3","2/4","2/4","1/3","2/5","1/5","1/5","3","2/6","2/7","4","2/6","3","3"]
["Diving","Athletic","Sd/Ag","3","2/6",3,"1/3","3","2/6","2/5","1/5","2/4","2/6","1/3","2/6","2/5","3","2/6","3","2/5","1/3","1/3","2/5","2/6","3","2/6","2/5","2/6","3","2/5","2/5","2/4","2/5","2/4","3","2/6","2/6","2/6","3","3","3","2/4","2/5","1/3","3","3","2/4","2/6","2/4","2/6","2/5","2/4","2/6","3","2/4","3","3","3","2/6","3","2/5","3","2/6","2/6","1/3","2/5","1/4","1/4","3","6","2/6","4","2/5","3","3"]
["Endurance","Athletic","None","6","2/6",8,"2/7","6","1/3","3/8","1/3","2/7","1/5","3/7","1/4","6","7","4","8","2/5","1/5","2/6","4","1/5","8","1/4","2/5","1/3","8","1/3","2/7","2/5","3/9","2/5","8","1/2","1/3","1/4","3/7","8","6","3/7","3/8","3/5","8","8","3/8","2/6","2/5","2/5","2/7","2/5","2/7","6","2/5","7","6","6","1/3","2/4","3/8","8","1/3","1/3","3/7","2/6","1/4","2/7","8","1/3","2/8","6","2/7","8","8"]
["Flying/Gliding","Athletic","Ag","3","3/6",3,"2/6","3","3/6","2/6","2/5","2/6","3/6","1/5","3/6","2/7","3","2/6","3","2/6","2/4","2/5","2/7","3/6","3","2/6","2/5","3/6","3","2/7","2/5","2/6","2/6","2/6","3","3/6","3/6","3/6","3","3","3","2/5","2/6","2/5","3","3","1/5","2/6","4/12","2/6","2/6","2/6","3/6","3","2/6","3","3","3","3/6","3","2/6","3","3/6","3/6","1/5","2/6","2/5","2/5","3","6","2/5","1/4","2/6","3","3"]
["Holding Breath","Athletic","Co/Sd","6","2/6",8,"2/7","6","1/3","3/8","1/3","2/7","1/5","3/7","1/4","6","7","4","8","2/5","1/5","2/6","4","1/5","8","1/4","2/5","1/3","8","1/3","2/7","2/5","3/9","2/5","8","1/2","1/3","1/4","3/7","8","6","3/7","3/8","3/5","8","8","3/8","2/6","2/5","2/5","2/7","2/5","2/7","6","2/5","7","6","6","1/3","2/4","3/8","8","1/3","1/3","3/7","2/6","1/4","2/7","8","1/3","2/8","6","2/7","8","8"]
["Portaging","Athletic","none","2/4","1/2","2/4","2/5","2/5","1/2","2/4","5","1/3","1/4","1/3","1/2","2/5","1/4","2/6","2/4","2/5","2/7","2/6","2/5","1/2","2/4","2/6","1/4","1/2","2/4","2/5","1/4","1/3","2/5","1/3","1/4","1/2","1/2","1/2/2","1/4","2/4","2/4","2/4","1/3","2/6","2/4","1/4","1/3","2/6","1/3","1/3","1/4","1/3","1/2","1/4","1/3","1/4","2/5","1/4","1/2","1/6","2/4","2/4","1/2","1/2","1/3","2/5","1/4","1/4","2/4","1/4","1/4","2/6","1/4","2/4","2/4"]
["Rappelling","Athletic","Ag","7","3/7",6,"1/3","7","3/7","3/9","2/5","3/7","3/7","2/5","3/7","5","6","2/6","3/7","3/9","2/5","3/7","4","3/7","7","2/6","2/5","3/7","6","6","2/5","3/7","3/9","3/7","7","2/4","3/7","3/7","7","6","5","3/7","3/9","3/7","7","7","2/5","2/6","3/7","3/7","3/9","3/7","3/7","8","3/7","7","4","7","3/7","6","3/9","7","3/7","3/7","2/5","3/7","2/4","3/7","4","6","3/8","8","3/9","6","6"]
["Rowing","Athletic","St/Sd","3","1/4",3,"2/5","3","1/4","2/5","6","1/3","1/4","1/4","1/4","2/5","3","2/6","4","2/4","3/7","3/9","2/7","1/4","3","2/6","2/5","1/4","3","2/6","6","1/3","2/5","1/3","3","1/4","1/4","1/4","3","3","3","1/5","2/5","3/9","3","3","1/4","2/6","1/3","2/4","2/4","1/3","1/4","5","1/3","3","3","3","1/4","2/4","2/5","3","1/4","1/4","1/4","1/4","1/4","1/4","3","3/7","2/5","3","2/4","3","3"]
["Sailing","Athletic","Em/In","3","2/6","3","2/6","3","2/6","2/6","6","2/6","2/6","2/6","2/6","2/4","3","2/6","3/7","2/5","3/7","3/7","2/7","2/6","3","2/6","2/5","2/6","3","2/5","6","2/6","2/6","2/6","3","2/6","2/6","2/6","3","3","3","2/4","2/6","3/7","3","3","2/6","2/6","2/6","2/5","2/5","2/6","2/6","3","1/3","3","3","3","2/6","2/4","2/6","3","2/6","2/6","2/6","2/6","2/6","2/6","3","6","3/7","3","2/5","3","3"]
["Skating","Athletic","Ag/Sd","3","2/7","3","2/6","3/7","2/5","2/7","6","2/6","2/7","2/6","2/7","2/6","3","2/6","2/6","2/6","1/2","1/3","2/7","2/7","3/7","2/6","2/5","2/7","3","2/7","6","2/6","2/7","2/6","3","2/7","2/7","2/7","3/7","3","3/5","2/6","2/7","1/3","3/7","3/7","2/6","2/6","4/12","2/6","2/6","2/6","2/7","3","2/6","3","3/5","3/7","2/7","2/5","2/7","3/7","2/7","2/7","2/6","2/5","2/5","2/5","3/7","6","2/6","3","2/6","3","3"]
["Skiing","Athletic","Ag/Sd","3","2/7","3","2/6","3/7","2/5","2/7","6","2/6","2/7","2/6","2/7","2/6","3","2/6","2/6","2/6","1/4","1/4","2/7","2/7","3/7","2/6","2/5","2/7","3","2/7","6","2/6","2/7","2/6","3","2/7","2/7","2/7","3/7","3","3/5","2/6","2/7","1/4","3/7","3/7","2/6","2/6","2/6","2/7","2/6","2/6","2/7","5","2/6","3","3/5","3/7","2/7","2/5","2/7","3/7","2/7","2/7","2/6","2/5","2/5","2/5","3/7","6","2/6","3","2/6","3","3"]
["Sprinting","Athletic","Qu","3","2/4","3","2/5","3","2/4","2/6","1/2","2/5","2/4","1/3","2/4","3","3","2/6","4","2/6","1/4","1/3","3","2/4","3","2/6","2/5","2/4","3","3","1/5","2/5","2/6","2/5","3","2/4","2/4","2/4","3","3","3","2/6","2/6","1/3","3","3","1/3","2/6","2/5","2/5","2/6","2/5","2/4","3","2/5","3","3","3","2/4","3","2/6","3","2/4","2/4","1/3","2/5","1/5","1/5","3","4","2/7","3","2/6","3","3"]
["Surfing","Athletic","Ag/Sd","3","2/7","3","2/6","3/7","2/5","2/7","6","2/6","2/7","2/6","2/7","2/6","3","2/6","5","2/6","1/3","1/4","2/7","2/7","3/7","2/6","2/5","2/7","3","2/7","6","2/6","2/7","2/6","3","2/7","2/7","2/7","3/7","3","3/5","2/6","2/7","1/4","3/7","3/7","2/6","2/6","4/12","2/6","2/6","2/6","2/7","3","2/6","3","3/5","3/7","2/7","2/5","2/7","3/7","2/7","2/7","2/6","2/5","2/5","2/5","3/7","6","2/6","3","2/6","3","3"]
["Swimming","Athletic","Ag","3","2/6","3","2/5","3","1/3","2/6","2/5","2/5","2/6","2/6","3","3","3","3","3","2/6","2/5","1/5","3","2/6","3","1/5","2/5","2/6","3","3","2/5","2/5","2/7","2/5","3","1/3","2/6","3","3","3","3","2/6","2/5","3","3","3","3","2/6","2/5","3","2/6","2/5","3/7","3","1/2","3","3","3","2/6","3","2/6","3","2/6","2/6","1/3","2/5","1/5","1/5","3","5","2/6","3","3","3","3"]
["AirBorne Combat","Combat","Ag/Qu","18","2/6","18","3/6","20","3/6","3/6","3/6","3/6","2/6","3/6","2/6","20","18","2/6","20","3/6","6","12","20","4","20","3/8","3/6","2/6","18","20","3/6","2/3","3/6","3/6","18","4/9","1/3","2/6","18","18","8","3/6","3/6","12","20","18","18","2/6","5","3/6","3/6","3/6","2/6","20","3/6","20","15","18","2/6","20","3/6","20","2/6","2/6","3/6","5","3/6","3/6","20","2/6","3/6","20","3/6","18","18"]
["Brawling","Combat","St/Ag/Eq","18","2/6","18","2/7","18","2/5","5","1/4","2/6","2/6","2/7","3/7","7","18","2/6","20","5","3/5","5","5","2/6","18","3/8","2/6","2/6","18","18","2/6","1/5","5","1/5","18","1/3","2/6","1/4","18","18","8","2/6","5","5","18","18","2/7","2/6","1/5","3/6","3/7","1/5","2/6","20","1/5","18","15","18","1/3","18","5","18","2/6","4/8","2/5","2/5","1/4","2/6","15","1/3","6","18","5","18","18"]
["Closing","Combat","Qu/Ag","15","2/7","15","2/7","15","1/5","5","1/5","5","2/7","2/7","1/5","15","15","15","15","5","2/7","5","15","1/5","15","2/7","2/7","1/5","15","15","2/7","2/7","5","2/7","15","1/5","2/7","1/5","5","15","15","5","5","5","15","15","5","2/7","2/7","2/7","5","1/5","1/5","15","2/7","2/7","15","15","2/7","15","5","15","1/5","2/7","2/7","2/7","1/2/2","1/5","15","1/5","2/7","15","5","15","15"]
["Defensive Technique","Combat","none","20","2/5","20","3/7","20","1/5","6","2/6","3/7","2/7","3/8","1/5","7","20","8","12","4","5","5","8","2/5","20","4","3/7","2/5","20","20","3/8","3/8","6","3/8","20","2/5","2/5","2/7","7","20","8","8","4","5","20","20","4","3/6","2/5","3/7","3/7","3/8","2/5","10","3/8","6","15","20","2/5","7","5","20","2/5","2/5","3/8","3/8","4/8","6","20","1/5","3/7","20","3/7","15","15"]
["Defensive Weaving","Combat","None","20","2/5","20","3/7","20","1/5","6","2/6","3/7","2/7","2/5","1/5","7","20","8","12","4","5","5","8","2/5","20","4","3/7","2/5","20","20","3/8","3/8","6","3/8","20","2/5","2/5","2/7","7","20","8","8","3/7","5","20","20","4","3/6","2/5","3/7","3/7","2/5","2/5","10","2/5","6","15","20","2/5","7","5","20","2/5","2/5","2/5","3/8","4/8","6","20","1/5","3/7","20","3/7","15","15"]
["Disarm, Armed","Combat","Ag/Eq","6","2/5","6","2/5","6","2/5","5","3/6","2/5","2/5","2/5","2/5","5","6","2/6","9","4","3/6","5","5","1/3","6","3/8","4","2/5","6","7","1/3","2/5","5","2/5","5","2/5","2/5","2/5","6","6","6","3","5","5","6","6","2/5","2/6","2/5","2/5","3/6","2/5","2/5","9","2/5","7","6","6","2/5","7","5","6","1/3","2/5","2/5","4","2/3","2/3","5","2/5","4","5","2/5","6","6"]
["Disarm, Unarmed","Combat","Ag/Eq","9","3/6","9","3/6","8","3/8","6","3/6","3/6","3/6","3/6","3/6","7","9","3/6","9","5","2/5","4","7","2/4","8","3/8","6","3/6","9","9","2/4","3/6","6","3/6","9","3/6","3/6","3/6","9","9","3","2/4","6","4","8","9","3/7","2/6","3/6","3/7","5","3/6","3/6","9","3/6","6","3","9","3/6","9","6","8","3/6","3/6","3/6","5","1/5","1/5","7","3/6","6","7","3/6","9","9"]
["Distract Foe","Combat","Ag/Qu","9","3/7","6","3/7","6","3/7","3","1/2","3/7","3/7","3/7","3/7","6","9","4","9","3/7","1/5","2/5","6","3/7","6","3/8","3/8","3/7","9","6","1/2","3/7","3","3/7","9","2/4","3/7","3/7","5","9","3","2/5","3","2/5","6","9","3/7","3/6","3/7","6","4","3/7","4","4","3/7","3","3","8","3/7","6","4","9","3/7","3/7","3/7","3/7","1/3","1/3","9","3/6","3/8","8","4","9","9"]
["Donning/Doffing Chain","Combat","Ag/Qu",10,"2/*","10","4/*","6/*","5/*","3/*","6/*","4/*","3/*","10","2/*","10","10","6/*","15","3/*","3/*","9/*","10","5/*","8/*","6/*","3/*","2/*","10","10","3/*","2/*","3/*","2/*","10","1/*","2/*","2/*","4/*","10","6/*","10","4/*","9/*","6/*","10","4/*","3/*","2/*","2/*","3/*","2/*","5/*","6/*","4/*","5/*","6/*","10","2/*","10","4/*","10","2/*","2/*","3/*","4/*","1/*","10","6/*","1/*","3/*","10","3/*","10","10"]
["Donning/Doffing Plate","Combat","Ag/Qu",11,"2/*","11","7/*","7/*","7/*","5/*","10","6/*","4/*","10","2/*","11","11","9/*","20","4/*","15","20","11","7/*","9/*","7/*","4/*","2/*","20","11","5/*","3/*","5/*","3/*","11","2/*","2/*","2/*","5/*","11","7/*","11","5/*","20","7/*","11","6/*","4/*","3/*","3/*","4/*","3/*","7/*","7/*","7","7/*","7/*","11","2/*","11","8","11","2/*","2/*","4/*","5","10","10","7/*","1/*","4/*","11","4/*","11","11"]
["Donning/Doffing RL","Combat","Ag/Qu",9,"1/*","9","1/*","5/*","3/*","2/*","1/*","2/*","1/*","9","1/*","2/*","9","3/*","12","2/*","9","7/*","1/*","3/*","7/*","3/*","2/*","1/*","9","3/*","2/*","1/*","2/*","1/*","9","1/*","1/*","1/*","3/*","9","5/*","9","3/*","7/*","5/*","9","2/*","2/*","1/*","1/*","2/*","1/*","3/*","5/*","1/*","4/*","5/*","9","1/*","2/*","2/*","9","1/*","1/*","2/*","2/*","1/*","9","4/*","1/*","2/*","9","2/*","9","9"]
["Donning/Doffing SL","Combat","Ag/Qu",9,"1/*","9","1/*","4/*","2/*","2/*","1/*","2/*","1/*","9","1/*","1/*",9,"2/*",10,"1/*","2/*","5/*","1/*","2/*","6/*","2/*","2/*","1/*",9,"2/*","2/*","1/*","2/*","1/*",9,"1/*","1/*","1/*","2/*",9,"4/*","9","2/*","5/*","4/*",9,"2/*","1/*","1/*","1/*","1/*","1/*","2/*","4/*","1/*","3/*","4/*",9,"1/*","1/*","1/*",9,"1/*","1/*","1/*","2/*","1/*","9","4/*","1/*","2/*",9,"1/*",9,9]
["Expertise","Combat","none","20","6","20","6","20","3/8","15","3/8","6","6","9","3/8","9","20","20","20","6","10","15","9","3/8","20","20","9","4/9","20","20","8","6","15","6","20","4/9","5","5","15","20","20","15","9","15","20","20","9","7","6","6","9","6","8","20","6","20","20","20","5","9","10","20","2/5","5","6","6","4/9","15","20","4/9","9","20","9","20","20"]
["Feinting","Combat","Qu/Pr","6","2/5","6","2/5","6","2/5","5","3/6","2/5","2/5","2/5","2/5","5","6","2/6","9","4","3/6","5","5","1/3","6","3/8","4","2/5","6","7","1/3","2/5","5","2/5","5","2/5","2/5","1/4","6","6","6","3","2/5","5","6","6","2/5","2/6","2/5","2/5","4","2/5","2/5","9","2/5","7","6","6","2/5","7","5","6","1/3","2/5","1/4","4","2/3","2/3","5","2/5","4","5","4","6","6"]
["Grappling Hook","Combat","Ag","3","2/6","3","1/5","3","2/6","2/5","2/5","2/6","2/6","1/3","2/6","2/5","3","2/6","2/4","2/5","2/4","3","2/5","4","5","3/8","2/6","2/6","3","2/6","2/5","1/5","2/5","1/5","3","2/6","2/6","2/6","2/6","3","3","2/4","2/5","3","3","2/6","1/3","2/6","1/5","2/6","2/5","1/5","2/6","3","1/5","2/4","3","2/6","2/6","2/6","2/5","3","2/6","2/6","1/3","1/4","2/5","2/5","3","2/6","3/6","3/8","2/5","3","3"]
["Honing","Combat","Ag/Em","20","2/5","20","3/7","20","2/5","6","1/5","4","2/7","3/8","2/5","7","20","8","12","4","5","5","8","6","20","4","2/5","2/5","20","20","3/8","3/8","6","3/8","20","2/5","2/5","3/7","7","20","8","8","4","5","20","20","6","3/6","3/8","3/8","4","3/8","2/5","10","3/8","6","15","20","2/5","7","5","20","2/5","2/5","3/8","3/8","4/8","6","20","1/5","3/8","20","4","15","15"]
["Iai","Combat","Qu/Eq","15","1/3","18","2/5","20","3/6","3/5","5","2/6","2/6","1/5","2/7","9","15","2/6","20","2/6","2/5","2/5","9","1/5","20","3/8","2/7","2/7","15","20","1/5","3/8","3/5","2/4","15","1/5","2/7","2/7","15","15","6","2/4","3/5","2/5","20","15","3/7","2/6","2/5","2/5","2/6","2/5","2/7","15","2/5","10","6","15","1/4","20","3/5","20","1/4","2/7","2/7","6","2/6","2/6","20","2/7","3/6","15","2/6","15","15"]
["Increase Wounds","Combat","Ag/St","20","3/9","20","3/9","20","2/7","10","2/7","10","3/9","3/9","2/7","20","20","20","20","10","3/9","10","20","2/7","20","3/9","3/9","2/7","20","20","3/9","3/9","10","3/9","20","2/7","3/9","2/7","10","20","20","10","10","10","20","20","10","3/9","3/9","3/9","10","2/7","2/7","20","3/9","3/9","20","20","3/9","20","10","20","2/7","3/9","3/9","3/9","2/7","2/7","20","2/7","3/9","20","10","20","20"]
["Instinctive Maneuver","Combat","Qu/Em","6","2/6","6","3/6","7","3/6","5","5","3/6","2/6","3/6","1/5","5","6","2/6","9","4","4","4","4","2/6","7","3/8","2/6","2/6","6","7","2/5","3/6","5","3/6","6","2/6","2/6","2/6","6","6","6","3/6","5","4","7","6","3/6","2/6","3/6","2/6","4","3/6","2/6","9","3/6","7","6","6","2/5","5","5","7","2/6","2/6","2/6","5","2/6","2/6","6","2/6","3/7","7","2/5","6","6"]
["Lancing","Combat","St/Ag","18","2/6","18","3/6","20","3/6","3/6","3/6","3/6","2/6","3/6","2/6","20","18","2/6","20","3/6","6","12","20","4","20","3/8","5","2/6","18","20","3/6","2/3","3/6","3/6","18","4/9","1/3","2/6","18","18","8","3/6","3/6","12","20","18","18","2/6","5","3/6","3/6","3/6","2/6","20","3/6","20","15","18","2/6","20","3/6","20","2/6","2/6","3/6","5","3/6","3/6","20","2/6","3/6","20","3/6","18","18"]
["MA Strikes","Combat","St/St/Ag","9","3/7","6","2/5","6","2/5","3","1/2","3/7","3/7","3/7","3/7","6","9","4","9","2/5","1/5","2/5","6","3/7","6","3/8","3/7","3/7","9","6","1/2","3/7","3","3/7","9","2/5","3/7","3/7","5","9","3","2/5","3","2/5","6","9","3/7","3/6","3/7","3/7","3/7","3/7","4","4","2/5","3","3","8","2/5","6","4","9","3/7","3/7","3/7","3/7","1/3","1/3","9","3/6","3/8","8","4","9","9"]
["MA Sweeps","Combat","St/Ag/Ag","9","3/7","6","2/5","6","2/5","3","1/2","3/7","3/7","3/7","3/7","6","9","4","9","2/5","1/5","2/5","6","3/7","6","3/8","3/7","3/7","9","6","1/2","3/7","3","3/7","9","2/5","3/7","3/7","5","9","3","2/5","3","2/5","6","9","3/7","3/6","3/7","3/7","3/7","3/7","4","4","2/5","3","3","8","2/5","6","4","9","3/7","3/7","3/7","3/7","1/3","1/3","9","3/6","3/8","8","4","9","9"]
["Man. Chain","Combat","St",10,"2/*","10","4/*","6/*","5/*","3/*","6/*","4/*","3/*","10","2/*","10","10","6/*","15","3/*","3/*","9/*","10","5/*","8/*","6/*","3/*","2/*","10","10","3/*","2/*","3/*","2/*","10","1/*","2/*","2/*","4/*","10","6/*","10","4/*","9/*","6/*","10","4/*","3/*","2/*","2/*","3/*","2/*","5/*","6/*","4/*","5/*","6/*","10","2/*","10","4/*","10","2/*","2/*","3/*","4/*","1/*","10","6/*","1/*","3/*","10","3/*","10","10"]
["Man. Plate","Combat","St",11,"2/*","11","7/*","7/*","7/*","5/*","10","6/*","4/*","10","2/*","11","11","9/*","20","4/*","15","20","11","7/*","9/*","7/*","4/*","2/*","20","11","5/*","3/*","5/*","3/*","11","2/*","2/*","2/*","5/*","11","7/*","11","5/*","20","7/*","11","6/*","4/*","3/*","3/*","4/*","3/*","7/*","7/*","7","7/*","7/*","11","2/*","11","8","11","2/*","2/*","4/*","5","10","10","7/*","1/*","4/*","11","4/*","11","11"]
["Man. Rigid L","Combat","Ag",9,"1/*","9","1/*","5/*","3/*","2/*","1/*","2/*","1/*","9","1/*","2/*","9","3/*","12","2/*","9","7/*","1/*","3/*","7/*","3/*","2/*","1/*","9","3/*","2/*","1/*","2/*","1/*","9","1/*","1/*","1/*","3/*","9","5/*","9","3/*","7/*","5/*","9","2/*","2/*","1/*","1/*","2/*","1/*","3/*","5/*","1/*","4/*","5/*","9","1/*","2/*","2/*","9","1/*","1/*","2/*","2/*","1/*","9","4/*","1/*","2/*","9","2/*","9","9"]
["Man. Soft L","Combat","Ag",9,"1/*","9","1/*","4/*","2/*","2/*","1/*","2/*","1/*","9","1/*","1/*",9,"2/*",10,"1/*","2/*","5/*","1/*","2/*","6/*","2/*","2/*","1/*",9,"2/*","2/*","1/*","2/*","1/*",9,"1/*","1/*","1/*","2/*",9,"4/*","9","2/*","5/*","4/*",9,"2/*","1/*","1/*","1/*","1/*","1/*","2/*","4/*","1/*","3/*","4/*",9,"1/*","1/*","1/*",9,"1/*","1/*","1/*","2/*","1/*","9","4/*","1/*","2/*",9,"1/*",9,9]
["Melee Scuffle","Combat","St/Ag","8","1/4","8","2/5","8","1/2","2/7","1/2","2/7","1/4","1/4","1/2","8","8","8","8","2/7","1/4","2/7","2/7","1/4","8","1/4","2/5","1/2","8","8","1/4","1/4","2/7","2/5","8","1/2","1/4","1/2","2/7","8","8","2/7","2/7","2/7","8","8","2/7","1/4","1/4","1/4","2/5","1/2","1/2","8","1/4","1/4","8","8","1/4","8","2/7","8","1/2","1/4","2/5","1/4","1/2","2/4","8","1/2","2/7","8","1/4","8","8"]
["Missile Artillery","Combat","In/Ag","3/6","1/3","3/6","1/4","2/7","2/4","2/5","1/4","2/5","1/3","1/4","1/3","3/6","3/6","3/6","3","2/5","2/5","3/7","3/7","20","4/7","3/8","1/4","1/3","3/6","4","1/4","1/4","2/5","1/4","3/6","2/6","1/3","1/3","3/6","3/6","3/6","2/5","2/5","3/7","2/7","3/6","2/5","3/6","4/8","1/4","2/5","1/4","1/3","3","1/4","2/5","3/7","3/6","1/3","4","2/5","2/7","1/3","1/3","1/4","3/6","1/5","1/5","3/7","1/3","2/5","4","2/5","3/6","3/6"]
["Moving Strike","Combat","Ag/Sd","20","2/7","20","3/7","20","3/8","5","2/4","3/7","2/7","3/5","2/7","20","20","2/6","20","3/7","3/7","3/9","15","20","20","3/8","3/8","2/7","20","20","2/4","3/7","5","3/7","20","2/7","2/7","2/7","20","20","20","3/7","5","3/9","20","20","4","2/6","3/7","3/7","3/7","3/7","2/7","20","3/7","20","20","20","2/7","20","5","20","1/4","2/7","4","4","2/6","2/6","20","2/7","3/8","20","3/7","20","20"]
["Restr. Area Combat","Combat","none","9","3/8","9","1/2","9","2/5","6","3/8","3","2/6","1/3","9","9","7","3/9","9","2/5","2/5","3","6","7","6","3/8","3","3/8","9","9","2/5","2/5","3","2/5","5","3/8","3/8","4","6","9","9","4","4","6","4","9","3","3/6","2/5","9","3","2/5","7","9","2/5","3/9","9","8","3/8","9","3","9","3/8","3/8","1/3","4","1/2","3/9","6","4","3","9","3","9","9"]
["Reverse Stroke","Combat","Ag/Re","20","2/7","20","3/7","20","3/8","5","2/4","3/7","2/7","3/5","2/7","20","20","2/6","20","3/7","3/7","3/9","15","20","20","3/8","3/8","2/7","20","20","2/4","3/7","5","3/7","20","2/7","2/7","2/7","20","20","20","3/7","5","3/9","20","20","4","2/6","3/7","3/7","3/7","3/7","2/7","20","3/7","20","20","20","2/7","20","5","20","1/4","2/7","4","4","2/6","2/6","20","2/7","3/8","20","3/7","20","20"]
["SeaBorn Combat","Combat","Ag/Ag/Me","3","1/4",3,"2/5","3","1/4","2/5","6","1/3","1/4","1/4","1/4","2/5","3","2/6","4","2/4","3/7","3/9","2/7","1/4","3","2/6","2/5","1/4","3","2/6","1/4","2/7","2/5","2/4","3","2/4","2/7","1/4","3","3","3","2/4","2/5","3/9","3","3","1/4","2/6","1/3","2/4","2/4","1/3","1/4","5","1/3","3","3","3","1/4","2/4","2/5","3","1/4","2/4","2/4","1/4","2/4","2/4","3","2/4","2/5","3","2/4","3","3"]
["Shield Bash","Combat","St/St/Ag","20","2/5","20","3/7","20","1/4","6","1/5","2/5","2/5","3/8","1/4","7","20","8","12","4","5","5","8","1/4","20","4","3/7","2/5","20","20","3/8","3/8","6","3/8","20","2/5","2/5","2/5","7","20","8","8","4","5","20","20","6","3/6","2/7","2/7","4","2/5","2/5","10","3/8","6","15","20","2/5","7","5","20","2/5","2/5","3/8","3/8","1/3","6","20","1/5","2/5","20","2/5","15","15"]
["Shield Expertise","Combat","None","20","5","20","9","20","6","15","6","6","4","9","3/8","9","20","20","20","9","10","15","9","3/8","20","20","6","3/8","20","20","10","6","15","9","20","4/8","5","6","15","20","20","15","9","15","20","20","15","7","6","5","9","6","8","20","6","20","20","20","5","9","10","20","3/8","3/8","6","6","3/8","15","20","3/8","6","20","6","20",15]
["Shield Skill","Combat","none","20","2/5","20","3/7","20","2/5","6","4","3/8","2/7","3/8","1/4","7","20","8","12","4","5","5","8","2/4","20","4","2/7","2/5","20","20","3/8","3/8","6","3/8","20","2/5","2/5","2/5","7","20","8","8","4","5","20","20","6","3/6","2/7","2/7","2/7","2/7","2/5","10","2/7","6","15","20","2/5","7","5","20","2/5","2/5","3/8","3/8","1/5","6","20","1/5","3/8","20","3/8","15","15"]
["Spell Deflection","Combat","In/Ag","6","2/6","6","3/6","7","3/6","5","5","3/6","2/6","3/6","3/7","5","6","2/6","9","4","4","4","4","2/6","7","3/8","3/7","2/6","6","7","2/5","3/6","5","3/6","6","2/6","2/6","2/6","6","6","6","3/6","5","4","7","6","3/6","2/6","3/6","3/7","4","3/6","2/6","9","3/6","7","6","6","1/3","5","5","7","2/6","2/6","3/6","5","3/6","3/6","6","2/6","3/7","7","4","6","6"]
["Stunned Maneuver","Combat","Sd","4","2/6","5","2/6","34","2/5","2/7","1/2","2/5","2/6","2/6","2/6","4","5","2/6","3","2/7","2/5","2/5","3","1/4","4","3/8","2/6","2/6","5","4","1/2","2/6","2/7","2/6","5","1/3","2/6","2/6","5","5","3","2/4","2/7","2/5","4","5","1/4","2/6","2/6","2/5","2/7","2/6","2/6","3","2/6","3","3","5","2/6","4","2/7","4","1/3","1/3","2/6","3","1/3","1/3","3","1/5","2/5","4","2/7","5","5"]
["Subduing","Combat","Ag/Qu","6","2/5","6","1/5","6","2/5","5","5","2/5","1/4","1/4","2/5","3/6","6","2/6","9","2/5","2/5","3/6","2/5","2/5","3/5","3/8","2/4","2/5","6","3/6","2/5","1/5","5","1/5","4","2/5","2/5","2/5","6","6","6","3","5","3/6","3/5","6","1/4","2/6","1/5","3/6","3/6","1/5","2/5","7","1/5","6","5","6","2/5","3/6","1/5","6","2/5","2/5","1/4","3","3","1/2","3","2/5","3/7","3/6","1/5","6","6"]
["Tackling","Combat","St/Ag","9","3/7","6","3/7","6","1/2","3","1/2","1/4","1/4","3/7","1/4","6","9","4","9","3/7","1/5","2/5","6","3/7","6","3/8","2/7","2/5","9","6","1/2","1/5","3","3/7","9","1/3","1/4","1/4","5","9","3","2/5","3","2/5","6","9","3/7","3/6","1/5","1/4","4","1/5","4","4","2/5","3","3","8","3/7","6","4","9","1/3","1/4","3/7","3/7","1/2","1/3","9","2/5","3/8","8","3/7","9","9"]
["Trick Shot","Combat","Ag/Qu","20","2/7","20","3/7","20","6","15","8","9","8","9","6","9","20","20","20","9","10","15","9","20","20","20","6","5","20","20","8","6","15","2/7","20","5","5","6","15","20","20","15","9","15","20","20","15","7","6","6","9","6","8","20","6","20","20","20","5","9","10","20","5","5","6","6","15","15","20","5","12","20","9","20","20"]
["Tumbling Attack","Combat","Ag/Qu","5","2/6","5","1/5","5","2/5","2/6","2/7","2/6","2/6","1/5","3/6","3/7","5","2/6","9","3/5","1/4","2/5","3/6","1/5","5","3/8","2/6","2/6","5","3/6","2/7","1/5","2/6","1/5","5","2/6","2/6","2/6","5","5","4","2/5","2/6","2/5","5","5","1/5","2/6","1/5","2/5","3/5","1/5","2/6","7","1/5","6","4","5","2/6","3/6","2/6","5","2/6","2/6","1/5","2/6","1/4","1/4","5","2/6","3/6","4","3/5","5","5"]
["Tumbling Evasion","Combat","Ag/Qu","3","1/5","3","1/3","3","1/4","2/5","5","1/5","1/5","1/3","3/6","2/6","3","2/6","4","2/4","1/2","1/4","2/5","1/5","3","3/8","2/5","1/5","3","2/5","2/5","1/3","2/5","1/3","3","1/5","1/5","1/5","3","3","2","1/4","2/5","1/4","3","3","1/3","2/6","1/3","2/6","2/4","1/3","1/5","3","1/3","3","2","3","1/5","2/5","2/5","3","1/5","1/5","1/3","2/5","1/2","1/2","3","1/5","2/5","3/7","2/4","3","3"]
["Two Weapon Combo","Combat","St","v","v","v","v","v","v","v","v","v","v","v","v","v","v","v","v","v","v","v","v","v","v","v","v","v","v","v","v","v","v","v","v","v","v","v","v","v","v","v","v","v","v","v","v","v","v","v","v","v","v","v","v","v","v","v","v","v","v","v","v","v","v","v","v","v","v","v","v","v","v","v","v"]
["Unarmed Expertise","Combat","Ag/St/Eq","9","3/7","6","3/7","6","2/5","3","1/2","3/7","3/7","3/7","3/7","6","9","4","9","3/7","1/5","2/5","6","3/7","6","3/8","3/8","3/7","9","6","1/2","3/7","3","3/7","9","2/4","3/7","3/7","5","9","3","1/5","3","2/5","6","9","3/7","3/6","3/7","6","4","3/7","4","4","3/7","3","3","8","2/5","6","4","9","3/7","3/7","3/7","3/7","1/3","1/3","9","3/6","3/8","8","4","9","9"]
["Unhorsing","Combat","St/St/Ag","18","2/6","18","3/6","20","3/6","3/6","3/6","3/6","2/6","3/6","2/6","20","18","2/6","20","3/6","6","12","20","4","20","3/8","3/6","2/6","18","20","3/6","2/3","3/6","3/6","18","4/9","1/3","2/6","18","18","8","3/6","3/6","12","20","18","18","2/6","5","3/6","3/6","3/6","2/6","20","3/6","20","15","18","2/6","20","3/6","20","2/6","2/6","3/6","5","3/6","3/6","20","2/6","3/6","20","3/6","18","18"]
["Weapon #1","Combat",null,"9","1/3","9","2/5","9","1/5","3/9","1/5","2/7","2/5","3/8","1/5","4/8","9","4","9","3/7","3/9","3/9","4/8","1/3","9","3/8","2/7","1/5","9","9","3/7","2/5","3/9","2/5","9","1/3","1/3","2/4","4/8","9","6","5","3/7","3/9","9","9","3/9","3/6","2/5","2/5","2/6","2/5","1/4","8","2/5","4/8","6","9","1/3","6","3/7","9","1/3","1/5","2/7","2/7","1/5","4","8","1/3","2/7","9","2/5","8","8"]
["Weapon #2","Combat",null,"20","2/5","20","3/7","20","2/5","6","1/5","3/8","2/7","3/8","2/5","7","20","8","12","4","5","5","8","6","20","4","3/8","2/5","20","20","3/8","3/8","6","3/8","20","2/5","2/5","3/7","7","20","8","8","4","5","20","20","6","3/6","3/8","3/8","3/8","3/8","2/5","10","3/8","6","15","20","2/5","7","5","20","2/5","2/5","3/8","3/8","3/7","6","20","1/5","3/8","20","3/8","15","15"]
["Weapon #3","Combat",null,"20","2/7","20","3/9","20","3/8","7","2/5","6","3/8","4","2/7","9","20","9","15","6","6","6","8","8","20","6","3/9","2/7","20","20","4","3/9","7","3/9","20","2/7","2/7","3/8","9","20","15","8","6","6","20","20","7","4","3/9","4","4","3/9","4","15","3/9","9","20","20","2/7","9","7","20","2/7","2/7","4","3/9","8","8","20","2/5","3/9","20","4","20","20"]
["Weapon #4","Combat",null,"20","2/7","20","4","20","4","7","2/5","6","4","6","2/8","9","20","9","20","6","8","6","8","8","20","15","5","2/7","20","20","8","3/9","7","3/9","20","2/7","2/7","3/9","9","20","20","8","6","6","20","20","7","5","3/9","4","4","3/9","4","20","3/9","15","20","20","2/7","9","7","20","2/7","2/7","4","4","8","8","20","2/7","5","20","4","20","20"]
["Weapon #5","Combat",null,"20","2/7","20","6","20","4","7","2/7","6","6","6","4","9","20","9","20","6","9","9","8","20","20","20","9","2/7","20","20","8","3/9","7","4","20","2/7","2/7","4","9","20","20","15","6","9","20","20","7","6","3/9","4","6","3/9","8","20","3/9","20","20","20","2/7","9","7","20","2/7","2/7","4","5","8","8","20","2/7","9","20","6","20","20"]
["Weapon #6","Combat",null,"20","5","20","9","20","6","15","3/8","9","8","9","6","9","20","20","20","9","10","15","9","20","20","20","12","5","20","20","8","6","15","6","20","5","5","6","15","20","20","15","9","15","20","20","15","7","6","6","9","6","8","20","6","20","20","20","5","9","10","20","5","5","6","6","15","15","20","2/7","12","20","9","20","20"]
["Weapon Brawling","Combat","St/Ag/Qu","9","3/7","9","2/5","9","1/5","3/9","1/5","2/5","2/5","3/8","1/5","6","9","4","9","3/7","3/9","3/9","5","1/5","9","3/8","2/5","1/5","9","9","3/7","2/5","3/9","2/5","9","1/5","1/5","2/4","5","9","6","5","3/9","3/9","9","9","3/9","3/6","2/5","2/5","3/7","2/5","1/4","8","2/5","4/8","6","9","2/5","6","3/7","9","1/5","1/5","2/7","2/7","1/3","4","8","1/4","2/7","9","2/5","8","8"]
["Weapon Bugei","Combat","St/St/Ag","9","3/7","6","3/7","6","3/7","3","1/2","3/7","3/7","3/7","3/7","6","9","4","9","3/7","1/5","2/5","6","3/7","6","3/8","3/8","3/7","9","6","1/2","3/7","3","3/7","9","2/4","3/7","3/7","5","9","3","2/5","3","2/5","6","9","3/7","3/6","3/7","6","4","3/7","4","4","3/7","3","3","8","3/7","6","4","9","3/7","3/7","3/7","3/7","1/3","1/3","9","3/6","3/8","8","4","9","9"]
["Weapon Casting","Combat","St/St/Ag","10","2/6","10","2/6","10","1/5","3/9","1/5","3/9","2/6","2/6","1/5","10","10","10","10","3/9","2/6","3/9","10","1/5","10","2/6","2/6","1/5","10","10","2/6","2/6","3/9","2/6","10","1/5","2/6","1/5","3/9","10","10","3/9","3/9","3/9","10","10","3/9","2/6","2/6","2/6","3/9","1/5","1/5","10","2/6","2/6","10","10","2/6","10","3/9","10","1/5","2/6","2/6","2/6","1/5","1/5","10","1/5","2/6","10","3/9","10","10"]
["Weapon Kata","Combat","St/Ag/Qu","9","3/7","6","3/7","6","2/5","3","1/2","3/7","3/7","3/7","3/7","6","9","4","9","3/7","1/5","2/5","6","3/7","6","3/8","3/8","3/7","9","6","1/2","3/7","3","3/7","9","2/4","3/7","3/7","5","9","3","2/5","3","2/5","6","9","3/7","3/6","3/7","6","4","3/7","4","4","3/7","3","3","8","2/5","6","4","9","3/7","3/7","3/7","3/7","1/3","1/3","9","3/6","3/8","8","4","9","9"]
["Weapon Shatter","Combat","St/St/Ag","10","2/6","10","2/6","10","1/5","3/9","1/5","3/9","2/6","2/6","1/5","10","10","10","10","3/9","2/6","3/9","10","1/5","10","2/6","2/6","1/5","10","10","2/6","2/6","3/9","2/6","10","1/5","2/6","1/5","3/9","10","10","3/9","3/9","3/9","10","10","3/9","2/6","2/6","2/6","3/9","1/5","1/5","10","2/6","2/6","10","10","2/6","10","3/9","10","1/5","2/6","2/6","2/6","1/5","1/5","10","1/5","2/6","10","3/9","10","10"]
["Weapon Snare","Combat","Qu/Ag","6","2/5","6","2/5","6","2/5","5","3/6","2/5","2/5","2/5","2/5","5","6","2/6","9","4","3/6","5","5","1/3","6","3/8","4","2/5","6","7","1/3","2/5","5","2/5","5","2/5","2/5","2/5","6","6","6","3","5","5","6","6","2/5","2/6","2/5","2/5","4","2/5","2/5","9","2/5","7","6","6","2/5","7","5","6","1/3","2/5","2/5","4","2/3","2/3","5","2/5","4","5","4","6","6"]
["Weapon Trickery","Combat","Qu/Ag","9","1/3","9","2/5","9","1/5","3/9","1/5","3/7","2/5","3/8","1/5","6","9","4","9","3/7","3/9","3/9","5","1/3","9","3/8","2/7","1/5","9","9","3/7","2/5","3/9","2/5","9","1/3","1/3","2/4","5","9","6","5","3/9","3/9","9","9","3/9","3/6","2/5","2/5","3/7","2/5","1/4","8","2/5","4/8","6","9","1/3","6","3/7","9","1/3","1/5","2/7","2/7","2/4","4","8","1/4","2/7","9","3/7","8","8"]
["Weapon Use","Combat","St/Ag","20","3/9","20","3/9","20","2/7","10","2/7","10","3/9","3/9","2/7","20","20","20","20","10","3/9","10","20","2/7","20","3/9","3/9","2/7","20","20","3/9","3/9","10","3/9","20","2/7","3/9","2/7","10","20","20","10","10","10","20","20","10","3/9","3/9","3/9","10","2/7","2/7","20","3/9","3/9","20","20","3/9","20","10","20","2/7","3/9","3/9","3/9","2/7","2/7","20","2/7","3/9","20","10","20","20"]
["Wrestling","Combat","St/Ag","9","3/7","6","3/7","6","3/7","3","1/2","3/7","3/7","3/7","3/7","6","9","4","9","3/7","1/5","2/5","6","3/7","6","3/8","3/8","3/7","9","6","1/2","3/7","3","3/7","9","2/4","3/7","3/7","5","9","3","2/5","3","2/5","6","9","3/7","3/6","3/7","6","4","3/7","4","4","3/7","3","3","8","3/7","6","4","9","3/7","3/7","3/7","3/7","1/3","1/3","9","3/6","3/8","8","4","9","9"]
["Yado","Combat","Qu/Ag","6","2/6","6","3/6","7","3/6","5","5","3/6","2/6","3/6","3/7","5","6","2/6","9","4","4","4","4","2/6","7","3/8","3/7","2/6","6","7","2/5","3/6","5","3/6","6","2/6","2/6","2/6","6","6","6","3/6","5","4","7","6","3/6","2/6","3/6","3/7","4","3/6","2/6","9","3/6","7","6","6","1/3","5","5","7","2/6","2/6","3/6","5","3/6","3/6","6","2/6","3/7","7","4","6","6"]
["Adrenal Defense","Concentration","None","20","20","15","10","15","6","15","12","15","20","7","20","20","20","20","20","15","3/8","3","20","6","15","20","12","12","20","20","2/6","20","15","20","20","10","20","20","20","20","15","6","10","20","15","20","7","15","20","20","20","15","20","15","20","18","15","20","12","20","20","20","20","20","10","20","3/7","3/7","15","20","20","20","20","20","20"]
["AM Balance","Concentration","Ag/Sd","6","1/3","5","2/4","5","2/4","2/7","2/4","2/7","2/7","1/3","3/8","5","6","5","5","2/6","1/2","1/4","5","1/4","5","5","3/7","2/6","6","5","1/3","2/6","2/7","2/6","6","2/5","1/3","3","4","6","3","2/4","2/5","3/7","5","5","2/4","2/6","2/6","3/7","2/7","2/5","2/6","7","1/4","5","3","5","2/6","5","2/7","5","2/6","2/6","2/6","2/6","1/3","1/3","5","5","3/7","5","2/7","6","6"]
["AM Landing","Concentration","Ag/Sd","6","2/6","5","2/4","5","2/4","2/7","2/4","2/7","2/7","1/3","3/8","5","6","5","5","2/6","1/2","1/4","5","1/4","5","5","3/7","2/6","6","5","1/3","2/6","2/7","2/6","6","2/5","2/6","3","4","6","3","2/4","2/5","3/7","5","5","2/4","2/6","2/6","3/7","2/7","2/5","2/6","7","2/6","5","3","5","2/6","5","2/7","5","2/6","2/6","2/6","2/6","1/3","1/3","5","5","3/7","5","2/7","6","6"]
["AM Leaping","Concentration","Ag/Sd","6","2/6","5","2/4","5","2/4","2/7","2/4","2/7","2/7","1/3","3/8","5","6","5","5","2/6","1/3","1/4","5","1/4","5","5","3/7","2/6","6","5","1/3","2/6","2/7","2/6","6","2/5","2/6","3","4","6","3","2/4","2/5","3/7","5","5","2/4","2/6","2/6","3/7","2/7","2/5","2/6","8","2/4","5","3","5","2/6","5","2/7","5","2/6","2/6","2/6","2/6","1/3","1/3","5","5","3/7","5","2/7","6","6"]
["AM Quickdraw","Concentration","Ag/Eq","4","1/3","5","1/4","3","1/4","2/4","2/4","1/4","2/4","1/2","2/4","3","4","5","3","2/6","1/4","1/4","3","1/4","3","2/4","2/4","2/4","6","3","1/2","2/4","2/7","2/4","4","1/3","2/4","2/6","4","4","3","1/4","2/4","3/7","3","3","1/4","2/4","2/6","2/4","2/4","2/4","2/4","7","2/4","4","3","3","1/3","3","2/4","3","1/2","2/4","2/4","2/4","1/2","1/2","3","2/4","2/4","3","2/4","6","6"]
["AM Speed","Concentration","Ag/Sd","6","2/6","5","2/4","5","2/4","2/7","2/4","2/7","2/7","1/3","3/8","5","6","5","5","2/6","1/3","1/3","5","1/4","5","5","3/7","2/6","6","5","1/3","2/6","2/7","2/6","6","2/5","2/6","2/6","4","6","3","2/4","2/5","3/7","5","5","2/4","2/6","2/6","3/7","2/7","2/5","2/6","7","2/4","5","3","5","2/6","5","2/7","5","2/6","2/6","2/6","2/6","1/3","1/3","5","2/6","3/7","5","2/7","6","6"]
["AM Strength","Concentration","Ag/Sd","6","2/6","5","3/8","5","2/4","2/7","2/4","2/7","2/7","1/3","2/5","5","6","5","5","2/6","1/5","1/5","5","1/4","5","5","3/7","2/6","6","5","1/3","2/6","2/7","2/6","6","1/3","2/6","2/6","4","6","3","2/4","2/5","3/7","5","5","2/4","2/6","2/6","3/7","2/7","2/5","2/6","8","2/6","5","3","5","2/6","5","2/7","5","2/6","2/6","2/6","2/6","1/3","1/3","5","1/3","3/7","5","2/7","6","6"]
["Armored AD","Concentration","None","20","20","15","10","15","6","15","12","15","20","7","20","20","20","20","20","15","3/8","3","20","6","15","20","12","12","20","20","2/6","20","15","20","20","10","20","20","20","20","15","6","15","20","15","20","7","15","20","20","20","20","20","15","20","18","15","20","20","20","20","20","20","20","20","20","3/7","3/7","15","20","20","20","20","20","20"]
["ASA","Concentration","Pr","6","2/6","5","3/8","5","2/4","2/7","2/4","2/7","3/6","1/3","3/8","5","6","5","5","2/6","1/3","1/3","5","1/4","5","5","3/7","2/6","6","5","1/3","2/6","2/7","2/6","6","1/3","2/6","3","4","6","3","2/4","2/7","3/7","5","5","2/4","2/6","2/6","3/9","2/7","2/6","2/6","7","2/6","5","3","5","2/6","5","2/7","5","2/6","2/6","2/6","2/6","1/3","1/3","5","5","3/7","5","2/7","6","6"]
["Blind Fight. Intuition","Concentration","In","25","15","25","15","25","8","25","8","25","15","15","8","25","25","25","25","25","15","25","25","8","25","15","15","8","25","25","15","15","25","15","25","8","15","8","25","25","25","25","25","25","25","25","25","15","15","15","25","8","8","25","15","15","25","25","15","25","25","25","8","15","15","15","8","8","25","8","15","25","25","25","25"]
["Blind Fight. Smell","Concentration","Re/In","20","3/9","20","3/9","20","2/7","10","2/7","10","3/9","3/9","2/7","20","20","20","20","10","3/9","10","20","2/7","20","3/9","3/9","2/7","20","20","3/9","3/9","10","3/9","20","2/7","3/9","2/7","10","20","20","10","10","10","20","20","10","3/9","3/9","3/9","10","2/7","2/7","20","3/9","3/9","20","20","3/9","20","10","20","2/7","3/9","3/9","3/9","2/7","2/7","20","2/7","3/9","20","10","20","20"]
["Blind Fight. Touch","Concentration","Re/Em","25",6,"25",6,"25","4/10","20","4/10","20",6,6,"4/10","25","25","25","25","20",6,"20","25","4/10","25",6,6,"4/10","25","25",6,6,"20",6,"25","4/9",6,"4/10","20","25","25","20","20","20","25","25","20",6,6,6,"20","4/10","4/10","25",6,6,"25","25",6,"25","20","25","4/10",6,6,6,"4/10","4/10","25","4/10",6,"25","20","25","25"]
["Blind Fighting","Concentration","Re/Em","10","2/6","10","2/6","10","1/5","3/9","1/5","3/9","2/6","2/6","1/5","10","10","10","10","3/9","2/6","3/9","10","1/5","10","2/6","2/6","1/5","10","10","2/6","2/6","3/9","2/6","10","1/5","2/6","1/5","3/9","10","10","3/9","3/9","3/9","10","10","3/9","2/6","2/6","2/6","3/9","1/5","1/5","10","2/6","2/6","10","10","2/6","10","3/9","10","1/5","2/6","2/6","2/6","1/5","1/5","10","1/5","2/6","10","3/9","10","10"]
["Body Damage Stabilization","Concentration","Sd/Em","3/5","3/8","3","3/7","2/5","3/6","2/5","2/6","2/5","1/4","2/5","1/4","1/4","2/6","3/6","3/7","1/4","3/6","1/5","2/4","1/4","3/6","3/6","3/6","3/8","3/5","1/2","1/4","3/7","2/5","3/7","3/5","3/8","3/8","3/8","2/5","3/5","1/4","1/3","3/7","2/6","1/3","2/5","1/3","3/6","3/7","1/5","1/4","3/7","3/8","3/5","3/7","3/6","1/3","2/5","3/8","1/2","2/5","2/5","3/8","3/8","3/6","3/8","1/4","1/4","1/4","2/7","3/6","2/4","1/4","3/5","3/5"]
["Body Rigidity","Concentration","Sd","20","20","15","15","15","6","15","15","15","20","7","20","20","20","20","20","20","3/8","3","20","6","15","20","20","20","20","20","2/6","20","15","20","20","10","20","20","20","20","15","6","15","20","15","20","7","15","20","20","20","20","20","15","20","18","15","20","20","20","20","20","20","20","20","20","3/7","3/7","15","20","20","20","20","20","20"]
["Control Lycantrophy","Concentration","Sd","3/6","2/6","1/3","2/6","2/5","2/4","2/6","2/6","2/6","2/6","1/3","2/6","1/4","1/5","2/6","2/6","1/4","2/6","1/3","2/4","2/6","1/3","2/6","2/6","2/6","1/4","1/2","1/3","4/12","2/6","2/6","2/4","2/6","2/6","2/6","2/4","1/4","1/4","2/6","2/6","1/3","1/3","2/4","2/6","2/6","4/12","1/4","2/6","2/6","2/6","3/7","2/6","3/7","1/2","2/4","2/6","1/2","2/6","2/5","2/6","2/6","2/6","2/6","1/3","1/3","1/2","6","2/6","2/4","2/6","2/4","2/4"]
["Directed Strength","Concentration","Sd","6","2/6","6","3/6","7","3/6","5","5","3/6","2/6","3/6","3/7","5","6","2/6","9","4","4","4","4","2/6","7","3/8","3/7","2/6","6","7","2/5","3/6","5","3/6","6","2/6","2/6","2/6","6","6","6","3/6","5","4","7","6","3/6","2/6","3/6","3/7","4","3/6","2/6","9","3/6","7","6","6","1/3","5","5","7","2/6","2/6","3/6","5","3/6","3/6","6","2/6","3/7","7","4","6","6"]
["Dowsing","Concentration","Em","2/5","3/7","1/3","3/6","2/5","2/5","2/5","2/6","3/7","2/4","3/6","3/7","2/4","2/5","2/6","1/4","2/4","3/6","2/4","1/2","3/7","3/7","2/6","3/7","3/7","1/3","2/5","2/5","6","2/5","3/6","2/5","3/7","3/7","3/7","2/5","1/3","2/4","2/4","3/6","2/7","1/4","2/5","3/5","2/6","3/6","3/6","2/4","3/6","3/7","3/6","3/6","3/6","1/4","2/5","3/7","1/5","2/5","1/4","3/7","3/7","3/5","3/5","2/5","2/5","3/6","6","3/7","2/6","2/4","1/3","1/3"]
["Focus","Concentration","Sd","18","2/6","18","3/6","20","3/6","3/6","3/6","3/6","2/6","3/6","2/6","20","18","2/6","20","3/6","6","12","20","4","20","3/8","3/6","2/6","18","20","3/6","2/3","3/6","3/6","18","4/12","1/3","2/6","18","18","8","3/6","3/6","12","20","18","18","2/6","5","3/6","3/6","3/6","2/6","20","3/6","20","15","18","2/6","20","3/6","20","2/6","2/6","3/6","5","3/6","3/6","20","2/6","3/6","20","3/6","18","18"]
["Frenzy","Concentration","Em/Sd","6","4/9","5","2/6","5","1/5","2/6","1/2","2/6","4","2/6","2/6","3","5","2/6","9","3","2/5","1/3","3","4","3","2/6","5","2/6","5","3","2/5","2/6","2/6","5","5","2/6","2/6","2/6","4","5","2/4","2/6","2/6","1/3","3","4","2/6","2/6","3/6","4","4","2/6","2/6","8","2/6","6","6","4","2/6","3","2/6","3/6","2/6","4/9","3/6","2/5","2/6","2/6","1/5","3/6","5","5","4","5","5"]
["Meditation Cleansing","Concentration","Sd/Em","2/4","3/8","1/2","2/4","2/4","3/5","2/6","2/6","3/6","1/4","3/6","3/8","1/2","2/4","2/6","1/4","1/2","3/6","1/3","2/4","3/8","2/4","2/6","1/4","3/8","2/4","1/2","2/5","3/7","2/6","3/7","2/4","6","3/8","3/8","2/4","2/4","1/3","1/2","3/7","1/3","2/4","2/4","3/6","2/6","3/7","1/2","1/4","3/7","3/8","1/4","3/7","2/4","1/2","2/4","3/8","1/3","2/6","2/4","3/8","2/4","3/6","4","2/5","2/5","2/4","6","1/4","1/4","1/4","2/4","2/4"]
["Meditation Death","Concentration","Sd/Pr","1/5","4","1/3","2/4","3/6","4","2/4","2/6","2/4","2/4","4","4","3/6","1/5","3/7","2/6","3/6","4","2/6","3/6","4","2/4","3/7","3/7","4","1/5","3/6","1/5","4","2/4","4","1/5","6","4","4","1/2","1/5","1/4","1/4","4","2/6","2/4","1/2","2/6","3/7","4","2/4","2/4","4","4","2/5","4","4","1/4","1/2","4","2/4","2/4","3/8","4","6","4","5","2/6","2/6","3/6","6","3/7","3/6","2/4","1/5","1/5"]
["Meditation Healing","Concentration","Sd/Em","2/4","3/7","1/5","2/4","2/4","3/7","2/4","2/6","2/5","2/4","3/6","3/7","1/2","2/4","2/6","1/4","1/2","2/6","1/4","1/3","3/7","1/3","2/6","3/7","3/7","2/4","1/2","2/5","3/6","2/4","3/6","2/4","6","3/7","3/7","3/7","2/4","1/3","1/4","3/6","1/4","1/3","3/7","3/6","2/6","3/6","2/4","2/4","3/6","3/7","1/4","3/6","2/5","1/3","3/7","3/7","1/2","2/4","2/4","3/7","3/7","3/6","2/6","2/4","2/4","1/4","6","3/7","2/4","2/4","2/4","2/4"]
["Meditation Ki","Concentration","Sd/Pr","3/5","2/8","3/5","2/4","2/4","3/7","2/5","2/6","2/6","2/5","3/6","2/8","2/4","2/6","2/6","2/5","2/4","2/7","3/7","2/6","2/8","2/6","2/6","3/7","2/8","3/5","2/4","1/4","3/7","2/5","3/7","3/5","6","2/8","2/8","2/5","3/5","1/4","1/3","3/7","3/7","2/6","2/5","3/6","2/6","3/7","1/5","2/5","3/7","2/8","2/5","3/7","2/5","1/3","2/5","2/8","2/4","2/5","3/8","2/8","2/8","3/6","4","1/5","1/5","2/5","6","3/7","2/4","2/5","3/5","3/5"]
["Meditation Sleep","Concentration","Sd/In","1/4","3/7","1/5","2/4","2/5","3/7","2/4","2/6","2/7","2/4","3/6","3/7","1/4","1/4","2/6","1/4","1/4","3/7","3/6","1/4","3/7","1/3","2/6","2/6","3/7","1/4","1/2","2/5","3/6","2/4","3/6","1/4","6","3/7","3/7","1/4","1/4","1/2","1/5","3/6","3/6","1/3","1/4","3/6","2/6","3/6","2/4","2/4","3/6","3/7","1/3","3/6","1/4","1/2","1/4","3/7","1/2","2/4","2/4","3/7","3/7","3/6","2/6","2/4","2/4","1/2","6","2/6","2/5","2/4","1/3","1/3"]
["Meditation Trance","Concentration","Sd/Pr","1/4","3/7","1/5","2/4","2/4","3/7","2/4","2/6","3/7","2/4","3/6","3/7","2/4","1/4","2/6","1/4","2/4","3/9","3/6","2/4","3/7","1/3","2/6","3/6","3/7","1/3","1/3","2/5","3/6","2/4","3/6","1/3","6","3/7","3/7","2/4","1/3","1/2","1/5","3/6","3/6","1/3","2/4","3/6","2/6","3/6","2/4","2/4","3/6","3/7","1/3","3/6","2/4","1/3","2/4","3/7","1/2","2/4","2/4","3/7","2/4","3/6","2/6","2/4","2/4","1/3","6","3/6","2/4","2/4","1/3","1/3"]
["Mind Block","Concentration","Sd/Pr","7","7","7","7","7","7","7","7","7","7","7","7","7","7","7","7","7","7","7","7","7","7","7","7","7","7","7","7","7","7","7","7","7","7","7","7","7","7","7","7","7","7","7","7","7","7","7","7","7","7","7","7","7","7","7","7","7","7","7","7","7","7","7","7","7","7","7","7","7","7","7","7"]
["Mnemonics","Concentration","Re/Sd","1/4","3/7","1/4","2/7","2/4","3/8","1/3","2/6","3/7","2/5","2/5","3/7","2/4","1/4","2/6","1/4","2/4","2/5","2/6","2/4","3/7","1/4","2/6","2/5","3/7","1/4","2/4","1/4","2/7","1/3","2/7","1/4","6","3/7","3/7","1/4","1/4","1/3","2/4","2/7","2/6","1/4","1/4","2/6","2/6","2/7","2/6","2/5","2/7","3/7","1/2","2/7","1/4","1/2","1/4","3/7","1/4","1/5","2/4","3/7","3/7","2/6","1/4","2/4","2/4","1/4","6","2/5","2/5","2/5","1/4","1/4"]
["Prepared Shot","Concentration","Sd/In","6","1/2","5","2/4","5","2/4","2/7","2/4","2/7","3/6","1/3","3/8","5","6","5","5","2/6","1/2","1/4","5","1/4","5","5","3/7","2/6","6","5","1/3","2/6","2/7","2/6","6","1/3","1/3","3","4","6","3","2/4","2/7","3/7","5","5","2/7","2/6","2/6","3/9","2/7","2/6","2/6","7","1/4","5","3","5","1/2","5","2/7","5","2/6","2/6","2/6","2/6","1/3","1/3","5","5","3/7","5","2/7","6","6"]
["Presence Projection","Concentration","Pr","9","3/8","9","1/2","9","2/5","6","3/8","3","2/6","1/3","9","9","7","3/9","9","2/5","2/5","3","6","7","6","3/8","3","3/8","9","9","2/5","2/5","3","2/5","5","3/8","3/8","4","6","9","9","4","4","6","4","9","3","3/6","2/5","9","3","2/5","7","9","2/5","3/9","9","8","3/8","9","3","9","3/8","3/8","1/3","4","3/9","3/9","6","4","3","9","3","9","9"]
["Spacial loc. Awareness","Concentration","In","3/6","6","1/4","5","2/5","4","2/5","2/6","6","1/4","3/8","6","2/5","2/5","3/8","1/3","2/5","6","3/7","2/5","6","1/3","3/8","2/5","6","2/5","2/5","1/4","10","2/5","5","2/5","6","6","6","2/5","2/5","1/4","1/3","5","3/7","1/3","2/5","3/8","3/8","5","1/4","1/4","5","6","1/5","5","2/6","1/2","2/5","6","2/5","2/5","2/5","6","6","3/8","6","1/4","1/4","1/4","6","2/5","2/5","1/4","2/5","2/5"]
["WOW Fatigue","Concentration","Sd","20","2/5","20","2/5","20","2/5","6","1/5","4","2/7","3/8","2/5","7","20","8","12","4","5","5","8","6","20","4","2/7","2/5","20","20","2/5","3/8","6","3/8","20","2/5","2/5","3/7","7","20","8","4","4","5","20","20","2/6","3/6","2/6","2/6","3/8","3/8","2/5","10","3/8","6","15","20","2/5","7","5","20","2/5","2/5","3/8","3/8","4/8","2/6","20","1/5","3/8","20","4","15","15"]
["WOW Pain","Concentration","Sd","20","2/5","20","2/5","20","2/5","6","1/5","4","2/7","3/8","2/5","7","20","8","12","4","5","5","8","6","20","4","2/7","2/5","20","20","2/5","3/8","6","3/8","20","2/5","2/5","3/7","7","20","8","4","4","5","20","20","2/6","3/6","2/6","2/6","3/8","3/8","2/5","10","3/8","6","15","20","2/5","7","5","20","2/5","2/5","3/8","3/8","2/6","2/6","20","1/5","3/8","20","4","15","15"]
["WOW Unconsciousness","Concentration","Sd","20","2/5","20","2/5","20","2/5","6","1/5","4","2/7","3/8","2/5","7","20","8","12","4","5","5","8","6","20","4","2/7","2/5","20","20","2/5","3/8","6","3/8","20","2/5","2/5","3/7","7","20","8","4","4","5","20","20","2/6","3/6","2/6","2/6","3/8","3/8","2/5","10","3/8","6","15","20","2/5","7","5","20","2/5","2/5","3/8","3/8","2/6","2/6","20","1/5","3/8","20","4","15","15"]
["WOW Will","Concentration","Sd","20","2/5","20","2/5","20","2/5","6","1/5","4","2/7","3/8","2/5","7","20","8","12","4","5","5","8","6","20","4","2/7","2/5","20","20","2/5","3/8","6","3/8","20","2/5","2/5","3/7","7","20","8","4","4","5","20","20","2/6","3/6","2/6","2/6","3/8","3/8","2/5","10","3/8","6","15","20","2/5","7","5","20","2/5","2/5","3/8","3/8","4/8","2/6","20","1/5","3/8","20","1/3","15","15"]
["Ambush","Deadly","None","9","3/8","9","1/2","9","2/5","6","3/8","3","2/6","1/3","9","9","7","3/9","9","2/5","2/5","3","6","7","6","3/8","2/7","3/8","9","9","2/5","2/5","3","2/5","5","3/8","3/8","4","6","9","9","4","4","6","4","9","3","3/6","2/5","9","3","2/5","7","9","2/5","3/9","9","8","3/8","9","3","9","3/8","3/8","1/3","4","3/9","3/9","6","4","3","9","3","9","9"]
["Silent Kill","Deadly","Ag","6","2/6","6","1/4","6","2/5","5","1/4","2/6","2/6","1/3","5","3/6","5","2/6","9","4","3/8","5","3/6","7","3/5","3/8","2/4","2/6","6","3/6","1/4","1/4","5","1/4","4","2/6","2/6","2/6","5","6","6","3","1/4","5","3/5","5","1/3","2/6","1/4","3/7","4","1/4","2/6","6","1/4","5","5","5","2/6","3/6","5","6","2/6","2/6","1/3","6","1/5","1/5","2/6","6","4","3/6","4","6","6"]
["Sniping","Deadly","None","9","3/8","9","1/2","9","2/5","6","3/8","3","2/6","1/3","9","9","7","3/9","9","2/5","2/5","3","6","7","6","3/8","2/5","3/8","9","9","2/5","2/5","3","2/5","5","3/8","3/8","4","6","9","9","4","4","6","4","9","3","3/6","2/5","9","3","2/5","7","9","2/5","3/9","9","8","3/8","9","3","9","3/8","3/8","1/3","4","3/9","3/9","6","4","3","9","3","9","9"]
["Use/Remove Poison","Deadly","Ag/In","1/4","2/5","2/6","1/3","2/6","2/5","2/6","4","2/5","2/5","1/4","2/5","2/5","1/4","2/6","3/7","2/5","1/4","3","1/5","7","2/4","3/8","2/4","2/5","2/6","2/5","4","2/4","2/6","2/4","2/6","4/9","2/5","2/5","1/4","2/6","2/6","2/6","2/4","3","2/6","1/4","1/4","2/6","2/4","3/6","2/5","2/4","2/5","2/6","2/4","1/4","2/6","1/4","2/5","2/5","2/6","2/4","2/5","2/5","1/4","2/7","2/5","2/5","2/5","6","2/7","1/4","2/5","2/6","2/6"]
["Appraisal","Evaluation","Re","1/2","2/5","3/7","2/4","2","3/6","1/3","3/6","2/5","1/4","1/2","1/5","2","3/7","2/6","2/5","2","1/4","3","2","2/5","3/5","2/6","3/7","2/5","3/7","2","2/5","2/4","2/5","2/4","3/7","2/5","2/5","2/5","2","3/7","2","2/5","2/4","2/5","3/5","2","1/4","2/6","4/8","1/4","1/4","2/4","2/5","2/5","2/4","1/4","2/5","2","2/5","2/4","2/5","2","2/5","2/5","1/4","1/2","2","2","2","6","3/7","2","1/4","3/7","3/7"]
["Armor Evaluation","Evaluation","In/Re","1/3","1/2","4","1/3","4","1/3","2/5","3/6","1/2","1/4","1/3","1/5","2","3","2/6","3/7","2","2/7","6","2","1/2","3","2/6","2/4","1/2","4","5","2/5","1/3","2/5","1/3","4","1/2","1/2","1/2","3","4","3","3/6","1/3","6","3","3","1/3","2/6","1/3","1/3","1/4","1/3","1/2","4","1/3","3","2/6","3","1/2","3","2/5","3/6","1/2","1/2","1/3","1/3","3","3","3","6","2/4","3","1/4","4","4"]
["Looting","Evaluation","Eq/Pr","18","2/6","18","2/7","18","2/5","5","1/4","2/6","2/6","2/7","3/7","7","18","2/6","20","5","3/5","5","5","2/6","18","3/8","2/6","2/6","18","18","8","1/5","5","1/5","18","1/3","2/6","2/6","18","18","8","8","5","5","18","18","2/7","2/6","1/5","3/6","5","1/5","2/6","20","1/5","18","15","18","1/3","18","5","18","2/6","4/12","2/7","2/5","8","8","15","2/6","6","18","5","18","18"]
["Metal Evaluation","Evaluation","In/Re","1/2","3/6","2/5","2/5","2","3/6","2/4","3/6","3/6","2/5","1/2","1/5","2","2/5","2/6","1/4","2","1/4","4","2","3/6","3/6","2/6","2/6","3/6","2/5","2","2/5","2/5","2/4","2/5","2/5","3/6","3/6","3/6","2","2/5","2","3","2/5","3/6","3/6","2","1/3","2/6","2/5","2/5","2/5","2/5","3/6","2/5","2/5","1/4","2/5","2","3/6","2","2/4","2","3/6","3/6","1/3","1/2","3","3","2","6","2/6","2","2/5","2/5","2/5"]
["Stone Evaluation","Evaluation","In/Re","1/2","3/6","2/4","2/5","1/5","3/6","2/4","3/6","3/6","2/5","1/2","1/5","2/5","2/4","2/6","1/4","2/5","1/4","4","2/3","3/6","3/6","2/6","2/6","3/6","2/4","2","2/5","2/5","2/4","2/5","2/4","3/6","3/6","3/6","3","2/4","2/5","3","2/5","3/6","3/6","3","1/3","2/6","2/5","2/5","2/5","2/5","3/6","2/5","2/5","1/4","2/5","3","3/6","2/4","2/4","2/5","3/6","3/6","1/3","1/2","3","3","2","6","2/6","2/4","2/5","2/4","2/4"]
["Weapon Evaluation","Evaluation","In/Re","1/3","1/2","4","1/3","4","1/3","2/5","3/6","1/2","1/4","1/3","1/5","2","3","2/6","3/7","2","2/5","3","2","1/2","3","2/6","2/4","1/2","4","5","2/5","1/3","2/5","1/3","4","1/2","1/2","1/2","3","4","3","3/6","1/3","3","3","3","1/4","2/6","1/3","1/3","1/4","1/3","1/2","3/7","1/3","2/6","2/6","3","1/2","3","2/5","3/6","1/2","1/2","1/4","1/3","1/3","1/3","3","3","2/4","3","1/4","4","4"]
["Advertising","General","In/Re","3/5","3/6","3/6","2/4","3/6","4","1/5","6","3/6","3/6","2/4","3/6","2/5","3/6","2/6","3/6","3/6","1/4","1/4","2/6","3/6","3/6","2/6","3/6","3/6","3/5","2/6","6","2/4","2/5","2/4","2/4","3/6","3/6","2/5","3/6","3/5","3/5","3/6","2/4","1/4","3/6","3/6","3/5","2/6","2/4","3/6","3/6","2/4","3/6","1/4","2/4","1/4","3/5","3/6","3/6","1/4","1/5","3/6","3/6","3/6","2/4","2/6","3/5","3/5","2/4","6","3/6","1/4","3/6","3/5","3/5"]
["Cookery","General","In/Re","1/2","2/5","2/6","2/5","2/6","2/5","2/6","6","2/5","2/4","1/5","2/5","2/4","2/6","2/6","2/5","2/4","1/5","2/6","1/4","2/5","1/5","1/4","2/5","2/5","2/6","1/5","6","2/5","2/6","1/2","2/6","2/5","2/5","2/5","2/5","2/6","2/6","2/6","2/5","2/6","2/6","2/5","1/5","2/6","2/5","2/6","2/4","2/5","2/5","2/5","2/5","1/4","2/6","2/5","2/5","2/4","2/6","2/4","2/5","2/5","1/5","1/3","2/5","2/5","2/4","6","2/6","1/2","2/4","2/6","2/6"]
["Crafting","General","Ag/Sd","1/2","2/5","2/5","2/4","2/6","2/6","3/5","2/5","2/4","2/4","1/4","2/5","2/6","2/4","2/6","2/6","2/4","2/5","3","2/6","2/5","2/6","1/5","2/5","2/5","2/5","2/6","2/5","2/4","3/5","2/4","2/4","2/5","2/5","2/5","2/5","2/5","2/4","1/4","2/4","3","2/6","2/5","2/6","2/6","2/4","2/4","2/4","2/4","2/5","2/6","2/4","1/5","2/5","2/5","2/5","2/6","3/5","2/6","2/5","2/5","1/5","1/4","2/5","2/5","2/6","6","2/5","2/6","2/4","2/4","2/4"]
["Fletching","General","Ag/Sd","1/3","1/2","2/7","2/4","3/6","2/4","2/5","6","1/4","2/5","2/4","2/4","2/5","2/6","2/6","3","2/5","3/8","3","2/4","2/4","3/6","2/6","2/5","2/4","2/6","2/6","6","2/4","2/5","2/4","2/7","2/4","2/4","2/4","2/6","2/6","2/6","2/5","2/4","3","3/6","2/6","2/6","2/6","2/4","2/5","2/5","2/4","2/4","3","2/4","3","2/6","2/6","2/4","2/5","2/5","3/5","2/4","2/4","2/4","2/5","2/5","2/5","3/5","6","2/5","3/7","2/5","2/6","2/6"]
["Gimmickry","General","Re","2/4","3/7","2/5","2/6","3/7","3/8","2/5","4","2/6","2/7","2/4","3/7","3/7","3","2/6","3/7","2/7","3/7","3","3/7","3/7","3/7","2/6","3/7","3/7","3","3/7","4","2/6","2/5","2/6","3","3/7","3/7","3/7","3","3","3","2/6","2/6","3","3/7","3","2/5","2/6","2/6","2/6","2/7","2/6","3/7","2/6","2/6","2/5","3","3","3/7","3/7","2/5","2/6","3/7","3/7","2/5","2/5","3/7","3/7","3/7","6","3/7","2/5","2/7","3","3"]
["Horticulture","General","In/Em","1/4","8","2/6","6","2/6","3/8","2/6","6","8","1/2","8","8","2/5","2/5","2/6","5","1/2","8","2/6","1/4","8","2/6","1/2","3/8","8","2/6","1/3","6","6","2/6","6","2/6","8","8","8","2/6","2/6","2/6","1/4","6","2/6","2/6","2/6","4","2/6","6","3","1/2","6","8","1/3","6","1/4","2/6","2/6","8","2/5","2/6","2/6","8","8","4","3","3","3","2/6","8","3/8","1/4","1/2","2/6","2/6"]
["Hygien","General","Co/Sd","3","1/3","4","1/4","3","1/2","2/4","1/2","1/4","1/3","2/4","1/2","3","4","2","4","1/3","1/3","1/3","2","1/3","4","1/2","1/2","1/2","4","1/2","1/3","1/3","2/5","1/3","4","1/1","1/2","1/2","2/4","4","3","2/4","2/4","2/3","4","4","2/4","1/3","1/3","1/3","1/3","1/3","1/4","3","1/3","4","3","3","1/2","1/2","1/4","4","1/2","1/2","2/4","1/3","1/2","1/4","4","1/2","1/4","3","1/3","4","4"]
["Leatherworking","General","Ag/Re","3","2/4","3","2/4","3","2/4","2/6","6","2/4","2/5","2/4","2/4","2/6","3","2/6","3/7","2/5","2/5","3/5","2/5","2/4","3","2/6","2/6","2/4","3","2/5","6","2/4","2/6","1/2","3","2/4","2/4","2/4","3","3","3","2/6","2/4","3/5","3","3","2/4","2/6","2/4","2/5","2/5","2/4","2/4","4","2/4","3","3","3","2/4","2/4","2/6","3","2/4","2/4","2/4","2/5","2/4","2/4","3","6","2/6","2/6","2/5","3","3"]
["Painting","General","In/Ag","2/5","2/6","2/4","2/6","2/7","2/6","1/4","4","2/6","1/4","2/6","2/6","2/5","2/5","2/6","2/4","1/4","2/6","4","2/4","2/6","2/4","2/6","2/5","2/6","2/4","2/4","1/3","2/6","2/5","2/6","2/4","2/6","2/6","2/6","2/4","2/4","2/5","1/3","2/6","4","2/4","2/4","2/6","2/6","2/6","1/4","1/4","2/6","2/6","2/5","2/6","1/4","2/4","2/4","2/6","2/4","1/4","2/4","2/6","2/6","2/6","2/6","1/3","1/3","2/4","6","2/5","2/4","1/4","2/4","2/4"]
["Play Instrument #1","General","Ag/Re","2/6","2/6","2/6","2/6","2/4","2/6","1/2","2/4","2/6","2/6","2/6","2/6","2/5","2/6","2/6","2/6","2/6","1/4","2/6","2/6","2/6","2/4","2/6","2/6","2/6","2/6","2/6","2/4","2/6","2/5","2/6","2/6","2/6","2/6","2/6","2/6","2/6","2/6","2/6","2/6","2/6","2/5","2/6","2/6","2/6","2/6","2/6","2/6","2/6","2/6","3/6","2/6","2/4","2/5","2/6","2/6","2/4","1/2","2/6","2/6","2/6","2/6","1/4","6","2/6","2/6","6","2/6","2/5","2/6","2/6","2/6"]
["Play Instrument #2","General","Ag/Re","3/7","3/7","3/7","3/7","3/5","3/7","1/3","3/5","3/7","3/7","3/7","3/7","3/6","3/7","3/7","3/7","3/7","1/5","3/7","3/7","3/7","3/5","3/7","3/7","3/7","3/7","3/7","3/5","3/7","2/5","3/7","3/7","3/7","3/7","3/7","3/7","3/7","3/7","3/7","3/7","3/7","3/6","3/7","3/7","3/7","3/7","3/7","3/7","3/7","3/7","3/9","3/7","3/6","3/6","3/7","3/7","3/5","1/3","3/7","3/7","3/7","3/7","2/5","6","3/7","3/7","6","3/7","3/6","3/7","3/7","3/7"]
["Play Instrument #3","General","Ag/Re","3","3","3","3","3","3","1/4","3","3","3","3","3","3","3","3","3","3","2/6","3","3","3","3","3","3","3","3","3","3","3","2/5","3","3","3","3","3","3","3","3","3","3","3","3","3","3","3","3","3","3","3","3","4","3","3","3","3","3","3","1/4","3","3","3","3","3/6","6","3","3","6","3","3","3","3","3"]
["Rope Mastery","General","Ag/Re","3","2/6","3","1/5","3","1/6","2/5","2/5","2/6","1/3","1/3","2/6","2/5","3","2/6","3","2/5","2/4","2/6","2/5","2/6","3","2/6","3/5","2/6","3","2/6","2/5","1/5","2/5","1/5","3","2/6","2/6","2/6","2/6","3","3","2/4","1/5","2/6","3","2/6","1/3","2/6","1/5","2/6","2/5","1/5","2/6","3","1/5","3","3","2/6","2/6","2/6","2/5","3","2/6","2/6","1/3","1/4","2/5","2/5","3","6","3/5","2/7","2/5","3","3"]
["Sculpting","General","In/Ag","1/4","2/7","2/5","2/7","3/7","2/6","2/6","2/4","2/6","2/5","2/7","2/7","2/7","2/7","2/6","2/4","2/5","3/6","4","2/7","2/7","2/7","2/6","2/7","2/7","2/4","2/7","2/4","2/7","2/6","2/7","2/4","2/7","4/14","2/7","2/5","2/4","2/7","2/5","2/7","4","2/7","2/5","2/7","2/6","2/7","2/7","2/5","2/7","2/7","3/8","2/7","2/7","2/6","2/5","2/7","2/7","2/6","2/7","2/7","2/7","2/7","2/7","2/5","2/5","2/6","6","2/7","2/7","2/5","1/5","1/5"]
["Skinning","General","In/Ag","3","2/6","3","1/5","2/5","1/4","2/5","3/6","1/4","1/3","3/6","2/6","2/5","3","2/6","6","1/3","3/7","4","1/4","2/6","3/4","1/5","1/5","2/6","3","2/6","3/6","1/5","2/5","1/3","3","2/6","2/6","2/6","1/4","3","2/5","2/6","1/5","4","3/4","1/4","3","2/6","1/5","2/6","1/3","1/5","2/6","5","2/6","4","2/4","1/4","2/6","1/5","2/5","1/2","2/6","2/6","1/3","1/3","2/5","2/5","4","6","3/7","2/5","1/3","3","3"]
["Smithing","General","St/Ag","1/2","3/5","3","2/7","3","3/5","3/5","6","3/5","2/7","2/6","2/5","3","3","2/6","2/4","2/7","3/7","4","3","3/5","3","2/6","3/7","3/5","3","3","6","2/7","3/5","2/7","3","3/5","3/5","2/6","3","3","3","2/6","2/7","4","3","3","2/6","2/6","2/7","3/5","2/7","2/7","3/5","5","2/7","4","3","3","3/5","3","3/5","3","3/5","6","2/6","3/6","3/5","3/5","4","6","3/7","3","2/7","3","3"]
["Stonecrafts","General","Ag/Sd","1/2","2/7","3","3/7","3","2/7","2/7","6","2/6","2/6","3/7","2/7","3","3","2/6","2/4","2/6","4","4","3","2/7","3","2/6","3","2/7","3","3","6","3/7","2/7","3/7","3","2/7","2/7","2/7","3","3","3","2/7","3/7","4","3","3","3/5","2/6","3/7","3/5","2/6","3/7","2/7","5","3/7","4","3","3","2/7","3","2/7","3","2/7","2/7","3/7","3/8","3/5","3/5","3","6","3","3","2/6","3","3"]
["Tactical Games","General","Re","1/4","2/4","1/2","2/4","2/4","2/4","2/4","2/4","2/5","2/4","2/4","1/4","2/4","1/5","2/6","2/4","2/4","2/4","2/4","2/4","2/4","1/4","2/6","2/4","2/4","1/4","2/4","2/4","2/4","2/5","4/8","1/4","2/4","2/4","1/2","2/6","1/4","2/4","1/4","2/4","2/4","1/4","2/6","1/4","2/6","2/4","1/4","2/4","2/4","2/4","2/4","2/4","1/4","2/4","2/6","2/4","2/4","2/4","1/4","2/4","2/4","2/4","2/4","2/4","2/4","1/4","6","2/4","2/4","2/4","1/4","1/4"]
["WA Maintenance","General","Ag/Sd","1/2","3/5","3","2/7","3","3/5","3/5","6","3/5","2/7","2/6","2/5","3","3","2/6","2/4","2/7","3/7","4","3","3/5","3","2/6","3/7","3/5","3","3","6","2/7","3/5","2/7","3","3/5","3/5","2/6","3","3","3","2/6","2/7","4","3","3","2/6","2/6","2/7","3/5","2/7","2/7","3/5","5","2/7","4","3","3","3/5","3","3/5","3","3/5","6","2/6","3/6","3/5","3/5","4","4","3/7","3","2/7","3","3"]
["Woodcrafts","General","Ag/Em","1/3","2/6","3","2/6","3","2/6","2/4","6","1/3","2/4","2/7","2/6","2/6","3","2/6","3","2/4","3/6","3","2/5","2/6","3","1/5","3/7","2/6","3","2/6","6","2/6","2/5","2/6","3","2/6","2/6","2/6","4","3","3","1/5","2/6","3","3","4","3/5","2/6","2/6","2/4","2/4","2/6","2/6","4","2/6","3","3","4","2/6","2/6","2/4","3","2/6","2/6","2/7","2/6","2/6","2/6","3","6","3/7","2/6","2/4","2/4","2/4"]
["Acrobatics","Gymnastic","Ag/Qu","3","2/5",3,"1/4","3","2/5","2/6","2/5","2/5","2/6","1/3","2/7","2/7","3","2/6","3/7","2/6","1/2","1/4","2/7","2/5","3","2/6","2/7","2/5","3","2/7","2/5","1/4","2/6","1/4","3","2/5","2/5","2/5","3","3","3/7","1/5","2/6","1/4","3","3","1/3","2/6","1/4","2/6","2/6","1/4","2/5","5","1/4","5","3/7","3","2/5","2/7","2/6","3","2/5","2/5","1/3","2/6","1/3","1/3","3","6","2/7","4","2/6","3","3"]
["Calisthenics","Gymnastic","None","20","4/9","20","3/8","20","4/9","10","4/9","4/9","4/9","3/8","4/9","20","20","20","20","6","3/9","5/10","20","4/9","20","5/10","6","4/9","20","20","3/8","6","10","6","20","4/9","6","6","10","20","20","3/8","3/8","10","20","20","3/8","5/10","6","6","6","4/9","4/9","20","6","5/10","20","20","3/8","20","10","20","4/9","6","6","5/10","4/9","4/9","20","3/8","6","20","6","20","20"]
["Contortions","Gymnastic","Ag/Sd","5","2/6",5,"1/3","5","2/6","2/5","2/5","2/6","2/6","1/3","2/7","3/7","5","2/6","2/6","2/6","1/2","1/4","2/6","2/6","4","2/6","2/7","2/6","5","2/6","2/5","2/4","2/5","2/4","4","2/6","2/6","2/6","5","5","3","2/4","2/5","1/4","4","5","1/3","2/6","2/4","2/5","2/6","2/4","2/6","4","2/4","4","3","5","2/6","2/6","2/5","5","2/6","4/12","1/3","2/5","1/2","1/2","4","6","3/7","3/7","2/6","5","5"]
["Juggling","Gymnastic","Ag/In","3","1/5",3,"1/3","2/6","2/5","1/5","3/7","1/5","2/7","1/3","2/7","2/6","3","2/6","3","2/7","1/4","2/5","2/7","1/5","2/5","2/6","2/6","1/5","3","2/7","3/7","1/3","1/5","1/3","3","1/5","1/5","1/5","2/5","3","2/6","2/7","1/5","2/5","2/5","2/5","1/2","2/6","2/6","2/7","2/7","1/3","1/5","4","1/3","3","2/5","2/5","1/3","2/7","1/5","2/5","1/5","2/10","1/2","1/4","2/7","2/7","2/5","6","2/6","3/7","2/7","3","3"]
["Jumping","Gymnastic","St/Ag","4","1/3",4,"1/3","4","1/3","3/6","1/3","1/3","1/3","1/4","2/7","3","4","2/6","3/7","3/6","1/3","1/4","3","1/3","4","2/6","3/6","1/3","4","3","1/3","1/3","3/6","1/3","4","1/3","1/3","1/3","4","4","4","2/5","3/6","1/4","4","4","1/4","2/6","1/3","3/6","3/6","1/3","1/3","3","1/3","3","4","4","1/3","3","3/6","4","1/3","1/3","1/4","1/4","1/3","1/3","4","6","3/6","3","3/6","4","4"]
["Pole Vaulting","Gymnastic","St/Ag","5","2/5",5,"1/4","5","2/5","3/6","2/5","2/5","2/6","1/3","2/7","4","5","2/6","4","2/6","1/4","2/5","4","2/5","5","2/6","3/7","2/5","5","4","1/4","1/4","3/6","1/4","5","2/5","2/5","2/5","5","5","5","2/5","3/6","2/5","5","5","1/3","2/6","1/4","3/6","2/6","1/4","2/5","6","1/4","5","5","5","2/5","4","3/6","5","2/5","2/5","1/3","2/5","1/4","1/4","6","6","3/7","4","2/6","5","5"]
["Stilt Walking","Gymnastic","St/Ag","4","2/5",4,"1/4","4","2/6","3/6","2/6","2/5","3/6","1/3","2/7","3","4","2/6","4","3/6","1/3","2/5","3","2/5","4","2/6","3/8","2/5","4","3","2/6","1/4","3/6","1/4","4","2/5","2/5","2/5","4","4","4","2/5","3/6","2/5","4","4","1/3","2/6","1/4","3/6","3/6","1/4","2/5","4","1/4","3","4","4","2/5","3","3/6","4","2/5","2/5","1/3","2/5","1/3","1/3","4","6","3/8","3","3/6","4","4"]
["Tightrope Walking","Gymnastic","Ag/Sd","3","3/6",3,"2/4","3","3/7","2/6","3/6","3/6","2/6","1/3","2/7","2","3","2/6","3/7","2/6","1/3","1/5","2","3/6","3","2/6","3/6","3/6","3","2","1/4","1/4","2/6","1/4","3","3/6","3/6","3/6","3","3","3","1/5","2/6","1/5","3","3","1/3","2/6","1/4","2/6","2/6","1/4","3/6","3","1/4","3","3","3","3/6","2","2/6","3","3/6","3/6","1/3","2/5","1/3","1/3","3","6","3/6","3","2/6","3","3"]
["Tumbling","Gymnastic","Ag/Sd","3","1/5",3,"1/3","3","1/5","2/5","2/7","2/5","2/5","1/4","2/7","2/6","3","2/6","3","2/4","1/2","1/4","2/5","1/5","3","2/6","2/6","2/5","3","2/5","1/3","2/5","2/5","2/6","3","2/6","2/6","2/5","3","3","2","1/4","2/5","1/4","3","3","1/4","2/6","1/5","2/4","2/4","1/4","1/5","4","1/4","4","2","3","2/5","2/5","2/5","3","2/5","2/7","1/4","1/4","1/3","1/3","3","2/6","2/6","3/7","2/4","3","3"]
["Language","Linguistic","None","1/*","3/*","1/*","1/*","1/*","3/*","1/*","3/*","3/*","3/*","3/*","2/*","2/*","1/*","2/*","2/*","3/*","3/*","3/*","2/*","3/*","1/*","3/*","3/*","3/*","2/*","2/*","3/*","3/*","1/*","3/*","1/*","3/*","3/*","2/*","2/*","2/*","2/*","3/*","3/*","2/*","1/*","1/*","3/*","2/*","2/*","3/*","3/*","3/*","1/*","1/*","3/*","1/*","1/*","2/*","3/*","2/*","2/*","2/*","3/*","3/*","3/*","1/*","3/*","3/*","1/*","3/*","3/*","2/*","1/*","2/*","2/*"]
["Lip Reading","Linguistic","In/Re","3/5","3/5","2/4","2/5","1/3","3/7","1/4","2/5","3/7","2/6","3/5","3/5","2/4","3/5","2/6","2/6","2/6","2/5","3/5","2/4","3/5","1/3","2/6","2/5","3/5","2/4","2/4","2/5","2/5","1/5","2/5","1/3","3/5","3/5","2/6","2/4","2/4","2/4","2/4","2/5","3/5","1/3","2/4","3/5","2/6","2/5","2/5","2/6","2/5","3/5","2/6","2/5","2/5","1/4","2/4","3/5","2/4","2/6","2/4","3/5","3/5","3/5","2/4","3/5","3/5","1/4","6","2/5","2/4","2/6","2/4","2/4"]
["Mimicry","Linguistic","In/Sd","2/6","2/5","2/6","1/5","2/7","2/5","1/5","2/5","2/5","2/6","2/5","2/5","2/7","2/4","2/6","3/7","2/6","2/5","2/6","1/5","2/5","1/4","2/6","2/6","2/5","2/6","2/7","2/5","1/5","1/5","1/5","1/3","2/5","2/5","2/5","2/4","2/6","2/6","2/6","1/5","2/6","1/4","2/4","2/5","2/6","1/5","2/5","2/6","1/5","2/5","3/6","1/5","3/5","1/5","2/4","2/5","2/7","2/6","2/7","2/5","2/5","2/5","1/4","2/5","2/5","1/4","6","2/6","2/7","2/6","2/6","2/6"]
["Music","Linguistic","Ag/Em","2/6","2/6","2/6","2/6","2/4","2/6","1/2","6","2/6","2/6","2/6","2/6","2/5","2/6","2/6","2/5","2/6","2/4","2/6","2/5","2/6","2/5","2/6","2/6","2/6","2/6","2/6","6","2/6","1/5","2/6","2/6","2/6","2/6","2/6","2/6","2/6","2/6","2/6","2/6","2/6","2/5","2/6","2/6","2/6","4/12","2/6","2/6","2/6","2/6","1/4","2/6","2/5","2/5","2/6","2/6","2/5","2/6","2/6","2/6","2/6","2/6","2/6","2/6","2/6","2/4","6","2/6","2/4","2/6","2/6","2/6"]
["Poetic Improvisation","Linguistic","Re","2/6","6","2/6","2/5","2/4","2/6","1/2","3","2/6","2/6","2/5","6","2/5","1/5","2/6","2/5","2/6","1/4","1/4","2/5","6","2/5","2/6","2/6","6","2/6","2/6","3","2/5","1/5","2/5","2/5","6","6","6","2/6","2/6","2/5","2/6","2/5","1/4","2/5","2/6","2/5","2/6","4/10","2/6","2/6","2/5","6","1/2","2/5","1/3","2/4","2/6","6","1/5","2/6","2/6","6","6","2/5","1/4","2/6","2/6","1/5","6","2/6","1/4","2/6","2/6","2/6"]
["Propaganda","Linguistic","In/Em","3/5","3/6","3/6","2/4","3/6","4","1/5","6","3/6","3/6","2/4","3/6","2/6","3/6","2/6","2/5","3/6","2/6","3/6","2/6","3/6","1/5","2/6","3/5","3/6","3/5","2/6","6","2/4","1/5","2/4","2/4","3/6","3/6","1/3","3/6","3/5","3/5","3/6","2/4","3/6","3/6","3/6","3/5","2/6","2/4","3/6","3/6","2/4","3/6","1/4","2/4","2/3","3/5","3/6","3/6","1/4","2/6","3/6","3/6","3/6","2/4","1/2","3/5","3/5","1/5","6","3/5","1/4","3/6","3/5","3/5"]
["Public Speaking","Linguistic","Em/Pr/Ap","3/5","2/6","2/6","2/4","3/6","2/6","1/2","6","2/6","2/6","2/6","1/5","2/6","3/6","2/6","2/5","2/6","2/4","2/6","2/6","2/6","3/6","2/6","2/6","2/6","3/5","2/6","6","2/4","1/5","2/4","2/4","4/9","2/6","1/3","3/6","3/5","3/5","2/6","2/4","2/6","3/6","3/6","2/6","2/6","2/4","1/4","2/6","2/4","1/3","1/4","2/4","2/5","3/5","3/6","2/6","1/4","2/6","3/6","2/6","2/6","2/6","1/4","2/6","2/6","1/5","6","2/6","1/4","2/6","3/5","3/5"]
["Signaling","Linguistic","Re/Sd","1/5","1/4","1/5","1/4","1/4","1/4","1/5","6","1/4","1/5","1/3","1/4","2/5","1/4","2/6","2/6","1/5","2/4","2/5","2/5","1/4","2/4","2/6","1/4","1/4","1/5","2/6","6","1/4","1/5","1/4","2/4","1/4","1/4","1/4","2/6","1/5","2/6","2/6","1/4","2/5","1/3","2/6","1/3","2/6","1/4","1/5","1/4","1/4","1/4","2/5","1/4","1/5","2/6","2/6","1/4","2/6","2/6","2/6","1/4","1/4","1/3","1/4","1/4","1/4","2/5","6","1/4","2/5","1/5","1/5","1/5"]
["Singing","Linguistic","Pr/In","2/6","2/6","2/6","2/6","2/4","2/6","1/2","6","2/6","2/6","2/6","2/6","2/5","2/6","2/6","2/4","2/6","1/4","2/5","2/6","2/6","1/3","2/6","2/6","2/6","2/6","2/6","6","2/6","1/5","2/6","2/6","2/6","2/6","2/6","2/6","2/6","2/6","2/6","2/6","2/5","2/5","2/6","2/6","2/6","2/6","2/6","2/6","2/6","2/6","1/5","2/6","2/5","2/5","2/6","2/6","2/6","2/6","2/6","2/6","2/6","2/6","2/6","2/6","2/6","2/4","6","2/6","2/4","2/6","2/6","2/6"]
["Tale Telling","Linguistic","Pr","2/6","2/6","2/6","2/5","2/4","2/6","1/3","2/6","2/6","2/6","2/5","2/6","2/5","2/6","2/6","2/6","2/6","1/4","2/5","2/6","2/6","2/5","2/6","2/6","2/6","2/6","2/5","2/6","2/5","1/5","2/5","2/5","2/6","2/6","2/6","2/6","2/6","2/5","2/6","2/5","2/5","2/5","2/6","2/5","2/6","2/5","2/6","2/6","2/5","1/4","1/4","2/5","2/5","2/4","2/6","2/6","2/5","2/6","2/6","2/6","2/6","2/5","1/4","2/6","2/6","2/5","6","2/6","2/4","2/6","2/6","2/6"]
["Trading","Linguistic","Re","3/5","3/6","3/5","2/4","3/6","3/6","2/4","6","3/6","3/5","2/4","3/6","2/5","3/6","2/6","2/5","3/5","3/5","3/6","2/6","3/6","2/6","2/6","3","3/6","3/5","2/6","6","2/4","2/4","2/4","2/4","3/6","3/6","2/5","2/6","3/5","3/5","3/6","2/4","3/6","3/6","2/6","2/4","2/6","2/4","3/6","3/5","2/4","3/6","2/5","2/4","2/4","3/6","2/6","3/6","1/4","2/6","3/6","3/6","3/6","2/4","1/2","3/5","3/5","3/6","6","3","1/4","3/5","3/5","3/5"]
["Ventriloquism","Linguistic","Sd/In","3/6","3/5","3/6","2/5","3/7","3/5","2/5","3/5","3/5","3/6","3/5","3/5","3/7","3/6","2/6","3/7","3/6","2/6","3/7","2/5","3/5","2/4","2/6","3/6","3/5","3/6","3/7","3/5","2/5","2/5","2/5","2/3","3/5","3/5","3/5","3/7","3/6","3/6","3/6","2/5","3/7","2/4","3/7","3/5","2/6","2/5","3/6","3/6","2/5","3/5","2/5","2/5","3/5","2/5","3/7","3/5","3/7","2/6","3/7","3/5","3/5","3/5","2/4","3/5","3/5","2/5","6","3/6","1/5","3/6","3/6","3/6"]
["Channeling","Magical","In","4/8","20","4/8","20","2/5","20","6","20","3/7","20","20","20","1/4","4/8","20","3/7","2/5","20","3/7","2/5","20","4/8","20","3/7","20","4/8","2/5","20","20","4/8","20","4/8","20","20","20","3/7","4/8","4/8","6","6","3/7","4/8","3/7","6","10","20","3/7","3/7","20","20","4/8","20","15","4/8","3/7","20","1/4","3/7","3/7","20","20","20","20","20","10","3/7","20","6","1/4","3/7","7","4/8"]
["Circle Lore (Protecting)","Magical","Re","2/4","6","1/4","6","2/5","7","3/6","4","6","6","4","6","2/4","1/3","2/6","2/4","3/6","5","3/8","1/5","6","2/5","6","3","6","1/4","2/5","4","5","3/6","5","2/4","6","6","6","2/5","1/4","2/5","3/6","3/6","3/8","2/5","2/5","4","2/6","5","3/6","3/6","5","6","1/4","5","3/6","2/5","2/5","10","2/4","3/6","1/4","10","6","4","6","5","5","1/4","6","2/7","1/4","3/6","1/4","1/4"]
["Circle Lore (Fortitude)","Magical","Re","2/4","6","1/4","6","2/5","7","3/6","4","6","6","4","6","2/4","1/3","2/6","2/4","3/6","5","3/8","1/5","6","2/5","6","3","6","1/4","2/5","4","5","3/6","5","2/4","6","6","6","2/5","1/4","2/5","3/6","3/6","3/8","2/5","2/5","4","2/6","5","3/6","3/6","5","6","1/4","5","3/6","2/5","2/5","10","2/4","3/6","1/4","10","6","4","6","5","5","1/4","6","2/7","1/4","3/6","1/4","1/4"]
["Directed Spells","Magical","Ag","2/7","20","2/6","20","2/7","25","10","20","9","20","20","20","3","2/6","20","3/8","15","20","15","3/7","20","2/8","20","3/9","20","2/5","3","20","20","10","20","2/6","20","20","20","8","1/4","2/6","9","10","3/7","2/6","2/6","2/6","3/6","20","20","20","20","20","2/7","20","15","2/7","2/5","20","2/7","10","2/5","20","20","20","20","20","20","2/7","25","3/6","2/5","15","3/6","3/6"]
["Divination","Magical","In/Em","2/4","3/6","2/4","3/6","1/4","3/6","3/5","3/5","3/5","3/6","3/6","3/6","1/5","1/4","2/6","1/5","3/5","3/5","3/5","2/5","3/6","1/4","3/6","3/6","3/6","2/4","2/5","3/5","3/6","3/5","3/6","2/4","3/6","10","2/7","1/5","2/4","2/4","3/5","3/5","3/5","1/4","1/5","3/5","2/6","3/6","3/5","3/5","3/6","3/6","1/4","3/6","2/5","1/3","1/5","6","1/4","3/5","2/5","6","3/6","3/6","2/5","3/5","3/5","1/4","6","3/6","1/3","1/5","2/4","2/4"]
["Magical Expertise","Magical","realm","2/5","20","1/4","20","2/5","20","3/8","20","4","20","20","20","2/5","2/5","20","2/5","3/8","20","3/8","2/5","20","3/8","20","4","20","2/5","2/5","20","20","3/8","20","2/5","20","20","20","3/8","2/5","2/5","4","3/8","2/5","2/5","2/5","4","20","20","4","4","20","20","3/8","20","8","2/5","2/5","20","2/5","3/8","2/5","20","20","20","20","20","20","2/5","20","3/8","2/5","4","2/5","2/5"]
["Magical Language","Magical","none","1/*","9","1/*","9","1/*","8","4/*","6","6/*","9","9","9","2/*","2/*","2/6","1/*","4/*","8","4/*","2/*","9","1/*","9","4/*","9","1/*","2/*","6","9","4/*","9","2/*","9","9","6","2/*","1/*","3/*","4/*","4/*","4/*","1/*","2/*","4/*","2/6","9","4/*","4/*","9","9","1/*","9","3/*","1/*","2/*","9","1/*","4/*","1/*","9","9","8","7","6","6","1/*","9","4/*","1/*","4/*","1/*","1/*"]
["Magical Rituals","Magical","Re/In","1/4","8","1/4","8","2/5","11","4","8","4","8","7","8","1/4","1/2","5/6","2/3","2/4","8","4","1/4","8","2/5","8","3","8","2/5","1/4","8","7","4","7","1/4","8","8","6","2/4","1/4","2/6","3","4","4","2/5","2/4","4","5/6","7","5","4","7","8","3","7","6","2/6","2/4","8","1/3","4","2/4","8","4","7","7","7","7","2/5","8","3","2/4","4","1/3","1/3"]
["Magnitude","Magical","realm","3/8","20","1/4","20","2/5","20","8","20","12","20","20","20","3/8","2/5","20","2/5","8","20","12","3/8","20","8","20","3/8","20","2/5","8","20","20","12","20","2/5","20","20","20","12","2/5","3/8","12","12","2/5","2/5","2/5","8","20","20","12","12","20","20","3/8","20","8","3/8","2/5","20","3/8","12","3/8","20","20","20","20","20","20","2/5","20","3/8","3/8","12","2/5","2/5"]
["Overcasting","Magical","realm","2/5","20","2/5","20","2/5","20","3/8","20","3/8","20","20","20","2/5","2/5","20","2/5","3/8","20","3/8","2/5","20","3/8","20","3/8","20","2/5","2/5","20","20","3/8","20","2/5","20","20","20","3/8","2/5","2/5","3/8","3/8","2/5","2/5","2/5","3/8","10","20","3/8","3/8","10","20","2/5","20","4","2/5","2/5","20","2/5","3/8","2/5","20","20","20","20","20","20","2/5","20","3/8","2/5","3/8","2/5","2/5"]
["Power Manipulation","Magical","realm","3/6","10","2/3","10","2/3","10","2/5","10","3/7","10","10","10","2/5","2/5","10","2/5","2/5","10","3/7","2/5","10","2/3","10","3/7","10","2/5","2/3","10","10","2/5","10","2/5","10","10","10","2/5","2/5","2/3","3/7","2/5","2/5","2/3","2/5","3/7","10","10","2/5","3/7","10","10","2/3","10","10","2/3","2/5","10","2/3","3/7","2/5","10","10","10","10","10","10","2/3","10","2/5","2/3","2/5","2/3","2/3"]
["Power Perception","Magical","Em","1/3","6","1/2","6","1/4","7","2/5","3/7","2/5","6","5","6","1/3","1/3","2/6","1/4","2/5","5","2/5","1/3","6","1/4","6","3/6","6","1/3","1/3","3/7","5","2/5","5","1/3","6","6","6","1/4","1/3","1/3","2/5","2/5","2/5","1/4","1/4","2/5","2/6","3","2/5","2/5","5","6","1/4","5","3/6","1/3","1/4","6","1/3","2/5","1/4","6","6","4","10","3/7","3/7","1/3","6","3/6","1/3","2/5","1/3","1/3"]
["Power Projection","Magical","realm","1/4","12","2/4","12","1/5","15","3/6","6","12","12","10","12","1/4","2/4","3/8","2/6","3/6","10","2/5","1/4","12","2/5","12","3","12","2/4","1/4","6","10","3/6","10","2/4","12","12","6","2/5","2/4","2/4","2/5","3/6","2/5","2/5","2/5","9","3/8","10","2/6","3/6","10","12","2/5","10","8","2/4","2/5","12","1/3","3/6","2/5","12","25","9","8","6","6","2/5","12","3/6","1/4","3/6","1/4","1/4"]
["PP Development","Magical","realm/2","2/5","15","2/5","15","2/5","20","4/8","6","4/8","15","9","15","2/5","2/5","4/8","2/5","4/8","9","4/8","2/5","15","2/5","15","4/8","15","2/5","2/5","6","10","4/8","10","2/5","15","15","10","2/5","2/5","2/5","4/8","4/8","4/8","2/5","2/5","4/8","4/8","10","4/8","4/8","10","15","2/5","10","5","2/5","2/5","15","2/5","4/8","2/5","15","15","8","10","6","6","2/5","15","4/8","2/5","4/8","2/5","2/5"]
["Rejuvenation","Magical","SD/realm","2/5","20","2/5","20","2/5","20","3/8","20","3/8","20","20","20","2/5","2/5","20","2/5","3/8","20","3/8","2/5","20","3/8","20","3/8","20","2/5","2/5","20","20","3/8","20","2/5","20","20","20","3/8","2/5","2/5","3/8","3/8","2/5","2/5","2/5","3/8","10","20","3/8","3/8","10","20","2/5","20","4","2/5","2/5","20","2/5","3/8","2/5","20","20","20","20","20","20","2/5","20","3/8","2/5","3/8","2/5","2/5"]
["Runes","Magical","Em/In","1/3","7","1/4","7","2/6","8","3/7","9","5","8","6","7","2/5","1/4","10","2/6","5","6","8","2/6","7","2/5","10","6","7","1/4","2/6","7","6","5","6","1/4","14","7","5","4","1/4","2/5","4","5","3/7","2/5","2/5","6","3/6","6","7","5","6","7","1/4","6","3/9","2/6","2/5","14","2/5","4","2/5","14","7","6","5","6","6","2/5","25","3/6","2/5","5","1/4","1/4"]
["Scrying","Magical","In/Pr","2/4","3/6","2/4","3/6","1/4","3/6","3/5","3/5","3/5","3/6","3/6","3/6","1/5","1/4","2/6","1/5","3/5","3/5","3/5","2/5","3/6","1/4","3/6","3","3/6","2/4","2/5","3/5","3/6","3/5","3/6","2/4","3/6","10","2/7","1/5","2/4","2/4","3/5","3/5","3/5","1/4","1/5","3/5","2/6","3/6","3/5","3/5","3/6","3/6","1/4","3/6","2/5","1/3","1/5","6","1/4","3/5","2/5","6","3/6","3/6","2/5","3/5","3/5","1/4","6","3/6","1/3","3/5","2/4","2/4"]
["SL (base)","Magical","realm","1/*","20","1/*","15","1/*","25","3/*","20","3/*","20","10","20","1/*","1/*","15","1/*","3/*","10","3/*","1/*","20","1/*","20","3/*","20","1/*","1/*","20","8","3/*","8","1/*","20","20","10","3/*","1/*","1/*","3/*","3/*","3/*","1/*","1/*","3/*","5/*","8","3/*","3/*","6","20","1/*","8","4","1/*","1/*","20","1/*","3/*","1/*","20","20","10","7","10","10","1/*","25","3/*","1/*","3/*","1/*","1/*"]
["SL (closed, A)","Magical","realm","N/A","40","N/A","30","N/A","50","6/*","40","6/*","40","20","40","N/A","N/A","30","N/A","6/*","20","6/*","N/A","40","1/*","40","6/*","40","N/A","N/A","40","16","6/*","16","N/A","40","40","20","6/*","N/A","N/A","6/*","6/*","6/*","1/*","N/A","6/*","10","16","6/*","6/*","16","40","N/A","16","8","N/A","1/*","40","N/A","6/*","1/*","40","40","20","14","20","20","1/*","50","6/*","1/*","6/*","N/A","N/A"]
["SL (closed, B)","Magical","realm","1/*","N/A","1/*","N/A","1/*","N/A","10","N/A","10","N/A","N/A","N/A","1/*","1/*","N/A","1/*","10","N/A","10","1/*","N/A","3/*","N/A","10","N/A","1/*","1/*","N/A","N/A","10","N/A","1/*","N/A","N/A","N/A","10","1/*","1/*","10","10","10","3/*","1/*","10","N/A","N/A","10","10","N/A","N/A","1/*","N/A","N/A","1/*","3/*","N/A","1/*","10","3/*","N/A","N/A","N/A","N/A","N/A","N/A","3/*","N/A","10","3/*","10","1/*","1/*"]
["SL (closed, C)","Magical","realm","N/A","40","N/A","30","N/A","50","6/*","40","6/*","40","20","40","N/A","N/A","30","N/A","6/*","20","6/*","N/A","40","1/*","40","6/*","40","N/A","N/A","40","16","6/*","16","N/A","40","40","20","6/*","N/A","N/A","6/*","6/*","6/*","1/*","N/A","6/*","10","16","6/*","6/*","16","40","N/A","16","8","N/A","1/*","40","N/A","6/*","1/*","40","40","20","14","20","20","1/*","50","6/*","1/*","6/*","N/A","N/A"]
["SL (closed, D)","Magical","realm","1/*","N/A","1/*","N/A","1/*","N/A","30","N/A","30","N/A","N/A","N/A","1/*","1/*","N/A","1/*","30","N/A","30","1/*","N/A","4/*","N/A","30","N/A","1/*","1/*","N/A","N/A","30","N/A","1/*","N/A","N/A","N/A","30","1/*","1/*","30","30","30","4/*","1/*","30","N/A","N/A","30","30","N/A","N/A","1/*","N/A","N/A","1/*","4/*","N/A","1/*","30","4/*","N/A","N/A","N/A","N/A","N/A","N/A","4/*","N/A","30","4/*","30","1/*","1/*"]
["SL (closed, E)","Magical","realm","3/*","N/A","2/*","N/A","3/*","N/A","N/A","N/A","N/A","N/A","N/A","N/A","3/*","3/*","N/A","3/*","N/A","N/A","N/A","3/*","N/A","8/*","N/A","N/A","N/A","3/*","3/*","N/A","N/A","N/A","N/A","3/*","N/A","N/A","N/A","N/A","3/*","3/*","N/A","N/A","N/A","8/*","3/*","N/A","N/A","N/A","N/A","N/A","N/A","N/A","3/*","N/A","N/A","3/*","8/*","N/A","3/*","N/A","8/*","N/A","N/A","N/A","N/A","N/A","N/A","8/*","N/A","N/A","8/*","N/A","3/*","3/*"]
["SL (open, A)","Magical","realm","N/A","20","N/A","15","N/A","25","3/*","20","3/*","20","10","20","N/A","N/A","15","N/A","3/*","10","3/*","1/*","20","N/A","20","3/*","20","N/A","N/A","20","8","3/*","8","N/A","20","20","10","3/*","N/A","N/A","3/*","3/*","3/*","N/A","N/A","3/*","5/*","8","3/*","3/*","8","20","N/A","8","4","N/A","N/A","20","N/A","3/*","N/A","20","20","10","7","10","10","N/A","25","3/*","N/A","3/*","1/*","1/*"]
["SL (open, B)","Magical","realm","1/*","N/A","1/*","N/A","1/*","N/A","N/A","N/A","N/A","N/A","N/A","N/A","1/*","1/*","N/A","1/*","N/A","N/A","N/A","1/*","N/A","1/*","N/A","N/A","N/A","1/*","1/*","N/A","N/A","N/A","N/A","1/*","N/A","N/A","N/A","N/A","1/*","1/*","N/A","N/A","N/A","1/*","1/*","N/A","N/A","N/A","N/A","N/A","N/A","N/A","1/*","N/A","N/A","1/*","1/*","N/A","1/*","N/A","1/*","N/A","N/A","N/A","N/A","N/A","N/A","1/*","N/A","N/A","1/*","N/A","1/*","1/*"]
["SL (open, C)","Magical","realm","N/A","40","N/A","30","N/A","50","3/*","40","3/*","40","20","40","N/A","N/A","30","N/A","3/*","20","3/*","N/A","40","N/A","40","3/*","40","N/A","N/A","40","16","3/*","16","N/A","40","40","20","3/*","N/A","N/A","3/*","3/*","3/*","N/A","N/A","3/*","10","16","3/*","3/*","16","40","N/A","16","8","N/A","N/A","40","N/A","3/*","N/A","40","40","20","14","20","20","N/A","50","3/*","N/A","3/*","N/A","N/A"]
["SL (open, D)","Magical","realm","1/*","N/A","1/*","N/A","1/*","N/A","10","N/A","10","N/A","N/A","N/A","1/*","1/*","N/A","1/*","10","N/A","10","1/*","N/A","3/*","N/A","10","N/A","1/*","1/*","N/A","N/A","10","N/A","1/*","N/A","N/A","N/A","10","1/*","1/*","10","10","10","3/*","1/*","10","N/A","N/A","10","10","N/A","N/A","1/*","N/A","N/A","1/*","3/*","N/A","1/*","10","3/*","N/A","N/A","N/A","N/A","N/A","N/A","3/*","N/A","10","3/*","10","1/*","1/*"]
["SL (open, E)","Magical","realm","1/*","N/A","2/*","N/A","1/*","N/A","20","N/A","20","N/A","N/A","N/A","1/*","1/*","N/A","1/*","20","N/A","20","1/*","N/A","10","N/A","20","N/A","1/*","1/*","N/A","N/A","20","N/A","1/*","N/A","N/A","N/A","20","1/*","1/*","20","20","20","10","1/*","20","N/A","N/A","20","20","N/A","N/A","1/*","N/A","N/A","1/*","10","N/A","1/*","20","10","N/A","N/A","N/A","N/A","N/A","N/A","10","N/A","20","10","20","1/*","1/*"]
["SL (oth realm, base, A)","Magical","realm","10","N/A","N/A","N/A","10","N/A","N/A","N/A","N/A","N/A","N/A","N/A","10","10","N/A","10","N/A","N/A","N/A","30","N/A","10","N/A","N/A","N/A","10","10","N/A","N/A","N/A","N/A","10","N/A","N/A","N/A","N/A","10","10","N/A","N/A","N/A","10","10","N/A","N/A","N/A","N/A","N/A","N/A","N/A","10","N/A","N/A","10","10","N/A","10","N/A","10","N/A","N/A","N/A","N/A","N/A","N/A","10","N/A","N/A","10","N/A","30","30"]
["SL (oth realm, cl, A)","Magical","realm","5","N/A","N/A","N/A","5","N/A","20","N/A","20","N/A","N/A","N/A","5","5","N/A","5","20","N/A","20","10","N/A","5","N/A","20","N/A","5","5","N/A","N/A","20","N/A","5","N/A","N/A","N/A","20","5","5","20","20","20","5","5","20","N/A","N/A","20","20","N/A","N/A","5","N/A","N/A","5","5","N/A","5","20","5","N/A","N/A","N/A","N/A","N/A","N/A","5","N/A","20","5","20","10","10"]
["SL (oth realm, cl, B)","Magical","realm","10","N/A","N/A","N/A","10","N/A","N/A","N/A","N/A","N/A","N/A","N/A","10","10","N/A","10","N/A","N/A","N/A","30","N/A","10","N/A","N/A","N/A","10","10","N/A","N/A","N/A","N/A","10","N/A","N/A","N/A","N/A","10","10","N/A","N/A","N/A","10","10","N/A","N/A","N/A","N/A","N/A","N/A","N/A","10","N/A","N/A","10","10","N/A","10","N/A","10","N/A","N/A","N/A","N/A","N/A","N/A","10","N/A","N/A","10","N/A","30","30"]
["SL (oth realm, op, A)","Magical","realm","4/*","N/A","N/A","N/A","4/*","N/A","N/A","N/A","N/A","N/A","N/A","N/A","4/*","4/*","N/A","4/*","N/A","N/A","N/A","4/*","N/A","5","N/A","N/A","N/A","4/*","4/*","N/A","N/A","N/A","N/A","4/*","N/A","N/A","N/A","N/A","4/*","4/*","N/A","N/A","N/A","5","4/*","N/A","N/A","N/A","N/A","N/A","N/A","N/A","4/*","N/A","N/A","4/*","5","N/A","4/*","N/A","5","N/A","N/A","N/A","N/A","N/A","N/A","5","N/A","N/A","5","N/A","4/*","4/*"]
["SL (oth realm, op, C)","Magical","realm","8","N/A","N/A","N/A","8","N/A","N/A","N/A","N/A","N/A","N/A","N/A","8","8","N/A","8","N/A","N/A","N/A","15","N/A","10","N/A","N/A","N/A","8","8","N/A","N/A","N/A","N/A","8","N/A","N/A","N/A","N/A","8","8","N/A","N/A","N/A","10","8","N/A","N/A","N/A","N/A","N/A","N/A","N/A","8","N/A","N/A","8","10","N/A","8","N/A","10","N/A","N/A","N/A","N/A","N/A","N/A","10","N/A","N/A","10","N/A","15","15"]
["SL (oth realm, op, D)","Magical","realm","10","N/A","N/A","N/A","10","N/A","N/A","N/A","N/A","N/A","N/A","N/A","10","10","N/A","10","N/A","N/A","N/A","30","N/A","15","N/A","N/A","N/A","10","10","N/A","N/A","N/A","N/A","10","N/A","N/A","N/A","N/A","10","10","N/A","N/A","N/A","15","10","N/A","N/A","N/A","N/A","N/A","N/A","N/A","10","N/A","N/A","10","15","N/A","10","N/A","15","N/A","N/A","N/A","N/A","N/A","N/A","15","N/A","N/A","15","N/A","30","30"]
["SL (other base, A)","Magical","realm","3/*","N/A","3/*","N/A","3/*","N/A","20","N/A","20","N/A","N/A","N/A","3/*","3/*","N/A","3/*","20","N/A","20","3/*","N/A","10","N/A","20","N/A","3/*","3/*","N/A","N/A","20","N/A","3/*","N/A","N/A","N/A","20","3/*","3/*","20","20","20","10","3/*","20","N/A","N/A","20","20","N/A","N/A","3/*","N/A","N/A","3/*","10","N/A","3/*","20","10","N/A","N/A","N/A","N/A","N/A","N/A","10","N/A","20","10","20","3/*","3/*"]
["SL (other base, C)","Magical","realm","4/*","N/A","4/*","N/A","4/*","N/A","N/A","N/A","N/A","N/A","N/A","N/A","4/*","4/*","N/A","4/*","N/A","N/A","N/A","4/*","N/A","N/A","N/A","N/A","N/A","4/*","4/*","N/A","N/A","N/A","N/A","4/*","N/A","N/A","N/A","N/A","4/*","4/*","N/A","N/A","N/A","N/A","4/*","N/A","N/A","N/A","N/A","N/A","N/A","N/A","4/*","N/A","N/A","4/*","N/A","N/A","4/*","N/A","N/A","N/A","N/A","N/A","N/A","N/A","N/A","N/A","N/A","N/A","N/A","N/A","4/*","4/*"]
["SL (other base, D)","Magical","realm","5","N/A","5","N/A","5","N/A","N/A","N/A","N/A","N/A","N/A","N/A","5","5","N/A","5","N/A","N/A","N/A","10","N/A","N/A","N/A","N/A","N/A","5","5","N/A","N/A","N/A","N/A","5","N/A","N/A","N/A","N/A","5","5","N/A","N/A","N/A","N/A","5","N/A","N/A","N/A","N/A","N/A","N/A","N/A","5","N/A","N/A","5","N/A","N/A","5","N/A","N/A","N/A","N/A","N/A","N/A","N/A","N/A","N/A","N/A","N/A","N/A","N/A","10","10"]
["SL (other base, E)","Magical","realm","10","N/A","10","N/A","10","N/A","N/A","N/A","N/A","N/A","N/A","N/A","10","10","N/A","10","N/A","N/A","N/A","20","N/A","N/A","N/A","N/A","N/A","10","10","N/A","N/A","N/A","N/A","10","N/A","N/A","N/A","N/A","10","10","N/A","N/A","N/A","N/A","10","N/A","N/A","N/A","N/A","N/A","N/A","N/A","10","N/A","N/A","10","N/A","N/A","10","N/A","N/A","N/A","N/A","N/A","N/A","N/A","N/A","N/A","N/A","N/A","N/A","N/A","20","20"]
["Spell Ambush","Magical","None","2","15","3","15","3","20","4","6","4","15","9","15","2","2","4","3","4","9","4","2","15","3","15","4","15","2","2","6","10","4","10","2","15","15","10","3","2","2","4","4","4","3","3","4","4","10","4","4","10","15","2","10","5","2","3","15","2","4","3","15","15","8","10","6","6","3","15","4","3","4","2","2"]
["Spell Artistery","Magical","realm","1/3","6","1/3","6","1/3","6","2/5","6","3/5","6","6","6","1/3","1/3","6","1/3","1/4","6","2/5","1/3","6","1/3","6","3/9","6","1/3","2/4","6","5","1/3","5","1/3","6","6","6","2/5","2/5","1/3","2/5","2/5","2/5","1/3","2/5","2/5","3/6","5","3/5","3/5","5","6","1/3","5","4","1/3","1/3","6","1/2","3/5","1/3","12","6","6","5","5","5","1/3","6","2/4","1/3","3/5","1/5","1/5"]
["Spell Mastery","Magical","realm","2/7","6","2/4","6","2/5","6","3/5","6","3/5","6","6","6","2/4","2/5","3/6","2/4","3/5","6","3/5","2/4","6","2/5","6","3/7","6","2/4","2/5","6","5","3/5","5","2/4","6","6","6","2/5","2/5","2/5","3/5","3/5","3/5","2/5","2/5","3/5","3/6","5","3/5","3/5","5","6","1/4","5","4","2/5","2/5","6","2/4","3/5","2/5","12","6","6","5","5","5","2/5","6","3/5","2/4","3/5","1/5","1/5"]
["Spell Trickery","Magical","Pr/Qu","2/5","6","2/4","6","2/5","6","3/5","6","3/5","6","6","6","2/4","2/5","3/6","2/4","3/5","6","3/5","2/4","6","2/5","6","3/5","6","2/6","2/4","6","5","3/5","5","2/5","6","6","6","2/5","2/5","2/5","3/5","3/5","3/5","2/5","2/5","3/5","3/6","5","3/5","3/5","5","6","1/4","5","4","2/5","2/5","6","2/4","3/5","2/5","12","6","6","5","5","5","2/5","6","3/5","2/4","3/5","1/5","1/5"]
["Staves & Wands","Magical","Em/In","1/3","9","1/4","9","2/6","8","6","10","6","6","7","9","2/5","1/4","10","2/5","6","8","6","2/5","12","1/5","10","6","9","1/4","3/7","7","8","6","8","1/4","18","9","7","4","1/4","2/5","5","6","3/7","2/5","2/5","7","3/6","4","9","6","8","9","2/5","8","4","2/6","2/5","9","2/5","6","2/5","9","9","7","5","25","9","2/5","25","3/7","2/5","3","1/4","1/4"]
["Summoning","Magical","Em/Re","2/4","6","1/4","6","2/5","7","3/6","4","6","6","4","6","2/4","1/3","2/6","2/4","2/5","5","3/8","1/5","6","2/5","6","3","6","2/5","2/5","4","5","3/6","5","2/4","6","6","6","2/5","2/5","2/5","3/6","3/6","3/8","2/5","2/5","4","2/6","5","3/6","2/5","5","6","1/4","5","3/6","2/5","2/5","10","2/4","3/6","2/5","10","6","4","6","5","5","2/5","6","3/6","1/4","2/7","1/4","1/4"]
["Symbol Lore","Magical","Re","1/4","10","1/4","5","1/4","7","1/4","5","7","5","4","5","1/4","1/4","2/6","2/4","2/4","4","3/6","2/4","5","1/4","5","3/7","5","2/4","2/4","5","4","2/4","4","2/4","5","5","5","2/5","2/4","2/5","2/5","2/4","3/6","1/4","2/5","6","2/6","4","3/6","3/6","4","5","1/4","4","3/6","1/4","2/5","5","1/3","2/4","2/5","5","5","3","4","6","3","1/4","5","2/7","1/4","2/7","1/4","1/4"]
["Targeting Skill","Magical","In","2/5","6","2/4","6","1/5","6","2/4","6","2/5","6","6","6","1/3","1/4","2/5","1/4","2/4","6","2/4","1/3","6","2/4","6","3/7","6","2/4","2/5","6","5","2/5","5","1/3","6","6","6","2/4","2/4","2/4","2/5","2/5","2/5","2/5","1/4","2/5","3/6","5","2/4","2/4","5","6","1/4","5","4","2/5","2/4","6","1/3","3/5","1/4","12","6","6","5","5","5","1/4","6","2/4","2/4","2/4","2/4","2/4"]
["Transcend Armor","Magical","realm","4","15","4","15","7","20","3/9","18","3/9","15","18","15","4","6","15","6","3/7","12","4/6","5","15","7","15","2/5","15","9","5","18","12","3/9","12","6","15","15","6","6","6","6","8","3/9","4/6","7","6","3/9","15","12","2/6","3/7","12","15","3/7","12","10","7","6","15","5","2/6","6","15","15","10","13","20","20","5","15","2/5","6","2/5","7","7"]
["Warding Lore","Magical","In/Re","1/4","5","2/4","5","2/4","8","3/6","7","5","5","4","5","2/4","1/3","2/6","2/4","2/4","4","3/6","1/4","5","2/5","5","3/7","5","2/4","1/4","7","8","3/6","4","2/4","5","10","6","2/5","2/4","2/4","3/6","3/6","3/6","2/5","2/5","3","2/6","4","2/5","2/4","4","5","1/4","4","3/6","2/4","2/5","5","1/4","3/6","2/5","10","5","3","4","5","5","2/5","6","2/6","1/4","2/4","1/4","1/4"]
["Animal Healing","Medical","Em/Re","2/5","2/6","2/6","2/5","2/6","2/6","2/5","2/6","2/6","2/6","2/6","2/6","1/5","2/6","2/6","4","2/5","2/6","2/5","1/4","2/6","2/5","2/6","1/4","2/6","2/6","1/3","2/6","2/5","2/5","2/5","2/6","2/6","2/6","2/6","2/6","2/6","2/6","2/5","2/5","2/5","2/5","2/6","2/6","2/6","2/5","1/5","1/5","2/5","2/6","2/5","2/5","2/5","2/5","2/6","2/6","1/2","2/5","2/6","2/6","2/6","2/6","2/6","2/5","2/5","3/6","6","2/6","2/4","2/5","2/6","2/6"]
["Dentistry","Medical","Re/Ag","5","7","6","7","6","8","6","5","7","7","6","7","4","6","5","5","3/6","6","3/6","3/7","7","6","5","3","7","6","2/5","5","7","6","7","6","7","7","7","5","6","6","5","7","3/6","6","5","6","5","7","3","3/6","7","7","5","7","3/6","5","5","7","4","6","8","7","7","6","7","4","4","6","7","6","6","3/6","6","6"]
["Diagnostics","Medical","In/Re","2","3","2","2/3","3/6","3","1/4","2/5","3","3","3","3","2/5","2","2/6","2/6","1/4","1/5","2/5","1/4","3","3/5","2/6","1/4","3","2","1/2","2/5","3","1/4","3","2","3","3","2/3","2/4","2","3/6","1/4","3","2/5","3/5","2/4","3","2/6","3","1/4","1/4","3","3","1/5","3","2/5","2/5","2/4","3","1/3","1/4","3/6","3","3","3","3","2/5","2/5","3/6","6","3","2/5","1/4","2","2"]
["Drug Tolerance","Medical","Co/Sd","2/5","3/5","3/6","1/4","3/6","3","2/5","1/5","3","3/5","3/5","3/5","3/6","3/6","2/6","3/5","3/6","2/3","2/5","3","3/5","3/6","2/6","3/5","3/5","3/6","2/5","1/5","2/6","2/5","2/6","3/6","3/5","3/5","3/5","3/6","3/6","3/6","1/5","2/6","2/5","3/6","3/6","1/3","2/6","2/6","3/6","3/6","2/6","3/5","3/6","2/6","2/4","3/6","3/6","3/5","2/5","2/5","3/6","3/5","3/5","1/4","2/6","2/5","2/5","2/5","2/6","3/5","2/5","3/6","3/6","3/6"]
["First Aid","Medical","Sd/Em","2/5","2/6","2/6","2/6","2/6","2/6","2/6","2/6","2/6","2/6","2/6","2/6","1/5","2/6","2/6","2/6","2/4","2/6","1/4","1/5","2/6","2/6","2/6","1/3","2/6","2/6","1/2","2/6","2/6","2/6","2/6","2/6","2/6","2/6","2/6","3/6","2/6","2/6","2/6","2/6","1/4","2/6","3/6","2/6","2/6","2/6","1/5","2/4","2/6","2/6","2/4","2/6","1/4","2/6","3/6","2/6","1/2","2/6","3/6","2/6","2/6","2/6","2/6","2/6","2/6","3/6","3/7","2/6","2/4","2/4","2/6","2/6"]
["Hypnosis","Medical","Pr/Sd","2/4","4","2/4","4","3/6","6","2/5","2/5","4","4","5","4","3/6","1/4","2/6","2/6","3/6","4","2/5","3","4","2/5","2/6","3/5","4","2/4","3/6","2/5","4","2/5","4","1/4","4","4","4","2/5","2/4","1/5","4","4","2/5","2/5","2/5","2/6","2/6","4","3/6","3/6","4","4","2/4","4","2/3","2/5","2/5","4","2/6","2/5","3","4","4","3/6","4","4","4","1/2","6","3/5","3/6","3/6","2/4","2/4"]
["Midwifery","Medical","Em/In","4","4","4","4","4","4","4","4","4","4","4","4","3/6","4","3/6","4","2/6","4","2/6","2/6","4","4","3/6","4","4","4","1/3","4","4","4","4","4","4","4","4","7","4","4","4","4","2/6","4","7","4","3/6","4","2/5","2/6","4","4","4","4","2/4","4","7","4","1/3","4","6","4","4","4","4","4","4","4","6","4","3/8","2/6","4","4"]
["Second Aid","Medical","Sd/Em/In","3/6","3/7","3/7","3/7","3/7","3/7","3/7","3/7","3/7","3/7","3/7","3/7","2/6","3/7","3/7","2/6","2/5","3/7","2/5","2/6","3/7","3/7","3/7","2/5","3/7","3/7","1/5","3/7","3/7","3/7","3/7","3/7","3/7","3/7","3/7","5","3/7","3/7","3/7","3/7","2/5","3/7","5","3/7","3/7","3/7","2/5","2/5","3/7","3/7","2/5","3/7","2/4","2/5","5","3/7","1/5","3/7","4","3/7","3/7","3/7","3/7","3/7","3/7","2/7","6","3/7","3/6","2/5","3/7","3/7"]
["Surgery","Medical","Sd/Em/In","5","7","6","7","6","8","6","5","7","7","6","7","4","6","5","5","3/6","6","3/6","3/7","7","6","5","2/4","7","6","2/5","5","7","6","7","6","7","7","7","5","6","6","5","7","3/6","6","5","6","5","7","3","3/6","7","7","5","7","3/6","5","5","7","4","6","8","7","7","6","7","4","4","6","7","6","6","3/6","6","6"]
["Awakening","Perception","In","18","2/6","18","2/7","18","2/5","5","1/4","2/6","2/6","2/7","3/7","7","18","2/6","20","5","3/5","5","5","2/6","18","3/8","6","2/6","18","18","8","1/5","5","1/5","18","1/3","2/6","2/6","18","18","8","8","5","5","18","18","2/7","2/6","1/5","3/6","5","1/5","2/6","20","1/5","18","15","18","1/3","18","5","18","2/6","4/12","2/7","2/5","8","8","15","2/6","6","18","5","18","18"]
["Battle Perception","Perception","In/Re","2/4","1/2","2/4","2/5","2/5","1/2","2/4","5","1/3","1/4","1/3","1/2","2/5","1/4","2/6","2/4","2/5","2/7","2/6","2/5","1/2","2/4","2/6","1/4","1/2","2/4","2/5","1/4","1/3","2/5","1/3","1/4","1/2","1/2","1/2/2","1/4","2/4","2/4","2/4","1/3","2/6","2/4","1/4","1/3","2/6","1/3","1/3","1/4","1/3","1/2","1/4","1/3","1/4","2/5","1/4","1/2","1/6","2/4","2/4","1/2","1/2","1/3","2/5","1/4","1/4","2/4","6","1/4","2/6","1/4","2/4","2/4"]
["Detecting Traps","Perception","In","2/5","2/4","3","1/3","2/5","2/5","1/4","2/6","2/4","1/3","1/2","2/4","3","3","2/6","3/6","1/3","1/4","3/7","2/4","2/4","3","2/6","2/6","2/4","3","3","1/4","1/3","1/4","1/3","1/4","2/4","2/4","2/4","3","3","3","2/5","1/3","3/7","1/4","3","1/2","2/6","1/3","1/4","1/3","1/3","2/4","3","1/3","2/4","1/4","3","2/4","3","1/4","3","2/4","2/4","1/2","1/4","1/4","1/4","1/4","6","2/6","3","1/3","3","3"]
["Direction Sense","Perception","In/Re","2/4","1/4","2/4","1/4","1/2","1/4","1/4","2/6","1/4","1/2","1/4","1/4","2/4","1/5","2/6","1/4","1/2","1/4","1/4","1/4","1/4","2/4","2/6","1/5","1/4","2/4","2/4","1/3","1/4","1/4","1/4","1/4","1/4","1/4","1/4","2/4","2/4","1/3","2/4","1/4","1/4","2/4","2/4","1/4","2/6","1/4","2/4","1/2","1/4","1/4","1/3","1/4","2/4","1/2","2/4","1/4","2/4","1/4","2/5","1/4","1/4","1/4","1/3","1/3","1/3","2/5","6","1/5","2/5","1/2","2/4","2/4"]
["Find Weakness","Perception","Re/In","1/3","10","3/5","10","3/5","10","7","10","7","10","10","10","1/3","1/3","1/3","3/5","7","10","7","1/3","10","1/3","10","7","10","1/3","1/3","10","10","7","10","1/3","10","10","10","7","1/3","1/3","7","7","7","3/5","3/5","7","10","10","7","7","10","10","3/5","10","10","1/3","3/5","10","7","7","3/5","10","10","10","10","10","10","1/3","10","7","3/5","7","1/3","1/3"]
["General Perception","Perception","In/Re","3","2/5","2","1/3","2","2/4","2/7","2/5","2/7","1/3","1/3","2/5","3","2","2/6","2/8","2/7","2/4","2/4","3/7","2/5","2/8","2/6","2/6","2/5","3/7","3/7","2/5","2/4","2/7","1/3","3/7","2/5","2/5","1/3","3/7","3/7","3/7","2/7","2/4","2/5","2/8","3/7","2/7","2/6","1/2","3/7","2/6","1/3","2/5","2/8","1/3","1/3","1/3","3","2/5","3/7","1/3","3/7","2/5","2/4","1/3","1/3","2/5","2/5","2/7","4","2/6","3/7","2/5","3","3/7"]
["Lie Perception","Perception","In/Re","3/5","3/5","2/5","2/5","2/4","3/5","1/2","2/6","3/5","2/6","1/4","3/5","1/4","2/4","2/6","2/6","3/5","2/5","1/3","1/4","3/5","1/3","2/6","2/5","3/5","2/5","1/3","2/5","2/5","1/2","2/5","1/4","3/5","3/5","3/5","2/4","2/5","2/4","2/4","2/5","1/3","1/3","2/4","1/5","2/6","1/3","1/3","3/5","2/5","3/5","2/4","2/5","2/4","2/4","2/4","3/5","1/3","1/2","3/6","3/5","3/5","1/5","1/2","3/5","3/5","1/4","6","2/5","1/4","3/5","2/5","2/5"]
["Locate Secret Opening","Perception","In/Re","2/5","2/5","3/6","1/4","3/6","2/6","1/5","2/6","2/5","1/4","1/2","2/5","3/6","3/6","2/6","2/6","1/4","2/4","2/5","3/5","2/5","3/6","2/6","2/6","2/5","3/6","3/6","1/4","1/4","1/5","1/4","3/6","2/5","2/5","2/5","3/6","3/6","3/6","2/5","1/4","2/5","1/4","3/6","1/3","2/6","1/4","2/4","1/4","1/4","2/5","3/5","1/4","2/4","1/4","3/6","2/5","3/6","1/5","3/6","2/5","2/5","1/3","1/4","1/4","1/4","2/5","6","2/6","3/6","1/4","3/6","3/6"]
["Poison Perception","Perception","In/Re","1/4","2/5","3","1/4","3","2/6","2","2/6","2/5","1/5","1/3","2/5","2/5","3","2/6","3/7","3","1/4","3","1/4","2/5","3","2/6","1/4","2/5","3","1/3","1/4","1/4","2","1/4","2","2/5","4/10","2/5","1/5","3","3","1/4","1/4","3","2","1/5","1/3","2/6","1/4","1/4","3","1/4","2/5","3/6","1/4","2/6","2","1/5","2/5","1/4","1/5","1/4","2/5","2/5","1/3","1/3","1/4","1/4","1/4","4","2/6","1/4","3","3","3"]
["Read Tracks","Perception","In/Re","3/7","2/5","3","1/4","2/4","1/4","2/4","2/6","1/2","1/3","3/6","2/5","2/5","2/6","2/6","3/7","1/3","3/6","3/6","1/4","2/5","3/6","2/6","2/6","2/5","3/6","2/7","2/6","1/4","2/4","1/4","3/6","2/5","2/5","2/5","3/8","3/6","3/8","2/5","1/4","3/6","2/4","3/8","1/4","2/6","1/4","2/4","1/3","1/4","2/5","1/3","3/7","1/4","1/4","3/8","2/5","2/4","1/3","3/7","2/5","2/5","1/4","2/5","2/5","2/5","2/6","6","2/6","3/5","1/3","3/6","3/6"]
["Sense Ambush","Perception","In/Re","3","1/4","3","1/4","2","1/4","1/4","2/6","1/3","1/3","1/3","1/4","3","3","2/6","3/5","1/3","2/5","1/5","3","1/4","3","2/6","2/5","1/4","3","3","1/4","1/4","1/4","1/4","2","1/4","1/4","1/4","3","3","3","1/4","1/4","1/5","2","3","1/3","2/6","1/4","1/4","1/3","1/4","1/4","3/6","1/4","2/5","1/3","3","1/4","3","1/4","3","1/4","1/4","1/3","1/4","1/4","1/4","2/5","3","2/5","3","1/3","3","3"]
["Sense Reality Warp","Perception","In/Em","1/4","6","1/2","5","3/7","9","3/6","2/6","3/6","3/6","5","6","1/3","1/3","3/8","2/4","3/6","5","3/6","2/5","6","1/3","3/8","3/8","6","1/3","3/6","2/5","5","3/6","5","1/2","6","6","6","2/5","1/3","2/5","3/6","5","3/6","1/3","2/5","3/6","3/8","3","3/6","3/6","5","6","1/3","5","3/8","1/2","2/5","6","1/5","3/6","1/4","6","3","4","6","3","3","1/4","6","3/8","1/4","3/6","1/2","1/2"]
["Spell Perception","Perception","In/Re","4/9","7","4/9","7","7","7","4/9","7","4/9","7","7","7","4/9","4/9","7","4/9","4/9","7","4/9","4/9","7","4/9","7","7","7","4/9","7","7","7","4/9","7","4/9","7","7","7","4/9","4/9","4/9","4/9","4/9","4/9","4/9","4/9","4/9","7","7","7","4/9","7","7","4/9","7","7","4/9","4/9","7","4/9","7","4/9","7","7","7","7","7","7","4/9","7","7","4/9","4/9","4/9","5/10"]
["Surveillance","Perception","In/Sd","2/6","1/3","2/6","1/4","2/6","3/6","2/5","2/6","3/6","1/3","1/4","2/5","2/6","2/6","2/6","3/5","2/6","2/3","2/6","3/6","2/5","2/6","2/6","2/5","2/5","2/6","3/6","3/6","1/4","2/5","1/4","2/5","2/5","2/5","2/5","2/6","2/6","2/6","2/6","1/4","2/6","2/5","2/6","1/2","2/6","1/4","2/6","2/6","1/4","2/5","2/4","1/4","2/3","1/5","2/6","2/5","2/6","1/2","2/6","2/5","2/5","1/2","1/4","2/5","2/5","2/3","4","2/5","2/6","2/6","2/6","2/6"]
["Time Sense","Perception","In/Re","1/3","2/5","1/2","2/4","1/3","3/6","1/3","2/6","3/5","1/3","1/4","2/5","1/4","1/4","2/6","1/4","1/3","1/4","2/4","1/4","2/5","1/4","2/6","2/5","2/5","1/4","1/2","1/4","2/4","1/3","2/4","1/4","2/5","2/5","2/5","1/3","1/4","1/3","1/4","2/4","2/4","1/3","1/3","1/4","2/6","2/4","2/4","1/3","2/4","2/5","1/3","2/4","1/4","1/3","1/3","2/5","1/4","1/3","1/4","2/5","2/5","1/4","2/4","1/4","1/4","1/3","6","2/5","1/2","1/3","1/4","1/4"]
["Tracking","Perception","In/Re","3","1/4","3","1/4","2/4","1/4","2/6","2/6","1/2","1/2","1/3","1/4","2/6","3","2/6","2/7","2/5","2/5","2/6","1/4","1/4","3","2/6","2/5","1/4","3","3/5","6","1/4","2/6","1/4","3","1/4","1/4","1/4","3","3","3","2/6","1/4","2/6","2/4","3","3","2/6","1/4","2/6","2/5","1/4","1/4","2/6","2/5","2/4","1/5","3","1/4","2/5","1/5","3","2/8","1/4","1/3","2/4","1/3","1/3","2/5","6","2/5","3/6","2/5","3","3"]
["Diplomacy","Social","Pr/In","2/5","2/5","2/4","1/3","2/4","3/6","1/4","2/4","2/5","2/6","2/4","2/5","1/4","2/5","2/6","2/5","2/6","2/4","2/6","3/8","2/5","1/4","2/6","2/4","2/5","2/4","2/4","2/4","2/5","1/3","2/5","2/4","4/9","2/5","1/5","2/6","2/4","2/4","2/6","1/4","2/6","2/5","2/6","2/5","2/6","2/5","1/4","2/4","2/5","1/3","2/6","2/5","1/4","1/5","2/6","2/5","1/5","1/4","3/8","2/5","1/3","2/5","1/3","4/10","2/5","1/4","6","2/4","3/6","2/6","2/4","2/4"]
["Duping","Social","Pr","3/5","2/6","2/5","1/4","2/6","2/4","1/4","3/7","2/6","2/6","2/4","2/6","3/6","2/5","2/6","2/6","2/6","1/4","3/5","3/6","2/6","1/3","2/6","2/7","2/6","3/5","3/6","3/7","1/4","1/2","1/4","3/5","2/6","2/6","2/6","2/5","3/5","2/6","2/6","1/4","3/5","1/4","2/5","2/4","2/6","1/4","2/4","2/6","1/4","1/4","2/4","1/4","2/6","2/4","2/5","2/6","2/4","1/4","2/5","2/6","2/6","2/4","1/3","2/6","2/6","1/4","6","2/7","1/4","2/6","3/5","3/5"]
["Gambling","Social","Re/Pr","2/6","2/4","2/6","2/5","1/5","2/5","2/6","2/6","2/4","2/6","1/3","2/4","1/4","2/6","2/6","2/4","2/6","1/3","3/5","2/6","1/5","2/4","2/6","2/5","2/4","2/6","2/4","2/6","1/4","1/3","1/4","2/5","2/4","2/4","2/4","2/5","2/6","2/5","2/6","2/6","3/5","2/5","2/5","1/3","2/6","1/4","3/6","2/6","1/4","1/3","2/4","1/4","2/5","1/3","2/5","2/4","2/4","1/5","2/7","2/4","2/4","1/3","1/4","2/4","2/4","2/4","3/7","2/5","2/5","2/6","2/6","2/6"]
["Interrogation","Social","Ag/Re","4","3/9","3","2/7","3/5","2/6","1/4","7","2/4","1/3","2/7","1/5","2/5","3","2/6","2/4","2/6","2/5","3/6","1/5","3/9","1/4","2/6","2/5","3/9","3","3/7","7","2/7","1/2","2/7","2/5","3/9","3/9","2/6","2/5","3","2/5","3","1/4","3/6","2/4","2/5","1/2","2/6","1/3","1/4","2/4","2/7","3/9","2/5","2/7","3/6","2/4","2/5","3/9","2/5","1/2","1/4","3/9","3/9","2/6","3/5","4","4","1/4","6","3/7","2/4","2/6","3","3"]
["Intimidation","Social","Pr/Re","2/5","2/6","2/5","2/5","2/6","2/5","1/4","3/6","2/6","2/6","2/6","2/6","2/6","2/5","2/6","2/6","2/6","1/2","2/5","2/6","2/6","1/2","2/6","2/5","2/6","2/5","2/6","3/6","2/5","1/2/2","2/5","2/5","2/6","2/6","2/6","2/6","2/5","2/6","2/6","1/4","2/5","1/3","2/6","2/6","2/6","2/5","2/6","2/6","2/5","2/*","2/6","2/5","2/6","2/4","2/6","2/6","2/6","1/4","2/5","2/6","2/6","2/6","2/5","2/6","2/6","1/3","3","2/5","1/4","2/6","2/5","2/5"]
["Leadership","Social","Pr/Re","2/4","2/5","2/4","2/5","2/6","2/5","1/4","1/4","2/6","3/6","2/6","1/3","2/5","2/5","2/6","2/4","2/6","2/7","2/5","2/5","3/6","1/4","2/6","2/5","2/5","2/4","2/5","1/4","2/5","1/4","2/5","2/4","4/9","2/5","1/2","2/6","2/4","2/5","2/6","1/4","2/5","1/5","2/6","2/6","2/6","2/5","2/6","1/3","2/5","1/4","2/6","2/5","2/6","2/5","2/6","2/5","1/4","1/4","2/5","2/5","2/5","2/6","2/6","2/6","2/6","1/4","6","2/5","3/6","2/6","2/4","2/4"]
["Seduction","Social","Em/Pr/Ap","2/5","2/6","2/5","2/5","2/6","2/5","1/4","3/6","2/6","2/6","2/6","2/6","2/6","2/5","2/6","2/6","2/6","1/2","2/5","2/6","2/6","1/2","2/6","2/5","2/6","2/5","2/6","3/6","2/5","1/2/2","2/5","2/5","2/6","2/6","2/6","2/6","2/5","2/6","2/6","1/4","2/5","1/3","2/6","2/6","2/6","2/5","2/6","2/6","2/5","2/*","2/6","2/5","2/6","2/4","2/6","2/6","2/6","1/4","2/5","2/6","2/6","2/6","2/5","2/6","2/6","1/3","6","2/5","1/4","2/6","2/5","2/5"]
["Acting","Subterfuge","Em/Pr/Ap","3/6","2/6","3/6","1/3","2/7","2/6","1/5","2/5","2/6","2/6","2/5","3/6","2/7","3/5","2/6","2/6","2/6","2/5","2/6","2/7","2/6","1/3","2/6","3/6","2/6","3/6","2/7","2/5","1/3","1/3","1/3","1/3","2/6","2/6","2/6","2/5","3/6","2/6","2/6","1/2","2/6","1/2","2/5","2/5","2/6","1/3","3/6","2/6","1/3","1/4","2/6","1/3","2/5","2/6","2/5","2/6","2/7","1/5","2/7","2/6","2/6","2/5","1/3","4/10","2/5","1/4","6","3/6","2/7","2/6","3/6","3/6"]
["Begging","Subterfuge","Em/Pr/Ap","2/6","2/6","2/6","2/4","2/5","3/7","1/5","3/7","2/6","2/6","1/4","3/6","2/6","2/6","2/6","4","2/6","1/5","1/4","3/6","2/6","2/6","2/6","2/6","2/6","2/6","2/6","3/7","2/4","1/5","2/4","2/6","2/6","2/6","2/6","2/6","2/6","2/5","2/6","2/4","1/4","2/4","2/6","1/4","2/6","2/4","3/6","2/6","2/4","2/6","2/7","2/4","2/4","2/5","2/6","2/6","2/6","1/5","2/6","2/6","4/12","1/4","1/4","2/6","2/6","2/6","6","2/6","2/6","2/6","2/6","2/6"]
["Bribery","Subterfuge","Pr/Re/Ap","2/6","2/6","2/6","1/4","2/5","3/7","1/5","3/8","2/6","2/6","1/3","3/6","2/6","2/6","2/6","2/4","2/6","1/4","3/6","3/6","2/6","1/4","2/6","2/6","2/6","2/6","2/6","3/8","2/4","1/5","2/4","2/6","2/6","2/6","2/6","2/6","2/6","2/5","2/6","2/4","3/6","2/4","2/6","1/4","2/6","2/4","3/6","2/6","2/4","2/6","1/5","2/4","2/4","2/5","2/6","2/6","2/6","1/5","2/6","2/6","4/10","1/4","1/3","2/6","2/6","1/4","6","2/6","2/6","2/6","2/6","2/6"]
["Camouflage","Subterfuge","Re/In","6","2/5","5","1/3","6","1/4","2/7","3/5","2/5","1/5","3/7","2/5","5","5","2/6","4","1/5","2/6","2/6","2","2/5","3","2/6","2/7","2/5","5","6","3/5","1/3","2/4","1/3","3","2/5","2/5","2/5","6","5","5","2/7","1/3","2/6","2","6","1/3","2/6","1/3","2/5","1/4","1/3","2/5","6","1/3","3/7","6","6","2/5","6","2/7","6","2/5","2/5","1/3","2/5","2/4","2/4","3","6","2/7","6","1/5","5","5"]
["Disarm Traps","Subterfuge","In/Ag","4","3/8","7","2/5","7","2/5","4","3/8","2/6","4","1/3","7","7","7","3/9","6","4","3","5","7","4","8","6","4","3/8","7","8","3/6","2/5","6","2/5","8","3/8","3/8","3","5","7","7","4","2/6","6","7","7","3/7","3/6","1/3","7","4","2/5","4","8","2/6","3/9","7","8","3/8","7","3/6","7","3/8","3/8","1/3","3/6","3/9","3/9","7","6","4","8","4","7","7"]
["Disguise","Subterfuge","Pr/Sd","3/6","2/6","3/6","1/3","2/7","3/7","1/5","1/4","2/6","2/6","1/3","3/6","2/7","3/6","2/6","5","2/6","1/3","2/6","2/7","2/6","1/3","2/6","2/6","2/6","3/6","2/7","1/4","2/5","1/3","2/5","1/3","2/6","2/6","2/6","2/7","3/6","2/6","2/6","1/3","2/6","1/2","2/7","1/3","2/6","1/3","3/6","2/6","2/5","2/6","2/7","2/5","2/7","2/6","2/7","2/6","2/7","1/5","2/7","2/6","6","1/3","1/4","2/5","2/5","2/5","6","2/6","2/7","2/6","3/6","3/6"]
["Falsification","Subterfuge","Sd/Re","1/3","3","3","2/4","3","3","3","6","3","3","1/3","6","3","3","2/6","4","3","1/5","5","3","3","2/4","2/6","3","3","3","3","6","2/4","2/5","2/4","2/4","3","3","3","3","3","3","3","2/4","5","2/4","3","1/3","2/6","2/4","6","3","2/4","3","2/4","2/4","1/3","3","3","3","3","1/5","3","3","3","1/3","1/4","1/4","1/4","2/6","6","3","3","3","3","3"]
["Hide Item","Subterfuge","Re/In","6","2/5","5","1/3","6","2/5","2/7","2/4","2/5","1/5","1/3","3","5","5","2/6","2/6","1/5","1/4","3","3","2/5","3","2/6","3/6","2/5","5","6","2/4","1/3","2/7","1/3","3","2/5","2/5","2/5","6","5","5","2/7","1/3","3","2","6","1/3","2/6","1/3","3","1/5","1/3","2/5","6","1/3","2/6","6","6","2/5","4","2/7","6","2/5","2/5","1/3","1/4","2/4","2/4","2/5","6","3/6","6","1/5","5","5"]
["Jesting","Subterfuge","Pr/Re","2/5","2/6","2/5","2/5","2/6","2/5","1/4","3/6","2/6","2/6","2/6","2/6","2/6","2/5","2/6","2/6","2/6","1/2","2/5","2/6","2/6","1/2","2/6","2/5","2/6","2/5","2/6","3/6","2/5","1/2/2","2/5","2/5","2/6","2/6","2/6","2/6","2/5","2/6","2/6","1/4","2/5","1/3","2/6","2/6","2/6","2/5","2/6","2/6","2/5","2/*","2/6","2/5","2/6","2/4","2/6","2/6","2/6","1/4","2/5","2/6","2/6","2/6","2/5","2/6","2/6","1/3","6","2/5","1/4","2/6","2/5","2/5"]
["Mimery","Subterfuge","Ag/Sd","3/6","2/6","3/6","1/3","2/7","2/6","1/5","2/5","2/6","2/6","2/5","3/6","2/7","3/6","2/6","3/6","2/6","2/5","2/7","2/7","2/6","1/3","2/6","2/6","2/6","3/6","2/7","2/5","1/3","1/5","1/3","1/3","2/6","2/6","2/6","2/7","3/6","2/6","2/6","1/3","2/7","1/2","2/7","2/5","2/6","1/3","3/6","2/6","1/3","2/6","3/6","1/3","2/5","2/6","2/7","2/6","2/7","1/5","2/7","2/6","2/6","2/5","1/4","2/5","2/5","2/5","6","2/6","2/7","2/6","3/6","3/6"]
["Pick Locks","Subterfuge","In/Re/Ag","4","3/9","7","2/5","7","4","4","3/8","2/5","3/6","1/3","7","8","8","3/9","4","4","1/4","6","8","4","8","5","5","3/9","8","8","6","2/6","6","2/6","8","3/9","3/9","3","5","8","8","4","2/6","8","7","7","2/7","3/6","2/6","7","4","2/6","4","8","2/6","3/7","7","8","3/9","8","3/6","7","3/9","3/9","1/3","3/6","3/9","3/9","7","6","5","8","4","8","8"]
["Pick Pockets","Subterfuge","Ag/In","3","3/6","3","1/3","3","2/6","2/4","4","2/6","2/5","1/3","4","3","3","2/6","3","2/5","2/4","2/5","3","3/6","3","2/6","3/5","3/6","3","3","4","1/3","1/5","1/3","1/5","3/6","3/6","3/6","3","3","3","2/5","1/3","2/5","2/5","3","1/3","2/6","1/3","4","2/5","1/3","3/6","3","1/3","2/5","2/5","3","3/6","3","2/4","3","3/6","3/6","1/2","1/3","2/5","2/5","3","6","3/5","3","2/5","3","3"]
["Set Traps","Subterfuge","Re/Ag","4","2/4","7","2/5","7","2/4","4","3/7","2/4","1/3","1/3","7","7","2/5","2/6","6","4","2/6","6","2/4","3/8","8","1/5","4","3/8","7","8","3/7","2/5","4","1/3","8","3/8","3/8","3/8","7","7","7","4","2/5","6","7","7","1/3","2/6","2/5","7","2/4","2/5","3/8","7","2/5","3/6","7","7","3/8","7","4","7","3/8","3/8","1/3","2/5","3/9","3/9","6","6","4","2/5","2/4","7","7"]
["Stalk & Hide","Subterfuge","Ag/Sd","6","2/5","5","1/3","6","1/5","2/7","3/8","1/4","1/4","1/3","5","5","5","3/9","5","1/5","1/4","3","3/7","3/9","3","2/7","3/7","2/5","5","6","1/5","1/3","2/5","1/3","3","2/5","2/5","2/6","2/5","5","5","2/7","2/5","4","2","6","1/5","2/6","1/3","5","1/4","1/3","3/9","5","2/4","3","6","2","2/5","3","2/5","6","2/5","2/5","1/3","2/5","2/4","2/4","3","6","2/7","5","2/5","5","5"]
["Taunting","Subterfuge","In","4","3/8","7","2/5","7","2/5","4","3/8","2/6","4","1/3","7","7","7","3/9","6","4","3","5","7","4","8","6","4","3/8","7","8","3/6","2/5","6","2/5","8","3/8","3/8","3","5","7","7","4","2/6","6","7","7","3/7","3/6","1/3","7","4","2/5","4","8","2/6","3/9","7","8","3/8","7","3/6","7","3/8","3/8","1/3","3/6","3/9","3/9","7","6","4","8","4","7","7"]
["Trapbuilding","Subterfuge","Re/Em","1/5","2/6","3/6","2/4","3/6","2/6","2/6","6","2/6","2/5","2/4","3/6","3/6","3/6","2/4","3/6","2/5","2/6","2/6","2/5","2/6","3/6","2/6","2/6","2/6","3/6","4","6","4","2/6","2/6","2/6","2/6","2/6","2/6","2/5","3/6","3/6","4","1/3","2/6","3/6","3/6","2/6","2/6","4","3/6","4","2/5","2/6","3/6","4","3/6","3/6","3/6","2/6","2/6","2/6","3/6","4","2/6","2/5","4","4","4","3/5","6","2/7","2/6","2/5","3/6","3/6"]
["Trickery","Subterfuge","Pr/Qu","3","2/6","3","1/3","3","2/6","2/4","2/5","2/6","2/5","1/2","3","3","3","2/6","4","2/5","1/4","3","3","2/6","1/4","2/6","3/6","2/6","3","3","2/5","1/3","1/5","1/3","1/4","2/6","2/6","2/6","3","3","3","2/5","1/3","3","1/5","3","1/2","2/6","1/3","3","2/5","1/3","2/6","3","1/3","2/6","1/5","3","2/6","3","2/4","3","2/6","2/6","1/2","1/4","1/4","1/4","2/6","6","3/6","3","2/5","3","3"]
["Caving","Survivial","Sd/Re","3","2/6","3","2/4","3","2/6","2/6","6","2/6","2/6","1/4","2/6","2/7","3","2/6","1/3","2/7","2/6","2/6","2/7","2/6","3","2/6","3/7","2/6","3","2/7","6","2/4","2/6","4/8","3","2/6","2/6","2/6","2/5","3","3","2/6","2/4","2/6","3","2/5","3/6","2/6","4/8","3/6","2/6","2/4","2/6","3","2/4","2/6","1/2","2/5","2/6","2/7","2/6","3","2/6","2/6","1/4","2/6","2/5","2/5","3","6","3/7","2/7","2/6","3","3"]
["Fire Starting","Survivial","Re/Ag","2/5","1/4","2/6","2/5","2/6","1/2","2/6","2/5","1/4","1/3","2/6","2/6","2/5","2/6","1/5","2/6","2/5","2/6","2/4","1/3","2/6","2/6","1/5","2/6","2/6","2/6","2/5","6","1/4","2/6","1/2","2/7","2/6","2/6","2/6","2/6","2/6","2/6","2/6","2/5","2/4","2/6","2/6","2/6","2/6","1/3","2/6","1/3","1/5","2/6","2/6","2/5","2/6","2/5","2/6","2/6","1/5","2/6","2/6","2/6","2/6","1/3","1/5","2/6","2/6","2/6","6","2/6","1/5","1/3","2/6","2/7"]
["Foraging","Survivial","In/Re","2/5","2/6","2/6","2/5","2/6","2/6","2/6","6","1/4","1/3","2/6","2/6","2/5","2/6","2/6","2/6","2/5","2/6","2/4","1/5","2/6","2/6","2/6","2/6","2/6","2/6","2/5","6","2/5","2/6","2/5","2/7","2/6","2/6","2/6","2/6","2/6","2/6","2/6","2/5","2/4","2/6","2/6","2/6","2/6","1/3","2/6","1/3","2/5","2/6","2/6","2/5","2/6","1/4","2/6","2/6","2/5","2/6","2/6","2/6","2/6","2/6","2/5","2/6","2/6","2/6","6","2/6","2/5","1/3","2/6","2/6"]
["Hostile Environment","Survivial","Ag/Sd","3","2/8","3","1/4","3","1/3","3/6","2/3","2/5","2/4","3/6","1/4","3","3","2/6","3","3","2/6","3/5","1/4","1/4","2/7","2/6","2/4","1/4","3","3","2/3","1/4","3/6","1/4","3","1/2","1/4","1/4","3","3","3","3/6","1/4","3/5","2/7","3","3/6","2/6","1/4","2/6","2/4","1/4","1/4","3","1/4","2/7","3","3","1/4","2/4","3/6","2/7","1/4","1/4","2/6","1/4","1/3","2/5","3","6","2/4","2/5","2/4","3","3"]
["Region Lore","Survivial","Re","2/5","2/6","2/6","2/5","2/6","2/6","2/6","2/6","1/3","1/3","2/6","2/6","2/5","2/6","2/6","2/4","2/5","2/6","2/6","1/5","2/6","2/6","1/4","2/6","2/6","2/6","2/5","2/6","2/5","2/6","1/3","2/7","2/6","2/6","2/6","2/6","2/6","2/6","2/6","2/5","2/6","2/6","2/6","2/6","2/6","2/5","2/6","1/3","2/5","2/6","1/2","2/5","1/4","1/4","2/6","2/6","2/5","2/6","2/6","2/6","2/6","2/6","2/5","2/6","2/6","2/5","3","2/6","2/5","1/3","2/6","2/6"]
["Scrounge","Survivial","In/Re","2/5","2/6","2/6","1/3","2/6","2/6","2/6","3/7","2/6","1/5","1/4","2/6","2/5","2/6","2/6","2/4","2/5","1/3","2/6","1/5","2/6","2/6","2/6","2/6","2/6","2/6","2/5","3/7","1/3","2/6","2/6","2/7","2/6","2/6","2/6","2/6","2/6","2/6","2/6","1/3","2/6","2/6","2/6","1/4","2/6","1/3","2/6","2/6","1/3","2/6","1/2","1/3","2/5","1/4","2/6","2/6","2/5","2/6","2/6","2/6","2/6","1/4","1/4","2/5","2/5","2/5","6","2/6","2/5","2/6","2/6","2/6"]
["Streetwise","Survivial","Pr/In","2/7","1/4","3/6","1/3","2/3","3/8","1/4","4","3/6","1/4","1/2","1/4","2/6","2/7","2/4","3/7","2/6","1/3","1/4","3/7","1/4","1/3","2/4","2/5","1/4","3","2/7","4","1/3","1/4","1/3","3/6","1/4","1/4","1/4","2/5","3","2/5","3/7","1/3","1/4","1/3","2/5","1/3","2/4","1/3","4","3/8","1/3","1/4","2/4","1/3","1/4","1/4","2/5","1/4","2/4","1/3","1/4","1/4","1/4","1/2","1/4","2/4","2/4","2/3","6","2/5","1/4","3/8","3","3"]
["Indexnr för att kunna leta upp kolumn",null,null,"4","6","7","10","12","13","14","15","16","17","18","19","21","22","24","26","27","28","30","34","35","37","38","94","39","40","43","44","45","46","47","48","49","50","52","53","54","59","60","61","62","63","64","65","66","68","69","71","72","73","75","76","77","79","80","81","82","83","84","85","87","88","89","90","91","92","93","94","95","96","97","97"]

{"sheet":"2nd","index":10,"n_rows":18,"n_cols":96,"rows_kept":18,"cut":false,"hidden":false,"merged":[]}
["Profession","Alchemist","Animist","Archer","Archmage","Arcist","Arms Master","Assassin","Astral Traveller","Astrologer","Barbarian","Bard","Bashkar","Beastmaster","Bounty Hunter","Burglar","Cavalier","Chaotic Lord","Channeler","Conjuror","Crafter","Craftsman","Creator","Crystal mage","Cultist","Dancer","Delver","Dervish","Doppelgänger","Dream Lord Illusionist","Dream Lord Shaman","Druid","Duelist","Elementalist","Enchanter","Farmer","Feldsher","Fighter","Forcemage","Free Thinker","Gypsy","Healer","High War monk","Horseman","Houri","Hunter","Illusionist","Indurate","Lancer","Lay Healer","Leader","Macabre","Magician","Magus Chan","Magus Chan/Ess","Magus Ess","Maleficant","Mentalist","Monk","Montebanc","Moon Mage","Mystic","Necromancer","Nightblade","No Profession","Noble Warrior","Outrider","Paladin","Ranger (old)","Ranger","Rogue","Romantic","Runemaster","Sage","Sailor","Scholar","Seeker","Seer","Shadow Mage","Shaikan","Shaman","Sleuth","Sorceror","Swordsman","Tarotmage","Templar","Thief","Trader","Trench Fighter","War Monk","Warlock","Warrior","Warrior Mage","Witch","Witch Hunter","Wizard"]
["Academic",34,17,8,34,32,9,12,29,34,8,23,6,10,12,10,16,12,19,34,26,16,25,22,17,9,23,11,13,18,18,15,14,22,22,12,16,14,29,33,10,22,8,10,11,8,23,10,10,22,16,30,30,30,30,30,25,30,18,16,22,30,25,9,20,9,12,16,12,12,10,14,24,38,8,40,32,26,25,12,22,16,30,8,17,18,10,13,11,10,26,6,16,24,14,30]
["Animal & Survival",2,14,13,2,2,2,7,0,3,14,3,6,15,11,7,5,0,2,0,0,7,0,6,0,2,3,1,3,0,0,16,5,3,1,19,5,11,3,2,8,4,2,16,2,15,3,5,15,5,9,4,0,3,3,3,5,0,3,6,3,0,4,0,8,2,14,8,13,15,8,4,0,3,6,5,2,3,4,6,13,5,3,8,0,8,10,10,10,9,3,9,5,11,14,0]
["Athletic & Gymnastic",0,3,9,0,0,5,18,0,0,20,3,20,13,13,18,12,4,0,0,3,8,0,0,8,34,6,30,0,0,0,4,20,8,7,10,9,18,0,3,12,0,27,14,8,10,0,20,12,0,16,3,0,0,0,0,0,0,18,7,9,0,0,23,7,3,9,7,14,14,16,11,0,0,19,0,0,0,0,21,3,6,0,16,0,10,15,3,20,27,0,14,9,1,8,0]
["Combat & Deadly",0,0,19,0,0,11,21,0,0,24,9,28,12,17,16,22,6,4,0,0,2,0,0,17,11,3,13,0,0,0,3,21,10,0,8,19,19,0,0,9,0,17,18,12,11,0,25,18,0,14,8,0,0,0,0,0,0,12,10,9,0,1,17,10,11,14,18,14,14,19,16,0,0,16,0,0,0,1,18,0,12,0,20,0,18,19,10,22,14,0,26,16,0,14,0]
["Concentration",1,4,12,4,8,2,8,10,6,14,1,16,2,4,4,7,3,3,5,3,0,7,5,6,8,4,8,7,8,8,4,12,6,8,2,6,8,5,9,4,7,20,2,2,10,5,14,9,8,6,3,5,5,5,5,5,14,10,6,5,10,5,9,5,2,0,6,3,3,6,10,5,7,2,5,5,10,5,15,6,2,5,10,4,8,3,0,11,11,5,12,5,5,6,8]
["Deadly",null,null,null,null,null,0,null,0,null,null,null,null,null,null,null,null,0,null,null,0,null,0,null,null,null,0,null,0,0,0,null,null,null,null,null,null,null,null,0,null,null,null,null,null,null,null,null,null,null,null,null,null,null,null,null,0,null,null,null,null,null,null,null,null,0,null,null,null,null,null,null,0,null,null,null,null,null,null,null,null,null,null,null,0]
["Evaluation",null,null,null,null,null,2,null,2,null,null,null,null,null,null,null,null,2,null,null,14,null,2,null,null,null,8,null,3,2,2,null,null,null,null,null,null,null,null,4,null,null,null,null,null,null,null,null,null,null,null,null,null,null,null,null,2,null,null,null,null,null,null,null,null,2,null,null,null,null,null,null,2,null,null,null,null,null,null,null,null,null,null,null,6]
["General & Evaluation",22,10,9,7,8,5,6,3,5,5,20,6,12,8,11,9,2,14,5,15,24,3,12,9,5,14,3,6,3,3,7,12,13,10,20,6,5,9,3,18,8,4,7,9,15,5,3,8,8,9,4,11,9,9,9,3,5,5,9,5,5,8,5,22,2,7,4,11,11,12,11,3,7,16,16,15,5,8,9,8,8,2,9,10,10,11,23,6,4,5,8,2,11,8,7]
["Gymnastic",null,null,null,null,null,3,null,0,null,null,null,null,null,null,null,null,3,null,null,0,null,0,null,null,null,4,null,0,0,0,null,null,null,null,null,null,null,null,0,null,null,null,null,null,null,null,null,null,null,null,null,null,null,null,null,null,null,null,null,null,null,null,null,null,0,null,null,null,null,null,null,0,null,null,null,null,null,null,null,null,null,null,null,0]
["Linguistic",3,3,5,6,6,3,5,3,6,0,13,0,3,5,3,4,3,6,8,3,3,3,3,3,6,13,3,5,3,3,3,0,3,10,3,3,3,3,6,8,3,3,3,6,3,8,0,3,3,4,3,3,3,3,3,3,5,3,6,5,5,3,4,2,4,7,5,3,3,3,8,5,14,6,14,6,8,3,3,3,3,5,2,3,6,3,7,3,3,3,1,3,6,4,3]
["Magical",26,20,0,36,33,8,0,14,26,0,12,0,12,0,0,0,8,22,36,8,0,14,26,12,0,8,12,18,14,14,20,0,18,20,0,12,0,26,0,1,21,0,0,12,0,22,0,0,21,0,28,30,30,30,30,24,22,12,12,20,22,26,12,0,8,0,12,12,12,0,0,18,20,0,0,18,24,26,0,26,12,32,0,18,0,0,0,0,0,26,0,14,20,12,30]
["Medical",0,10,5,2,2,2,2,2,2,2,0,2,4,2,2,5,2,10,0,2,4,2,8,6,5,3,3,2,2,2,13,2,0,2,6,11,4,0,2,6,23,6,7,4,4,2,5,8,23,5,2,2,2,2,2,8,2,6,2,1,2,11,2,2,3,6,7,4,4,2,0,2,1,2,6,0,0,11,2,7,5,3,5,5,5,1,2,2,6,2,6,2,9,4,2]
["Perception",5,10,8,2,2,2,6,0,8,6,3,4,6,12,8,6,2,10,5,2,8,0,10,6,5,3,3,2,0,0,8,0,8,5,6,4,7,10,0,5,6,3,10,9,12,10,5,8,6,7,0,4,4,4,4,6,6,4,10,5,10,3,8,8,2,12,5,8,8,7,4,5,3,6,3,13,14,3,8,3,10,3,6,0,5,8,7,6,5,11,6,6,5,10,6]
["Social & Subterfuge",2,4,10,0,0,2,13,0,0,0,14,3,6,11,16,10,0,7,2,0,10,0,0,11,7,8,10,0,0,0,3,6,0,9,4,2,5,5,3,15,0,0,6,20,8,13,5,4,0,12,9,5,5,5,5,4,10,4,20,7,9,4,11,16,2,20,6,5,6,12,12,0,0,11,2,1,0,4,6,3,15,7,8,0,8,14,15,0,2,12,2,12,5,8,5]
["Subterfuge",null,null,null,null,null,0,null,0,null,null,null,null,null,null,null,null,2,null,null,0,null,0,null,null,null,3,null,5,0,0,null,null,null,null,null,null,null,null,2,null,null,null,null,null,null,null,null,null,null,null,null,null,null,null,null,2,null,null,null,null,null,null,null,null,0,null,null,null,null,null,null,0,null,null,null,null,null,null,null,null,null,null,null,0]
["Survival",null,null,null,null,null,4,null,3,null,null,null,null,null,null,null,null,4,null,null,3,null,3,null,null,null,6,null,3,3,3,null,null,null,null,null,null,null,null,3,null,null,null,null,null,null,null,null,null,null,null,null,null,null,null,null,7,null,null,null,null,null,null,null,null,3,null,null,null,null,null,null,3,null,null,null,null,null,null,null,null,null,null,null,3]
["SUMMA",{"$f":"SUM(B2:B17)","v":95},95,98,93,93,60,98,66,90,93,101,91,95,95,95,96,53,97,95,79,82,59,92,95,92,109,97,67,53,53,96,92,{"$f":"SUM(AH2:AH17)","v":91},94,90,{"$f":"SUM(AK2:AK17)","v":93},94,90,70,96,94,90,93,95,96,91,92,95,96,98,94,90,91,91,91,94,94,95,104,91,93,90,100,100,53,{"$f":"SUM(BO2:BO17)","v":101},94,99,102,95,90,67,93,92,91,92,90,90,100,94,94,90,92,66,96,94,90,91,91,93,90,90,97,102,91]