{"text_format":"1","workbook":"xlsx","n_sheets":11,"sheets":["Info","Ny NPC","Secondary","Bonuses","Items","Spells","Rasbonus","Diverse","Levelbonus","AllaSkills","2nd"],"not_rendered":{"charts":0,"images":2,"macros":1,"external_links":0,"defined_names":20,"comments":4,"pivot_tables":0},"unopened":[],"bounds":{"document_bytes":16777216,"sheet_cells":100000,"rows_first":2000,"rows_last":500,"rows_between":2000,"halvings":0,"cell_chars":16384,"cell_head_chars":4096},"cells_cut":0,"cells_raw":0,"read":"whole","date_system":"1900"}

{"sheet":"Info","index":0,"n_rows":24,"n_cols":1,"rows_kept":24,"cut":false,"hidden":false,"merged":[[9,0,11,0],[23,0,24,0],[3,0,5,0]]}
[]
[]
["Character generator, ver 1.0 Middle-Earth edition"]
["Jag tog den av Charlie och förädlade den. Välkommen till 2011, nu kan vi göra rollpersoner i datan. Jag har ändrat och lagt till mycket och glömt bort att skriva versioninfo tyvärr, så ja…  men allt funkar. Tror jag."]
[]
[]
[]
[]
["NPC-generator, ver 0.6 Georgetown edition"]
["Är du less på att göra NPCs och försöka klura ut en rimlig OB? Det hoppas jag att du slipper. Den här kalkylen genererar en NPC utan namn, de NPC som har namn bör göras lika noggrant som en vanlig karaktär."]
[]
[]
[]
["Vad behöver du?"]
["Ett kalkylprogram kompatibelt med Excel 97. OpenOffice.org är tyvärr inte det ännu…"]
["Aktivera makron (eller nöj dig med att göra bara en NPC)."]
["Troligtvis behöver du ha spelat RoleMaster i Spelföreningen Stonehenge också…"]
["En skärmupplösning som är 1024 x 768 eller ett fönster som är så stort…"]
[]
[]
["Hjälp, jag fattar ingenting av det här!"]
[]
[]
[{"$f":"OFFSET(Diverse!K1,Diverse!L1-1,0)","v":"Svar på tal, din jävla tattare… du med så sparsam intellektuell begåvning ska passa dig noga!"}]

{"sheet":"Ny NPC","index":1,"n_rows":73,"n_cols":28,"rows_kept":73,"cut":false,"hidden":false,"merged":[[10,17,13,17],[16,17,17,17],[19,35,19,36],[61,10,62,13],[71,15,71,17],[62,15,62,17],[67,15,67,17],[68,15,68,17],[69,15,69,17],[70,15,70,17],[63,15,63,17],[64,15,64,17],[65,15,65,17],[66,15,66,17]]}
[]
[1,"Cost",1,"Hur ofta sätter du ut kryss?","Rank","Cost1","Cost2","Cost",null,"Skill","Stat","Lvl","Ras","Misc","Item","Total",null,"Character Name",null,null,"Temp","Dev","Pot","Stat","Ras","B.O","Spec","Tot"]
["AM Balance",{"$f":"VLOOKUP(A3,AllaSkills!$A$3:$BV$317,$A$2+3,FALSE)","v":"6"},0,{"$f":"INDEX(Diverse!$H$1:$H$5,$C3+1)","v":"Nada"},{"$f":"ROUND(Level*(C3/2),0)+VLOOKUP($A3,Rasbonus!$A$29:$AJ$59,MATCH(Ras,Rasbonus!$A$1:$AJ$1,0),FALSE)","v":0},{"$f":"IF(LEN(B3)=3,LEFT(B3,1),IF(LEN(B3)<3,B3,99))","v":"6"},{"$f":"IF(RIGHT(B3,1)=\"*\",LEFT(B3,1),IF(LEN(B3)=3,RIGHT(B3,1),IF(LEN(B3)<3,B3,RIGHT(B3,2))))","v":"6"},{"$f":"IF(D3=\"Ett varannan level\",F3+F3-F3,IF(D3=\"Ett varje level\",2*F3,IF(D3=\"Tre på två levlar\",F3+G3+F3,IF(D3=\"Nada\",0,F3+G3+F3+G3))))","v":0},{"$f":"HLOOKUP(Yrke,Levelbonus!$B$1:$CR$20,6,0)","v":0},{"$f":"IF(E3<1,-25,IF(E3>30,80+((E3-30)*0.5),IF(E3>20,70+(E3-20),IF(E3>10,50+((E3-10)*2),E3*5))))","v":-25},{"$f":"ROUND((AG+SD)/2,0)","v":5},{"$f":"IF(Level<21,Level*I3,IF(I3>2,60+(Level-20),IF(I3=2,40+((Level-20)*0.5),IF(Level=0,0,IF(I3=0,0,20)))))","v":0},{"$f":"IF(ISNUMBER(VLOOKUP($A3,Rasbonus!$A$61:$AJ$295,MATCH(Ras,Rasbonus!$A$1:$AJ$1,0),FALSE)),VLOOKUP($A3,Rasbonus!$A$61:$AJ$295,MATCH(Ras,Rasbonus!$A$1:$AJ$1,0),FALSE),0)","v":0},{"$f":"IF($AB$58>16,$P$23,IF($AB$58>12,$P$22, IF($AB$58>8,$P$21,IF($AB$58>4,$P$20,\"0\"))))","v":"0"},null,{"$f":"SUM(J3:O3)","v":-20},null,"Yrke",null,"Constitution",75,{"$f":"VLOOKUP(U3,Diverse!$A$2:$C$131,3,0)","v":7},null,{"$f":"VLOOKUP(U3,Diverse!$A$2:$B$131,2,0)","v":5},{"$f":"HLOOKUP(Ras,Rasbonus!$B$1:$AJ$12,2,0)","v":15},null,null,{"$f":"SUM(X3:AA3)","v":20}]
["AM Landing",{"$f":"VLOOKUP(A4,AllaSkills!$A$3:$BV$317,$A$2+3,FALSE)","v":"6"},0,{"$f":"INDEX(Diverse!$H$1:$H$5,$C4+1)","v":"Nada"},{"$f":"ROUND(Level*(C4/2),0)","v":0},{"$f":"IF(LEN(B4)=3,LEFT(B4,1),IF(LEN(B4)<3,B4,99))","v":"6"},"6",{"$f":"IF(D4=\"Ett varannan level\",F4+F4-F4,IF(D4=\"Ett varje level\",2*F4,IF(D4=\"Tre på två levlar\",F4+G4+F4,IF(D4=\"Nada\",0,F4+G4+F4+G4))))","v":0},{"$f":"HLOOKUP(Yrke,Levelbonus!$B$1:$CR$20,6,0)","v":0},{"$f":"IF(E4<1,-25,IF(E4>30,80+((E4-30)*0.5),IF(E4>20,70+(E4-20),IF(E4>10,50+((E4-10)*2),E4*5))))","v":-25},{"$f":"ROUND((AG+SD)/2,0)","v":5},0,{"$f":"IF(ISNUMBER(VLOOKUP($A4,Rasbonus!$A$61:$AJ$295,MATCH(Ras,Rasbonus!$A$1:$AJ$1,0),FALSE)),VLOOKUP($A4,Rasbonus!$A$61:$AJ$295,MATCH(Ras,Rasbonus!$A$1:$AJ$1,0),FALSE),0)","v":0},{"$f":"IF($AB$58>16,$P$23,IF($AB$58>12,$P$22, IF($AB$58>8,$P$21,IF($AB$58>4,$P$20,\"0\"))))","v":"0"},null,{"$f":"SUM(J4:O4)","v":-20},null,null,null,"Agility",75,{"$f":"VLOOKUP(U4,Diverse!$A$2:$C$131,3,0)","v":7},null,{"$f":"VLOOKUP(U4,Diverse!$A$2:$B$131,2,0)","v":5},{"$f":"HLOOKUP(Ras,Rasbonus!$B$1:$AJ$12,3,0)","v":-5},null,null,{"$f":"SUM(X4:AA4)","v":0}]
["AM Leaping",{"$f":"VLOOKUP(A5,AllaSkills!$A$3:$BV$317,$A$2+3,FALSE)","v":"6"},0,{"$f":"INDEX(Diverse!$H$1:$H$5,$C5+1)","v":"Nada"},{"$f":"ROUND(Level*(C5/2),0)","v":0},{"$f":"IF(LEN(B5)=3,LEFT(B5,1),IF(LEN(B5)<3,B5,99))","v":"6"},"6",{"$f":"IF(D5=\"Ett varannan level\",F5+F5-F5,IF(D5=\"Ett varje level\",2*F5,IF(D5=\"Tre på två levlar\",F5+G5+F5,IF(D5=\"Nada\",0,F5+G5+F5+G5))))","v":0},{"$f":"HLOOKUP(Yrke,Levelbonus!$B$1:$CR$20,6,0)","v":0},{"$f":"IF(E5<1,-25,IF(E5>30,80+((E5-30)*0.5),IF(E5>20,70+(E5-20),IF(E5>10,50+((E5-10)*2),E5*5))))","v":-25},{"$f":"ROUND((AG+SD)/2,0)","v":5},0,{"$f":"IF(ISNUMBER(VLOOKUP($A5,Rasbonus!$A$61:$AJ$295,MATCH(Ras,Rasbonus!$A$1:$AJ$1,0),FALSE)),VLOOKUP($A5,Rasbonus!$A$61:$AJ$295,MATCH(Ras,Rasbonus!$A$1:$AJ$1,0),FALSE),0)","v":0},{"$f":"IF($AB$58>16,$P$23,IF($AB$58>12,$P$22, IF($AB$58>8,$P$21,IF($AB$58>4,$P$20,\"0\"))))","v":"0"},null,-20,null,null,null,"Self Discipline",75,{"$f":"VLOOKUP(U5,Diverse!$A$2:$C$131,3,0)","v":7},null,{"$f":"VLOOKUP(U5,Diverse!$A$2:$B$131,2,0)","v":5},{"$f":"HLOOKUP(Ras,Rasbonus!$B$1:$AJ$12,4,0)","v":5},null,null,{"$f":"SUM(X5:AA5)","v":10}]
["AM Speed",{"$f":"VLOOKUP(A6,AllaSkills!$A$3:$BV$317,$A$2+3,FALSE)","v":"6"},0,{"$f":"INDEX(Diverse!$H$1:$H$5,$C6+1)","v":"Nada"},{"$f":"ROUND(Level*(C6/2),0)+VLOOKUP($A6,Rasbonus!$A$29:$AJ$59,MATCH(Ras,Rasbonus!$A$1:$AJ$1,0),FALSE)","v":0},"6","6",0,{"$f":"HLOOKUP(Yrke,Levelbonus!$B$1:$CR$20,6,0)","v":0},-25,{"$f":"ROUND((AG+SD)/2,0)","v":5},0,{"$f":"IF(ISNUMBER(VLOOKUP($A6,Rasbonus!$A$61:$AJ$295,MATCH(Ras,Rasbonus!$A$1:$AJ$1,0),FALSE)),VLOOKUP($A6,Rasbonus!$A$61:$AJ$295,MATCH(Ras,Rasbonus!$A$1:$AJ$1,0),FALSE),0)","v":0},{"$f":"IF($AB$58>16,$P$23,IF($AB$58>12,$P$22, IF($AB$58>8,$P$21,IF($AB$58>4,$P$20,\"0\"))))","v":"0"},null,-20,null,"Ras",null,"Reasoning",75,{"$f":"VLOOKUP(U6,Diverse!$A$2:$C$131,3,0)","v":7},null,{"$f":"VLOOKUP(U6,Diverse!$A$2:$B$131,2,0)","v":5},{"$f":"HLOOKUP(Ras,Rasbonus!$B$1:$AJ$12,5,0)","v":0},null,null,5]
["AM Strength",{"$f":"VLOOKUP(A7,AllaSkills!$A$3:$BV$317,$A$2+3,FALSE)","v":"6"},0,{"$f":"INDEX(Diverse!$H$1:$H$5,$C7+1)","v":"Nada"},{"$f":"ROUND(Level*(C7/2),0)+VLOOKUP($A7,Rasbonus!$A$29:$AJ$59,MATCH(Ras,Rasbonus!$A$1:$AJ$1,0),FALSE)","v":2},"6","6",0,{"$f":"HLOOKUP(Yrke,Levelbonus!$B$1:$CR$20,6,0)","v":0},10,{"$f":"ROUND((ST+SD)/2,0)","v":13},0,{"$f":"IF(ISNUMBER(VLOOKUP($A7,Rasbonus!$A$61:$AJ$295,MATCH(Ras,Rasbonus!$A$1:$AJ$1,0),FALSE)),VLOOKUP($A7,Rasbonus!$A$61:$AJ$295,MATCH(Ras,Rasbonus!$A$1:$AJ$1,0),FALSE),0)","v":0},null,null,23,null,null,null,"Eloquence",75,{"$f":"VLOOKUP(U7,Diverse!$A$2:$C$131,3,0)","v":7},null,{"$f":"VLOOKUP(U7,Diverse!$A$2:$B$131,2,0)","v":5},{"$f":"HLOOKUP(Ras,Rasbonus!$B$1:$AJ$12,6,0)","v":0},null,null,5]
["Adrenal Defense",{"$f":"VLOOKUP(A8,AllaSkills!$A$3:$BV$317,$A$2+3,FALSE)","v":"20"},0,{"$f":"INDEX(Diverse!$H$1:$H$5,$C8+1)","v":"Nada"},{"$f":"ROUND(Level*(C8/2),0)","v":0},"20","20",0,{"$f":"HLOOKUP(Yrke,Levelbonus!$B$1:$CR$20,6,0)","v":0},-25,null,0,{"$f":"IF(ISNUMBER(VLOOKUP($A8,Rasbonus!$A$61:$AJ$295,MATCH(Ras,Rasbonus!$A$1:$AJ$1,0),FALSE)),VLOOKUP($A8,Rasbonus!$A$61:$AJ$295,MATCH(Ras,Rasbonus!$A$1:$AJ$1,0),FALSE),0)","v":0},{"$f":"IF($AB$58>16,$P$23,IF($AB$58>12,$P$22, IF($AB$58>8,$P$21,IF($AB$58>4,$P$20,\"0\"))))","v":"0"},null,-25,null,null,null,"Strength",75,{"$f":"VLOOKUP(U8,Diverse!$A$2:$C$131,3,0)","v":7},null,{"$f":"VLOOKUP(U8,Diverse!$A$2:$B$131,2,0)","v":5},{"$f":"HLOOKUP(Ras,Rasbonus!$B$1:$AJ$12,7,0)","v":10},null,null,15]
["Armored AD",{"$f":"VLOOKUP(A9,AllaSkills!$A$3:$BV$317,$A$2+3,FALSE)","v":"20"},0,{"$f":"INDEX(Diverse!$H$1:$H$5,$C9+1)","v":"Nada"},0,"20","20",0,{"$f":"HLOOKUP(Yrke,Levelbonus!$B$1:$CR$20,6,0)","v":0},-25,null,0,{"$f":"IF(ISNUMBER(VLOOKUP($A9,Rasbonus!$A$61:$AJ$295,MATCH(Ras,Rasbonus!$A$1:$AJ$1,0),FALSE)),VLOOKUP($A9,Rasbonus!$A$61:$AJ$295,MATCH(Ras,Rasbonus!$A$1:$AJ$1,0),FALSE),0)","v":0},{"$f":"IF($AB$58>16,$P$23,IF($AB$58>12,$P$22, IF($AB$58>8,$P$21,IF($AB$58>4,$P$20,\"0\"))))","v":"0"},null,-25,null,{"$f":"CONCATENATE(\"Level:      \",Level)","v":"Level:      3"},null,"Quickness",75,{"$f":"VLOOKUP(U9,Diverse!$A$2:$C$131,3,0)","v":7},null,{"$f":"VLOOKUP(U9,Diverse!$A$2:$B$131,2,0)","v":5},{"$f":"HLOOKUP(Ras,Rasbonus!$B$1:$AJ$12,8,0)","v":-5},null,null,0]
["Ambush",{"$f":"VLOOKUP(A10,AllaSkills!$A$3:$BV$317,$A$2+3,FALSE)","v":"9"},0,{"$f":"INDEX(Diverse!$H$1:$H$5,$C10+1)","v":"Nada"},{"$f":"ROUND(Level*(C10/2),0)+VLOOKUP($A10,Rasbonus!$A$29:$AJ$59,MATCH(Ras,Rasbonus!$A$1:$AJ$1,0),FALSE)","v":0},"9","9",0,{"$f":"HLOOKUP(Yrke,Levelbonus!$B$1:$CR$20,7,0)","v":0},-25,null,0,{"$f":"IF(ISNUMBER(VLOOKUP($A10,Rasbonus!$A$61:$AJ$295,MATCH(Ras,Rasbonus!$A$1:$AJ$1,0),FALSE)),VLOOKUP($A10,Rasbonus!$A$61:$AJ$295,MATCH(Ras,Rasbonus!$A$1:$AJ$1,0),FALSE),0)","v":0},null,null,-25,null,null,null,"Presence",75,{"$f":"VLOOKUP(U10,Diverse!$A$2:$C$131,3,0)","v":7},null,{"$f":"VLOOKUP(U10,Diverse!$A$2:$B$131,2,0)","v":5},{"$f":"HLOOKUP(Ras,Rasbonus!$B$1:$AJ$12,9,0)","v":-5},null,null,0]
["Sniping",{"$f":"VLOOKUP(A11,AllaSkills!$A$3:$BV$317,$A$2+3,FALSE)","v":"9"},0,{"$f":"INDEX(Diverse!$H$1:$H$5,$C11+1)","v":"Nada"},0,"9","9",0,{"$f":"HLOOKUP(Yrke,Levelbonus!$B$1:$CR$20,7,0)","v":0},-25,null,0,{"$f":"IF(ISNUMBER(VLOOKUP($A11,Rasbonus!$A$61:$AJ$295,MATCH(Ras,Rasbonus!$A$1:$AJ$1,0),FALSE)),VLOOKUP($A11,Rasbonus!$A$61:$AJ$295,MATCH(Ras,Rasbonus!$A$1:$AJ$1,0),FALSE),0)","v":0},null,null,-25,null,{"$f":"CONCATENATE(\"Din ras slår hits med en \",HLOOKUP(Ras,Rasbonus!$B$1:$AJ$13,13,FALSE),\" vilket ger ett medel mellan 1 och \",MID(HLOOKUP(Ras,Rasbonus!$B$1:$AJ$13,13,FALSE),2,2),\". Hur mycket har du slagit?\")","v":"Din ras slår hits med en D10 vilket ger ett medel mellan 1 och 10. Hur mycket har du slagit?"},null,"Intuition",75,{"$f":"VLOOKUP(U11,Diverse!$A$2:$C$131,3,0)","v":7},null,{"$f":"VLOOKUP(U11,Diverse!$A$2:$B$131,2,0)","v":5},{"$f":"HLOOKUP(Ras,Rasbonus!$B$1:$AJ$12,10,0)","v":0},null,null,5]
["Body Development",{"$f":"VLOOKUP(A12,AllaSkills!$A$3:$BV$317,$A$2+3,FALSE)","v":"6"},0,{"$f":"INDEX(Diverse!$H$1:$H$5,$C12+1)","v":"Nada"},{"$f":"ROUND(Level*(C12/2),0)+VLOOKUP($A12,Rasbonus!$A$29:$AJ$59,MATCH(Ras,Rasbonus!$A$1:$AJ$1,0),FALSE)","v":3},"6","6",0,{"$f":"HLOOKUP(Yrke,Levelbonus!$B$1:$CR$20,19,0)","v":0},{"$f":"E12*Medelhits","v":13.5},{"$f":"ROUND(U3,0)/10","v":7.5},0,{"$f":"IF(ISNUMBER(VLOOKUP($A12,Rasbonus!$A$61:$AJ$295,MATCH(Ras,Rasbonus!$A$1:$AJ$1,0),FALSE)),VLOOKUP($A12,Rasbonus!$A$61:$AJ$295,MATCH(Ras,Rasbonus!$A$1:$AJ$1,0),FALSE),0)","v":0},null,null,21,null,null,null,"Empathy",75,{"$f":"VLOOKUP(U12,Diverse!$A$2:$C$131,3,0)","v":7},null,{"$f":"VLOOKUP(U12,Diverse!$A$2:$B$131,2,0)","v":5},{"$f":"HLOOKUP(Ras,Rasbonus!$B$1:$AJ$12,11,0)","v":-5},null,null,0]
["Channeling",{"$f":"VLOOKUP(A13,AllaSkills!$A$3:$BV$317,$A$2+3,FALSE)","v":"4/8"},0,{"$f":"INDEX(Diverse!$H$1:$H$5,$C13+1)","v":"Nada"},0,"4","8",0,{"$f":"HLOOKUP(Yrke,Levelbonus!$B$1:$CR$20,12,0)","v":3},-25,{"$f":"IN","v":5},9,{"$f":"IF(ISNUMBER(VLOOKUP($A13,Rasbonus!$A$61:$AJ$295,MATCH(Ras,Rasbonus!$A$1:$AJ$1,0),FALSE)),VLOOKUP($A13,Rasbonus!$A$61:$AJ$295,MATCH(Ras,Rasbonus!$A$1:$AJ$1,0),FALSE),0)","v":0},null,null,-11,null,null,null,"Appearance",75,null,null,{"$f":"VLOOKUP(U13,Diverse!$A$2:$B$131,2,0)","v":5},{"$f":"HLOOKUP(Ras,Rasbonus!$B$1:$AJ$12,12,0)","v":0},null,null,{"$f":"SUM(X13:AA13)","v":5}]
["Climbing",{"$f":"VLOOKUP(A14,AllaSkills!$A$3:$BV$317,$A$2+3,FALSE)","v":"7"},0,{"$f":"INDEX(Diverse!$H$1:$H$5,$C14+1)","v":"Nada"},{"$f":"ROUND(Level*(C14/2),0)+VLOOKUP($A14,Rasbonus!$A$29:$AJ$59,MATCH(Ras,Rasbonus!$A$1:$AJ$1,0),FALSE)","v":1},"7","7",0,{"$f":"HLOOKUP(Yrke,Levelbonus!$B$1:$CR$20,4,0)","v":0},5,{"$f":"AG","v":0},0,{"$f":"IF(ISNUMBER(VLOOKUP($A14,Rasbonus!$A$61:$AJ$295,MATCH(Ras,Rasbonus!$A$1:$AJ$1,0),FALSE)),VLOOKUP($A14,Rasbonus!$A$61:$AJ$295,MATCH(Ras,Rasbonus!$A$1:$AJ$1,0),FALSE),0)","v":0},{"$f":"IF($AB$58>16,$P$23,IF($AB$58>12,$P$22, IF($AB$58>8,$P$21,IF($AB$58>4,$P$20,\"0\"))))","v":"0"},null,5,null,null,null,null,{"$f":"SUM(U3:U13)","v":825},null,null,{"$f":"SUM(X3:X13)","v":55},{"$f":"SUM(Y3:Y13)","v":10},{"$f":"SUM(Z3:Z13)","v":0},{"$f":"SUM(AA3:AA13)","v":0},{"$f":"SUM(AB3:AB13)","v":65}]
["Directed Spells",{"$f":"VLOOKUP(A15,AllaSkills!$A$3:$BV$317,$A$2+3,FALSE)","v":"2/7"},0,{"$f":"INDEX(Diverse!$H$1:$H$5,$C15+1)","v":"Nada"},{"$f":"ROUND(Level*(C15/2),0)","v":0},"2","7",0,{"$f":"HLOOKUP(Yrke,Levelbonus!$B$1:$CR$20,17,0)","v":0},-25,{"$f":"AG","v":0},0,{"$f":"IF(ISNUMBER(VLOOKUP($A15,Rasbonus!$A$61:$AJ$295,MATCH(Ras,Rasbonus!$A$1:$AJ$1,0),FALSE)),VLOOKUP($A15,Rasbonus!$A$61:$AJ$295,MATCH(Ras,Rasbonus!$A$1:$AJ$1,0),FALSE),0)","v":0},null,null,-25,null,{"$f":"CONCATENATE(\"Eh jag slog..    ca \",Medelhits)","v":"Eh jag slog..    ca 4,5"}]
["Disarm Traps",{"$f":"VLOOKUP(A16,AllaSkills!$A$3:$BV$317,$A$2+3,FALSE)","v":"4"},0,{"$f":"INDEX(Diverse!$H$1:$H$5,$C16+1)","v":"Nada"},{"$f":"ROUND(Level*(C16/2),0)+VLOOKUP($A16,Rasbonus!$A$29:$AJ$59,MATCH(Ras,Rasbonus!$A$1:$AJ$1,0),FALSE)","v":1},"4","4",0,{"$f":"HLOOKUP(Yrke,Levelbonus!$B$1:$CR$20,16,0)","v":0},5,{"$f":"ROUND((IN+AG)/2,0)","v":3},0,{"$f":"IF(ISNUMBER(VLOOKUP($A16,Rasbonus!$A$61:$AJ$295,MATCH(Ras,Rasbonus!$A$1:$AJ$1,0),FALSE)),VLOOKUP($A16,Rasbonus!$A$61:$AJ$295,MATCH(Ras,Rasbonus!$A$1:$AJ$1,0),FALSE),0)","v":0},null,null,8,null,null,null,"Spell lists Aqcuisition",null,null,null,null,null,null,null,"Cost"]
["General Perception",{"$f":"VLOOKUP(A17,AllaSkills!$A$3:$BV$317,$A$2+3,FALSE)","v":"3"},0,{"$f":"INDEX(Diverse!$H$1:$H$5,$C17+1)","v":"Nada"},{"$f":"ROUND(Level*(C17/2),0)+VLOOKUP($A17,Rasbonus!$A$29:$AJ$59,MATCH(Ras,Rasbonus!$A$1:$AJ$1,0),FALSE)","v":1},"3","3",0,{"$f":"HLOOKUP(Yrke,Levelbonus!$B$1:$CR$20,14,0)","v":1},5,{"$f":"ROUND((IN+RE)/2,0)","v":5},3,{"$f":"IF(ISNUMBER(VLOOKUP($A17,Rasbonus!$A$61:$AJ$295,MATCH(Ras,Rasbonus!$A$1:$AJ$1,0),FALSE)),VLOOKUP($A17,Rasbonus!$A$61:$AJ$295,MATCH(Ras,Rasbonus!$A$1:$AJ$1,0),FALSE),0)","v":0},null,null,13,null,{"$f":"CONCATENATE(\"Du har spenderat \",SUM(H3:H36)/2,\" av dina \",Dev.pts_primary,\" dev.pts.\")","v":"Du har spenderat 0 av dina 35 dev.pts."},null,"SL (closed, A)",null,null,null,null,null,null,null,{"$f":"VLOOKUP(T17,AllaSkills!$A$3:$BV$317,$A$2+3,FALSE)","v":"N/A"}]
["MA Strikes",{"$f":"VLOOKUP(A18,AllaSkills!$A$3:$BV$317,$A$2+3,FALSE)","v":"9"},0,{"$f":"INDEX(Diverse!$H$1:$H$5,$C18+1)","v":"Nada"},{"$f":"ROUND(Level*(C18/2),0)+VLOOKUP($A18,Rasbonus!$A$29:$AJ$59,MATCH(Ras,Rasbonus!$A$1:$AJ$1,0),FALSE)","v":2},{"$f":"IF(LEN(B18)=3,LEFT(B18,1),IF(LEN(B18)<3,B18,99))","v":"9"},{"$f":"IF(RIGHT(B18,1)=\"*\",LEFT(B18,1),IF(LEN(B18)=3,RIGHT(B18,1),IF(LEN(B18)<3,B18,RIGHT(B18,2))))","v":"9"},{"$f":"IF(D18=\"Ett varannan level\",F18+F18-F18,IF(D18=\"Ett varje level\",2*F18,IF(D18=\"Tre på två levlar\",F18+G18+F18,IF(D18=\"Nada\",0,F18+G18+F18+G18))))","v":0},{"$f":"HLOOKUP(Yrke,Levelbonus!$B$1:$CR$20,5,0)","v":0},{"$f":"IF(E18<1,-25,IF(E18>30,80+((E18-30)*0.5),IF(E18>20,70+(E18-20),IF(E18>10,50+((E18-10)*2),E18*5))))","v":10},{"$f":"ROUND((ST+ST+AG)/3,0)","v":10},0,{"$f":"IF(ISNUMBER(VLOOKUP($A18,Rasbonus!$A$61:$AJ$295,MATCH(Ras,Rasbonus!$A$1:$AJ$1,0),FALSE)),VLOOKUP($A18,Rasbonus!$A$61:$AJ$295,MATCH(Ras,Rasbonus!$A$1:$AJ$1,0),FALSE),0)","v":0},null,null,20,null,null,null,"SL (closed, B)",null,null,null,null,null,null,null,{"$f":"VLOOKUP(T18,AllaSkills!$A$3:$BV$317,$A$2+3,FALSE)","v":"1/*"}]
["MA Sweeps",{"$f":"VLOOKUP(A19,AllaSkills!$A$3:$BV$317,$A$2+3,FALSE)","v":"9"},0,{"$f":"INDEX(Diverse!$H$1:$H$5,$C19+1)","v":"Nada"},{"$f":"ROUND(Level*(C19/2),0)+VLOOKUP($A19,Rasbonus!$A$29:$AJ$59,MATCH(Ras,Rasbonus!$A$1:$AJ$1,0),FALSE)","v":0},{"$f":"IF(LEN(B19)=3,LEFT(B19,1),IF(LEN(B19)<3,B19,99))","v":"9"},{"$f":"IF(RIGHT(B19,1)=\"*\",LEFT(B19,1),IF(LEN(B19)=3,RIGHT(B19,1),IF(LEN(B19)<3,B19,RIGHT(B19,2))))","v":"9"},0,{"$f":"HLOOKUP(Yrke,Levelbonus!$B$1:$CR$20,5,0)","v":0},{"$f":"IF(E19<1,-25,IF(E19>30,80+((E19-30)*0.5),IF(E19>20,70+(E19-20),IF(E19>10,50+((E19-10)*2),E19*5))))","v":-25},{"$f":"ROUND((AG+AG+ST)/3,0)","v":5},0,{"$f":"IF(ISNUMBER(VLOOKUP($A19,Rasbonus!$A$61:$AJ$295,MATCH(Ras,Rasbonus!$A$1:$AJ$1,0),FALSE)),VLOOKUP($A19,Rasbonus!$A$61:$AJ$295,MATCH(Ras,Rasbonus!$A$1:$AJ$1,0),FALSE),0)","v":0},null,null,-20,null,null,null,"SL (closed, C)",null,null,null,null,null,null,null,{"$f":"VLOOKUP(T19,AllaSkills!$A$3:$BV$317,$A$2+3,FALSE)","v":"N/A"}]
["Man. Soft L",{"$f":"VLOOKUP(A20,AllaSkills!$A$3:$BV$317,$A$2+3,FALSE)","v":9},0,{"$f":"INDEX(Diverse!$H$1:$H$5,$C20+1)","v":"Nada"},{"$f":"ROUND(Level*(C20/2),0)+VLOOKUP($A20,Rasbonus!$A$29:$AJ$59,MATCH(Ras,Rasbonus!$A$1:$AJ$1,0),FALSE)","v":1},{"$f":"IF(LEN(B20)=3,LEFT(B20,1),IF(LEN(B20)<3,B20,99))","v":9},{"$f":"IF(RIGHT(B20,1)=\"*\",LEFT(B20,1),IF(LEN(B20)=3,RIGHT(B20,1),IF(LEN(B20)<3,B20,RIGHT(B20,2))))","v":9},0,{"$f":"HLOOKUP(Yrke,Levelbonus!$B$1:$CR$20,5,0)","v":0},{"$f":"IF(E20<1,-25,E20*5)","v":5},{"$f":"AG","v":0},0,{"$f":"IF(ISNUMBER(VLOOKUP($A20,Rasbonus!$A$61:$AJ$295,MATCH(Ras,Rasbonus!$A$1:$AJ$1,0),FALSE)),VLOOKUP($A20,Rasbonus!$A$61:$AJ$295,MATCH(Ras,Rasbonus!$A$1:$AJ$1,0),FALSE),0)","v":0},{"$f":"IF(AND($AB$58>4,$AB$58<9),$AB$59,\"\")","v":""},null,{"$f":"IF((SUM(J20:O20)>=AB60),AB60,(SUM(J20:O20)))","v":0},null,"Primär vapentyp",null,"SL (closed, D)",null,null,null,null,null,null,null,{"$f":"VLOOKUP(T20,AllaSkills!$A$3:$BV$317,$A$2+3,FALSE)","v":"1/*"}]
["Man. Rigid L",{"$f":"VLOOKUP(A21,AllaSkills!$A$3:$BV$317,$A$2+3,FALSE)","v":9},0,{"$f":"INDEX(Diverse!$H$1:$H$5,$C21+1)","v":"Nada"},{"$f":"ROUND(Level*(C21/2),0)+VLOOKUP($A21,Rasbonus!$A$29:$AJ$59,MATCH(Ras,Rasbonus!$A$1:$AJ$1,0),FALSE)","v":1},{"$f":"IF(LEN(B21)=3,LEFT(B21,1),IF(LEN(B21)<3,B21,99))","v":9},{"$f":"IF(RIGHT(B21,1)=\"*\",LEFT(B21,1),IF(LEN(B21)=3,RIGHT(B21,1),IF(LEN(B21)<3,B21,RIGHT(B21,2))))","v":9},0,{"$f":"HLOOKUP(Yrke,Levelbonus!$B$1:$CR$20,5,0)","v":0},{"$f":"IF(E21<1,-25,E21*5)","v":5},{"$f":"AG","v":0},0,{"$f":"IF(ISNUMBER(VLOOKUP($A21,Rasbonus!$A$61:$AJ$295,MATCH(Ras,Rasbonus!$A$1:$AJ$1,0),FALSE)),VLOOKUP($A21,Rasbonus!$A$61:$AJ$295,MATCH(Ras,Rasbonus!$A$1:$AJ$1,0),FALSE),0)","v":0},{"$f":"IF(AND($AB$58>8,$AB$58<13),$AB$59,\"\")","v":""},null,{"$f":"IF((SUM(J21:O21)>=AB60),AB60,(SUM(J21:O21)))","v":0},null,null,null,"SL (closed, E)",null,null,null,null,null,null,null,{"$f":"VLOOKUP(T21,AllaSkills!$A$3:$BV$317,$A$2+3,FALSE)","v":"3/*"}]
["Man. Chain",{"$f":"VLOOKUP(A22,AllaSkills!$A$3:$BV$317,$A$2+3,FALSE)","v":10},0,{"$f":"INDEX(Diverse!$H$1:$H$5,$C22+1)","v":"Nada"},{"$f":"ROUND(Level*(C22/2),0)+VLOOKUP($A22,Rasbonus!$A$29:$AJ$59,MATCH(Ras,Rasbonus!$A$1:$AJ$1,0),FALSE)","v":3},{"$f":"IF(LEN(B22)=3,LEFT(B22,1),IF(LEN(B22)<3,B22,99))","v":10},10,0,{"$f":"HLOOKUP(Yrke,Levelbonus!$B$1:$CR$20,5,0)","v":0},{"$f":"IF(E22<1,-25,E22*5)","v":15},{"$f":"ST","v":15},0,{"$f":"IF(ISNUMBER(VLOOKUP($A22,Rasbonus!$A$61:$AJ$295,MATCH(Ras,Rasbonus!$A$1:$AJ$1,0),FALSE)),VLOOKUP($A22,Rasbonus!$A$61:$AJ$295,MATCH(Ras,Rasbonus!$A$1:$AJ$1,0),FALSE),0)","v":0},{"$f":"IF(AND($AB$58>12,$AB$58<17),$AB$59,\"\")","v":""},null,{"$f":"IF((SUM(J22:O22)>=AB60),AB60,(SUM(J22:O22)))","v":0},null,null,null,"SL (open, A)",null,null,null,null,null,null,null,{"$f":"VLOOKUP(T22,AllaSkills!$A$3:$BV$317,$A$2+3,FALSE)","v":"N/A"}]
["Man. Plate",{"$f":"VLOOKUP(A23,AllaSkills!$A$3:$BV$317,$A$2+3,FALSE)","v":11},0,{"$f":"INDEX(Diverse!$H$1:$H$5,$C23+1)","v":"Nada"},{"$f":"ROUND(Level*(C23/2),0)+VLOOKUP($A23,Rasbonus!$A$29:$AJ$59,MATCH(Ras,Rasbonus!$A$1:$AJ$1,0),FALSE)","v":1},{"$f":"IF(LEN(B23)=3,LEFT(B23,1),IF(LEN(B23)<3,B23,99))","v":11},11,0,{"$f":"HLOOKUP(Yrke,Levelbonus!$B$1:$CR$20,5,0)","v":0},{"$f":"IF(E23<1,-25,E23*5)","v":5},{"$f":"ST","v":15},0,{"$f":"IF(ISNUMBER(VLOOKUP($A23,Rasbonus!$A$61:$AJ$295,MATCH(Ras,Rasbonus!$A$1:$AJ$1,0),FALSE)),VLOOKUP($A23,Rasbonus!$A$61:$AJ$295,MATCH(Ras,Rasbonus!$A$1:$AJ$1,0),FALSE),0)","v":0},{"$f":"IF(AND($AB$58>16,$AB$58<21),$AB$59,\"\")","v":""},null,{"$f":"IF((SUM(J23:O23)>=AB60),AB60,(SUM(J23:O23)))","v":0},null,"Sekundär vapentyp",null,"SL (open, B)",null,null,null,null,null,null,null,{"$f":"VLOOKUP(T23,AllaSkills!$A$3:$BV$317,$A$2+3,FALSE)","v":"1/*"}]
["Pick locks",{"$f":"VLOOKUP(A24,AllaSkills!$A$3:$BV$317,$A$2+3,FALSE)","v":"4"},0,{"$f":"INDEX(Diverse!$H$1:$H$5,$C24+1)","v":"Nada"},{"$f":"ROUND(Level*(C24/2),0)+VLOOKUP($A24,Rasbonus!$A$29:$AJ$59,MATCH(Ras,Rasbonus!$A$1:$AJ$1,0),FALSE)","v":2},"4","4",0,{"$f":"HLOOKUP(Yrke,Levelbonus!$B$1:$CR$20,16,0)","v":0},{"$f":"IF(E24<1,-25,IF(E24>30,80+((E24-30)*0.5),IF(E24>20,70+(E24-20),IF(E24>10,50+((E24-10)*2),E24*5))))","v":10},{"$f":"ROUND((IN+RE+AG)/3,0)","v":3},0,{"$f":"IF(ISNUMBER(VLOOKUP($A24,Rasbonus!$A$61:$AJ$295,MATCH(Ras,Rasbonus!$A$1:$AJ$1,0),FALSE)),VLOOKUP($A24,Rasbonus!$A$61:$AJ$295,MATCH(Ras,Rasbonus!$A$1:$AJ$1,0),FALSE),0)","v":0},null,null,13,null,null,null,"SL (open, C)",null,null,null,null,null,null,null,{"$f":"VLOOKUP(T24,AllaSkills!$A$3:$BV$317,$A$2+3,FALSE)","v":"N/A"}]
["Riding",{"$f":"VLOOKUP(A25,AllaSkills!$A$3:$BV$317,$A$2+3,FALSE)","v":"3"},0,{"$f":"INDEX(Diverse!$H$1:$H$5,$C25+1)","v":"Nada"},{"$f":"ROUND(Level*(C25/2),0)+VLOOKUP($A25,Rasbonus!$A$29:$AJ$59,MATCH(Ras,Rasbonus!$A$1:$AJ$1,0),FALSE)","v":0},"3","3",0,{"$f":"HLOOKUP(Yrke,Levelbonus!$B$1:$CR$20,3,0)","v":0},-25,{"$f":"ROUND((EM+AG)/2,0)","v":0},0,{"$f":"IF(ISNUMBER(VLOOKUP($A25,Rasbonus!$A$61:$AJ$295,MATCH(Ras,Rasbonus!$A$1:$AJ$1,0),FALSE)),VLOOKUP($A25,Rasbonus!$A$61:$AJ$295,MATCH(Ras,Rasbonus!$A$1:$AJ$1,0),FALSE),0)","v":0},null,null,-25,null,null,null,"SL (open, D)",null,null,null,null,null,null,null,{"$f":"VLOOKUP(T25,AllaSkills!$A$3:$BV$317,$A$2+3,FALSE)","v":"1/*"}]
["Runes",{"$f":"VLOOKUP(A26,AllaSkills!$A$3:$BV$317,$A$2+3,FALSE)","v":"1/3"},0,{"$f":"INDEX(Diverse!$H$1:$H$5,$C26+1)","v":"Nada"},{"$f":"ROUND(Level*(C26/2),0)+VLOOKUP($A26,Rasbonus!$A$29:$AJ$59,MATCH(Ras,Rasbonus!$A$1:$AJ$1,0),FALSE)","v":0},"1","3",0,{"$f":"HLOOKUP(Yrke,Levelbonus!$B$1:$CR$20,12,0)","v":3},-25,{"$f":"ROUND((IN+EM)/2,0)","v":3},9,{"$f":"IF(ISNUMBER(VLOOKUP($A26,Rasbonus!$A$61:$AJ$295,MATCH(Ras,Rasbonus!$A$1:$AJ$1,0),FALSE)),VLOOKUP($A26,Rasbonus!$A$61:$AJ$295,MATCH(Ras,Rasbonus!$A$1:$AJ$1,0),FALSE),0)","v":0},null,null,-13,null,"Tertiär vapentyp",null,"SL (open, E)",null,null,null,null,null,null,null,{"$f":"VLOOKUP(T26,AllaSkills!$A$3:$BV$317,$A$2+3,FALSE)","v":"1/*"}]
["Staves & Wands",{"$f":"VLOOKUP(A27,AllaSkills!$A$3:$BV$317,$A$2+3,FALSE)","v":"1/3"},0,{"$f":"INDEX(Diverse!$H$1:$H$5,$C27+1)","v":"Nada"},{"$f":"ROUND(Level*(C27/2),0)+VLOOKUP($A27,Rasbonus!$A$29:$AJ$59,MATCH(Ras,Rasbonus!$A$1:$AJ$1,0),FALSE)","v":2},"1","3",0,{"$f":"HLOOKUP(Yrke,Levelbonus!$B$1:$CR$20,12,0)","v":3},10,{"$f":"ROUND((IN+EM)/2,0)","v":3},9,{"$f":"IF(ISNUMBER(VLOOKUP($A27,Rasbonus!$A$61:$AJ$295,MATCH(Ras,Rasbonus!$A$1:$AJ$1,0),FALSE)),VLOOKUP($A27,Rasbonus!$A$61:$AJ$295,MATCH(Ras,Rasbonus!$A$1:$AJ$1,0),FALSE),0)","v":0},null,null,22,null,null,null,"SL (oth realm, base, A)",null,null,null,null,null,null,null,{"$f":"VLOOKUP(T27,AllaSkills!$A$3:$BV$317,$A$2+3,FALSE)","v":"10"}]
["Stalk & Hide",{"$f":"VLOOKUP(A28,AllaSkills!$A$3:$BV$317,$A$2+3,FALSE)","v":"6"},0,{"$f":"INDEX(Diverse!$H$1:$H$5,$C28+1)","v":"Nada"},{"$f":"ROUND(Level*(C28/2),0)+VLOOKUP($A28,Rasbonus!$A$29:$AJ$59,MATCH(Ras,Rasbonus!$A$1:$AJ$1,0),FALSE)","v":0},"6","6",0,{"$f":"HLOOKUP(Yrke,Levelbonus!$B$1:$CR$20,16,0)","v":0},-25,{"$f":"ROUND((AG+SD)/2,0)","v":5},0,{"$f":"IF(ISNUMBER(VLOOKUP($A28,Rasbonus!$A$61:$AJ$295,MATCH(Ras,Rasbonus!$A$1:$AJ$1,0),FALSE)),VLOOKUP($A28,Rasbonus!$A$61:$AJ$295,MATCH(Ras,Rasbonus!$A$1:$AJ$1,0),FALSE),0)","v":0},{"$f":"IF($AB$58>16,$P$23,IF($AB$58>12,$P$22, IF($AB$58>8,$P$21,IF($AB$58>4,$P$20,\"0\"))))","v":"0"},null,-20,null,null,null,"SL (oth realm, cl, A)",null,null,null,null,null,null,null,{"$f":"VLOOKUP(T28,AllaSkills!$A$3:$BV$317,$A$2+3,FALSE)","v":"5"}]
["Swimming",{"$f":"VLOOKUP(A29,AllaSkills!$A$3:$BV$317,$A$2+3,FALSE)","v":"3"},0,{"$f":"INDEX(Diverse!$H$1:$H$5,$C29+1)","v":"Nada"},{"$f":"ROUND(Level*(C29/2),0)+VLOOKUP($A29,Rasbonus!$A$29:$AJ$59,MATCH(Ras,Rasbonus!$A$1:$AJ$1,0),FALSE)","v":0},"3",{"$f":"IF(RIGHT(B29,1)=\"*\",LEFT(B29,1),IF(LEN(B29)=3,RIGHT(B29,1),IF(LEN(B29)<3,B29,RIGHT(B29,2))))","v":"3"},0,{"$f":"HLOOKUP(Yrke,Levelbonus!$B$1:$CR$20,4,0)","v":0},-25,{"$f":"ROUND((AG+SD)/2,0)","v":5},0,{"$f":"IF(ISNUMBER(VLOOKUP($A29,Rasbonus!$A$61:$AJ$295,MATCH(Ras,Rasbonus!$A$1:$AJ$1,0),FALSE)),VLOOKUP($A29,Rasbonus!$A$61:$AJ$295,MATCH(Ras,Rasbonus!$A$1:$AJ$1,0),FALSE),0)","v":0},{"$f":"IF($AB$58>16,$P$23,IF($AB$58>12,$P$22, IF($AB$58>8,$P$21,IF($AB$58>4,$P$20,\"0\"))))","v":"0"},null,-20,null,"Fjärde vapentyp",null,"SL (oth realm, cl, B)",null,null,null,null,null,null,null,{"$f":"VLOOKUP(T29,AllaSkills!$A$3:$BV$317,$A$2+3,FALSE)","v":"10"}]
[{"$f":"OFFSET(Diverse!$G$14,Diverse!H26,0)","v":"2 Handed"},{"$f":"VLOOKUP(\"Weapon #1\",AllaSkills!$A$3:$BV$317,$A$2+3,FALSE)","v":"9"},0,{"$f":"INDEX(Diverse!$H$1:$H$5,$C30+1)","v":"Nada"},{"$f":"ROUND(Level*(C30/2),0)+IF(ISNUMBER(VLOOKUP($A30,Rasbonus!$A$29:$AJ$59,MATCH(Ras,Rasbonus!$A$1:$AJ$1,0),FALSE)),VLOOKUP($A30,Rasbonus!$A$29:$AJ$59,MATCH(Ras,Rasbonus!$A$1:$AJ$1,0),FALSE),0)","v":2},"9","9",0,{"$f":"HLOOKUP(Yrke,Levelbonus!$B$1:$CR$20,5,0)","v":0},10,{"$f":"OFFSET(Diverse!$H$14,Diverse!H26,0)","v":11.666666666666666},0,{"$f":"IF(ISNUMBER(VLOOKUP($A30,Rasbonus!$A$61:$AJ$295,MATCH(Ras,Rasbonus!$A$1:$AJ$1,0),FALSE)),VLOOKUP($A30,Rasbonus!$A$61:$AJ$295,MATCH(Ras,Rasbonus!$A$1:$AJ$1,0),FALSE),0)","v":0},{"$f":"IF(OR($A$30=\"Bow\", $A$30=\"Thrown\"),$AB$62,\"\")","v":""},null,21.666666666666664,null,null,null,"SL (oth realm, op, A)",null,null,null,null,null,null,null,{"$f":"VLOOKUP(T30,AllaSkills!$A$3:$BV$317,$A$2+3,FALSE)","v":"4/*"}]
[{"$f":"OFFSET(Diverse!$G$14,Diverse!H27,0)","v":"Polearm"},{"$f":"VLOOKUP(\"Weapon #2\",AllaSkills!$A$3:$BV$317,$A$2+3,FALSE)","v":"20"},0,{"$f":"INDEX(Diverse!$H$1:$H$5,$C31+1)","v":"Nada"},{"$f":"ROUND(Level*(C31/2),0)+IF(ISNUMBER(VLOOKUP($A31,Rasbonus!$A$29:$AJ$59,MATCH(Ras,Rasbonus!$A$1:$AJ$1,0),FALSE)),VLOOKUP($A31,Rasbonus!$A$29:$AJ$59,MATCH(Ras,Rasbonus!$A$1:$AJ$1,0),FALSE),0)","v":0},"20","20",0,{"$f":"HLOOKUP(Yrke,Levelbonus!$B$1:$CR$20,5,0)","v":0},-25,{"$f":"OFFSET(Diverse!$H$14,Diverse!H27,0)","v":8.75},0,{"$f":"IF(ISNUMBER(VLOOKUP($A31,Rasbonus!$A$61:$AJ$295,MATCH(Ras,Rasbonus!$A$1:$AJ$1,0),FALSE)),VLOOKUP($A31,Rasbonus!$A$61:$AJ$295,MATCH(Ras,Rasbonus!$A$1:$AJ$1,0),FALSE),0)","v":0},{"$f":"IF(OR($A$31=\"Bow\", $A$31=\"Thrown\"),$AB$62,\"\")","v":""},null,-16.25,null,null,null,"SL (oth realm, op, C)",null,null,null,null,null,null,null,{"$f":"VLOOKUP(T31,AllaSkills!$A$3:$BV$317,$A$2+3,FALSE)","v":"8"}]
[{"$f":"OFFSET(Diverse!$G$14,Diverse!H28,0)","v":"Thrown"},{"$f":"VLOOKUP(\"Weapon #3\",AllaSkills!$A$3:$BV$317,$A$2+3,FALSE)","v":"20"},0,{"$f":"INDEX(Diverse!$H$1:$H$5,$C32+1)","v":"Nada"},{"$f":"ROUND(Level*(C32/2),0)+IF(ISNUMBER(VLOOKUP($A32,Rasbonus!$A$29:$AJ$59,MATCH(Ras,Rasbonus!$A$1:$AJ$1,0),FALSE)),VLOOKUP($A32,Rasbonus!$A$29:$AJ$59,MATCH(Ras,Rasbonus!$A$1:$AJ$1,0),FALSE),0)","v":1},"20","20",0,{"$f":"HLOOKUP(Yrke,Levelbonus!$B$1:$CR$20,5,0)","v":0},5,{"$f":"OFFSET(Diverse!$H$14,Diverse!H28,0)","v":7.5},0,{"$f":"IF(ISNUMBER(VLOOKUP($A32,Rasbonus!$A$61:$AJ$295,MATCH(Ras,Rasbonus!$A$1:$AJ$1,0),FALSE)),VLOOKUP($A32,Rasbonus!$A$61:$AJ$295,MATCH(Ras,Rasbonus!$A$1:$AJ$1,0),FALSE),0)","v":0},{"$f":"IF(OR($A$32=\"Bow\", $A$32=\"Thrown\"),$AB$62,\"\")","v":0},null,12.5,null,"Femte vapentyp",null,"SL (oth realm, op, D)",null,null,null,null,null,null,null,{"$f":"VLOOKUP(T32,AllaSkills!$A$3:$BV$317,$A$2+3,FALSE)","v":"10"}]
[{"$f":"OFFSET(Diverse!$G$14,Diverse!H29,0)","v":"1H Slash"},{"$f":"VLOOKUP(\"Weapon #4\",AllaSkills!$A$3:$BV$317,$A$2+3,FALSE)","v":"20"},0,{"$f":"INDEX(Diverse!$H$1:$H$5,$C33+1)","v":"Nada"},{"$f":"ROUND(Level*(C33/2),0)+IF(ISNUMBER(VLOOKUP($A33,Rasbonus!$A$29:$AJ$59,MATCH(Ras,Rasbonus!$A$1:$AJ$1,0),FALSE)),VLOOKUP($A33,Rasbonus!$A$29:$AJ$59,MATCH(Ras,Rasbonus!$A$1:$AJ$1,0),FALSE),0)","v":0},{"$f":"IF(LEN(B33)=3,LEFT(B33,1),IF(LEN(B33)<3,B33,99))","v":"20"},"20",{"$f":"IF(D33=\"Ett varannan level\",F33+F33-F33,IF(D33=\"Ett varje level\",2*F33,IF(D33=\"Tre på två levlar\",F33+G33+F33,IF(D33=\"Nada\",0,F33+G33+F33+G33))))","v":0},{"$f":"HLOOKUP(Yrke,Levelbonus!$B$1:$CR$20,5,0)","v":0},{"$f":"IF(E33<1,-25,IF(E33>30,80+((E33-30)*0.5),IF(E33>20,70+(E33-20),IF(E33>10,50+((E33-10)*2),E33*5))))","v":-25},{"$f":"OFFSET(Diverse!$H$14,Diverse!H29,0)","v":8.75},0,{"$f":"IF(ISNUMBER(VLOOKUP($A33,Rasbonus!$A$61:$AJ$295,MATCH(Ras,Rasbonus!$A$1:$AJ$1,0),FALSE)),VLOOKUP($A33,Rasbonus!$A$61:$AJ$295,MATCH(Ras,Rasbonus!$A$1:$AJ$1,0),FALSE),0)","v":0},{"$f":"IF(OR($A$33=\"Bow\", $A$33=\"Thrown\"),$AB$62,\"\")","v":""},null,-16.25,null,null,null,"SL (other base, A)",null,null,null,null,null,null,null,{"$f":"VLOOKUP(T33,AllaSkills!$A$3:$BV$317,$A$2+3,FALSE)","v":"3/*"}]
[{"$f":"OFFSET(Diverse!$G$14,Diverse!H30,0)","v":"1H Thrust"},{"$f":"VLOOKUP(\"Weapon #5\",AllaSkills!$A$3:$BV$317,$A$2+3,FALSE)","v":"20"},0,{"$f":"INDEX(Diverse!$H$1:$H$5,$C34+1)","v":"Nada"},{"$f":"ROUND(Level*(C34/2),0)+IF(ISNUMBER(VLOOKUP($A34,Rasbonus!$A$29:$AJ$59,MATCH(Ras,Rasbonus!$A$1:$AJ$1,0),FALSE)),VLOOKUP($A34,Rasbonus!$A$29:$AJ$59,MATCH(Ras,Rasbonus!$A$1:$AJ$1,0),FALSE),0)","v":0},{"$f":"IF(LEN(B34)=3,LEFT(B34,1),IF(LEN(B34)<3,B34,99))","v":"20"},"20",{"$f":"IF(D34=\"Ett varannan level\",F34+F34-F34,IF(D34=\"Ett varje level\",2*F34,IF(D34=\"Tre på två levlar\",F34+G34+F34,IF(D34=\"Nada\",0,F34+G34+F34+G34))))","v":0},{"$f":"HLOOKUP(Yrke,Levelbonus!$B$1:$CR$20,5,0)","v":0},{"$f":"IF(E34<1,-25,IF(E34>30,80+((E34-30)*0.5),IF(E34>20,70+(E34-20),IF(E34>10,50+((E34-10)*2),E34*5))))","v":-25},{"$f":"OFFSET(Diverse!$H$14,Diverse!H30,0)","v":5},0,{"$f":"IF(ISNUMBER(VLOOKUP($A34,Rasbonus!$A$61:$AJ$295,MATCH(Ras,Rasbonus!$A$1:$AJ$1,0),FALSE)),VLOOKUP($A34,Rasbonus!$A$61:$AJ$295,MATCH(Ras,Rasbonus!$A$1:$AJ$1,0),FALSE),0)","v":0},{"$f":"IF(OR($A$34=\"Bow\", $A$34=\"Thrown\"),$AB$62,\"\")","v":""},null,-20,null,null,null,"SL (other base, C)",null,null,null,null,null,null,null,{"$f":"VLOOKUP(T34,AllaSkills!$A$3:$BV$317,$A$2+3,FALSE)","v":"4/*"}]
[{"$f":"OFFSET(Diverse!$G$14,Diverse!H31,0)","v":"Bow"},{"$f":"VLOOKUP(\"Weapon #6\",AllaSkills!$A$3:$BV$317,$A$2+3,FALSE)","v":"20"},0,{"$f":"INDEX(Diverse!$H$1:$H$5,$C35+1)","v":"Nada"},{"$f":"ROUND(Level*(C35/2),0)+IF(ISNUMBER(VLOOKUP($A35,Rasbonus!$A$29:$AJ$59,MATCH(Ras,Rasbonus!$A$1:$AJ$1,0),FALSE)),VLOOKUP($A35,Rasbonus!$A$29:$AJ$59,MATCH(Ras,Rasbonus!$A$1:$AJ$1,0),FALSE),0)","v":1},{"$f":"IF(LEN(B35)=3,LEFT(B35,1),IF(LEN(B35)<3,B35,99))","v":"20"},"20",{"$f":"IF(D35=\"Ett varannan level\",F35+F35-F35,IF(D35=\"Ett varje level\",2*F35,IF(D35=\"Tre på två levlar\",F35+G35+F35,IF(D35=\"Nada\",0,F35+G35+F35+G35))))","v":0},{"$f":"HLOOKUP(Yrke,Levelbonus!$B$1:$CR$20,5,0)","v":0},{"$f":"IF(E35<1,-25,IF(E35>30,80+((E35-30)*0.5),IF(E35>20,70+(E35-20),IF(E35>10,50+((E35-10)*2),E35*5))))","v":5},{"$f":"OFFSET(Diverse!$H$14,Diverse!H31,0)","v":5},0,{"$f":"IF(ISNUMBER(VLOOKUP($A35,Rasbonus!$A$61:$AJ$295,MATCH(Ras,Rasbonus!$A$1:$AJ$1,0),FALSE)),VLOOKUP($A35,Rasbonus!$A$61:$AJ$295,MATCH(Ras,Rasbonus!$A$1:$AJ$1,0),FALSE),0)","v":0},{"$f":"IF(OR($A$35=\"Bow\", $A$35=\"Thrown\"),$AB$62,\"\")","v":0},null,10,null,"Sjätte vapentyp",null,"SL (other base, D)",null,null,null,null,null,null,null,{"$f":"VLOOKUP(T35,AllaSkills!$A$3:$BV$317,$A$2+3,FALSE)","v":"5"}]
["Shield",{"$f":"VLOOKUP(\"Shield Skill\",AllaSkills!$A$3:$BV$317,$A$2+3,FALSE)","v":"20"},0,{"$f":"INDEX(Diverse!$H$1:$H$5,$C36+1)","v":"Nada"},{"$f":"ROUND(Level*(C36/2),0)+IF(ISNUMBER(VLOOKUP($A36,Rasbonus!$A$29:$AJ$59,MATCH(Ras,Rasbonus!$A$1:$AJ$1,0),FALSE)),VLOOKUP($A36,Rasbonus!$A$29:$AJ$59,MATCH(Ras,Rasbonus!$A$1:$AJ$1,0),FALSE),0)","v":2},{"$f":"IF(LEN(B36)=3,LEFT(B36,1),IF(LEN(B36)<3,B36,99))","v":"20"},"20",{"$f":"IF(D36=\"Ett varannan level\",F36+F36-F36,IF(D36=\"Ett varje level\",2*F36,IF(D36=\"Tre på två levlar\",F36+G36+F36,IF(D36=\"Nada\",0,F36+G36+F36+G36))))","v":0},null,{"$f":"IF(E36<1,-25,IF(E36>30,60+((E36-30)*0.5),IF(E36>20,50+(E36-20),IF(E36>10,30+((E36-10)*2),E36*3))))","v":6},0,null,{"$f":"IF(ISNUMBER(VLOOKUP($A36,Rasbonus!$A$61:$AJ$295,MATCH(Ras,Rasbonus!$A$1:$AJ$1,0),FALSE)),VLOOKUP($A36,Rasbonus!$A$61:$AJ$295,MATCH(Ras,Rasbonus!$A$1:$AJ$1,0),FALSE),0)","v":0},{"$f":"SUM(Secondary!AK81+15)","v":15},null,21,null,null,null,"SL (other base, E)",null,null,null,null,null,null,null,{"$f":"VLOOKUP(T36,AllaSkills!$A$3:$BV$317,$A$2+3,FALSE)","v":"10"}]
[]
["Defensive Bonus",null,null,null,null,null,null,null,null,null,"Power Points",null,null,null,null,null,null,"Background Options",null,"General Information"]
[null,"w/shield",null,"w/other",null,null,null,null,null,null,"Developed",null,null,null,null,{"$f":"Secondary!AK171","v":9},null,null,null,"Namn:"]
["Shield skill",{"$f":"IF($P$36<0,0,$P$36)","v":21},null,null,null,null,null,null,null,null,"Added",null,null,null,null,null,null,null,null,"Yrke:",{"$f":"Yrke","v":"Alchemist"}]
["Magic shield",0,null,null,null,null,null,null,null,null,"Multiplier",null,null,null,null,1,null,null,null,"Ras:",{"$f":"Ras","v":"Dwarf"}]
["Quickness",{"$f":"MIN($AA$71,IF($AB$9+$AB$61<1,0,$AB$9+$AB$61))","v":0},null,{"$f":"SUM(B42)","v":0},null,null,null,null,null,null,"Total",null,null,null,null,{"$f":"SUM(P39:P40)*(P41)","v":9},null,null,null,"Level:",{"$f":"Level","v":3}]
[null,null,null,null,null,null,null,null,null,null,"Spent",null,null,null,null,null,null,null,null,"Total hits:",{"$f":"IF(P12>(HLOOKUP(Ras,Rasbonus!$B$1:$AJ$16,16,FALSE)+CO),ROUND(((HLOOKUP(Ras,Rasbonus!$B$1:$AJ$16,16,FALSE)+CO))*(1+(CO/100)),0),ROUND(((P12*CO%)+P12),0))","v":25}]
["Magical",0,null,{"$f":"SUM(B44)","v":0},null,null,null,null,null,null,"Recovery (8hr/hr)",null,null,null,{"$f":"SUM(P44*8)","v":16},{"$f":"IF(U45=1,VLOOKUP(U11,Diverse!G82:H186,2),IF(U45=2,VLOOKUP(U12,Diverse!G82:H186,2),IF(U45=3,VLOOKUP(U10,Diverse!G82:H186,2),IF(U45=4,VLOOKUP(SUM(U11:U12)*0.5,Diverse!G82:H186,2),IF(U45=5,VLOOKUP(SUM(U10:U11)*0.5,Diverse!G82:H186,2),IF(U45=6,VLOOKUP(SUM(U11:U12)*0.5,Diverse!G82:H186,2),VLOOKUP(SUM(U10:U12)*0.33,Diverse!G82:H186,2)))))))","v":2},null,null,null,"Baserate",{"$f":"VLOOKUP(U9,Diverse!$A$2:$D$131,4,0)+Y9+$P$47","v":45}]
["Adrenal Defense",{"$f":"IF($P$8<0,0,$P$8)","v":0},null,{"$f":"SUM(B45)","v":0},null,null,null,null,null,null,null,null,null,null,null,null,null,null,null,"Realm:",1]
["Def. Technique",{"$f":"IF(Secondary!$AK$62<0,0,Secondary!$AK$62)","v":0},null,{"$f":"SUM(B46)","v":0},null,null,null,null,null,null,"Character Traits",null,null,null,null,null,null,null,null,"XP:"]
["Def. Weaving",{"$f":"IF(Secondary!$AK$63<0,0,Secondary!$AK$63)","v":0},null,0,null,null,null,null,null,null,"Height:",null,null,165,"cm",{"$f":"VLOOKUP('Ny NPC'!N47,Diverse!G55:H62,2,1)","v":0},null,null,null,"Campaign:"]
["BO",0,null,0,null,null,null,null,null,null,"Weight:",null,null,65,"kg",null,null,null,null,"Year of birth:"]
["Other",0,null,0,null,null,null,null,null,null,"Hair:"]
["Spells",0,null,0,null,null,null,null,null,null,"Eyes:",null,null,null,null,null,null,"Racial Abilities"]
["Inherent",0,null,0,null,null,null,null,null,null,"Scars:"]
[]
["Total",{"$f":"SUM(B40:B42,B44,B48:B52)","v":21},null,{"$f":"SUM(D40:D52)","v":0},null,null,null,null,null,null,"Tattoos:"]
[]
["Resistances",null,null,"Base Spell Casting",null,null,null,null,null,null,"Other:"]
["Channeling",{"$f":"SUM(IN)+HLOOKUP(Ras,Rasbonus!$B$1:$AJ$26,21,0)","v":5},null,"BAR",{"$f":"IF(Level<21,Level*I56,IF(I56>2,60+(Level-20),IF(I56=2,40+((Level-20)*0.5),IF(Level=0,0,IF(I56=0,0,20)))))","v":6},null,null,null,{"$f":"HLOOKUP(Yrke,Levelbonus!$B$1:$CR$20,18,0)","v":2}]
["Essence",{"$f":"SUM(EM)+HLOOKUP(Ras,Rasbonus!$B$1:$AJ$26,20,0)","v":40},null,"Power Man.",{"$f":"IF(Secondary!AC169<31,Secondary!AC169,30)","v":0},null,null,null,null,null,null,null,null,null,null,null,null,null,null,"Armor Type and Weaponry"]
["Mentalism",{"$f":"SUM(PR)+HLOOKUP(Ras,Rasbonus!$B$1:$AJ$26,22,0)","v":40},null,"BO",null,null,null,null,null,null,null,null,null,null,null,null,null,null,null,"Armor Type",null,null,null,null,null,null,null,1]
["Arcane",{"$f":"SUM(B56:B58)/3","v":28.333333333333332},null,"Other",null,null,null,null,null,null,null,null,null,null,null,null,null,null,null,"Max Maneuver Penalty",null,null,null,null,null,null,null,{"$f":"VLOOKUP($AB$58,Diverse!$G$34:$L$53,3,0)","v":0}]
["Poison",{"$f":"SUM(CO)+HLOOKUP(Ras,Rasbonus!$B$1:$AJ$26,19,0)","v":30},null,null,null,null,null,null,null,null,null,null,null,null,null,null,null,null,null,"Min Maneuver Penalty",null,null,null,null,null,null,null,{"$f":"VLOOKUP($AB$58,Diverse!$G$34:$L$53,2,0)","v":0}]
["Disease",{"$f":"SUM(CO)+HLOOKUP(Ras,Rasbonus!$B$1:$AJ$26,18,0)","v":30},null,"Total",{"$f":"SUM(E56:E60)","v":6},null,null,null,null,null,null,null,null,null,null,null,null,null,null,"Quickness Penalty",null,null,null,null,null,null,null,{"$f":"VLOOKUP($AB$58,Diverse!$G$34:$L$53,5,0)","v":0}]
["Fear (Will)",{"$f":"SUM(SD)+HLOOKUP(Ras,Rasbonus!$B$1:$AJ$26,17,0)","v":10},null,null,null,null,null,null,null,null,{"$f":"(R2)","v":"Character Name"},null,null,null,null,"Språk",null,"Spoken/Written",null,"Missile Attack Penalty",null,null,null,null,null,null,null,{"$f":"VLOOKUP($AB$58,Diverse!$G$34:$L$53,4,0)","v":0}]
[null,null,null,null,null,null,null,null,null,null,null,null,null,null,null,"Westron 8/8",null,null,null,"Reverse Armor mod.",null,null,null,null,null,null,null,{"$f":"VLOOKUP($AB$58,Diverse!$G$34:$L$53,6,0)","v":0}]
[]
[null,null,null,"Movement","Difficulty",null,null,null,null,null,"Movement",null,"Exhaustion",null,null,null,null,null,null,"Shield Type:",null,null,null,null,"Armor ESF",null,null,{"$f":"IF(U45=1,VLOOKUP(AB58,Diverse!G34:N53,7),IF(U45=3,0,IF(U45=5,VLOOKUP(AB58,Diverse!G34:N53,7),VLOOKUP(AB58,Diverse!G34:N53,8))))","v":0}]
["Initiative",null,null,"Walk (x1)","None",null,null,null,null,null,{"$f":"($U$44)","v":45},null,"1/30 rnds",null,null,null,null,null,null,"Helm Type:",1,null,null,null,"Helm ESF",null,null,{"$f":"IF(U45=1,VLOOKUP(U66,Diverse!K27:N30,2),IF(U45=4,VLOOKUP(U66,Diverse!K27:N30,3),IF(U45=3,VLOOKUP(U66,Diverse!K27:N30,4),VLOOKUP(U66,Diverse!K27:N30,4))))","v":0}]
["QU minus MMP",{"$f":"QU+N3","v":0},null,"Fast walk (x1,5)","Routine",null,null,null,null,null,{"$f":"($U$44)*1.5","v":67.5},null,"1/6 rnds",null,null,null,null,null,null,"Neck prot:",null,null,null,null,"Transcend Armor",null,null,{"$f":"IF(Secondary!$AK$180<0,0,Secondary!$AK$180/3)","v":0}]
["Instinctive Man.",{"$f":"(Secondary!AK75)/5","v":-4.5999999999999996},null,"Run (x2)","Easy",null,null,null,null,null,{"$f":"($U$44)*2","v":90},null,"1/2 rnds",null,null,null,null,null,null,"Nose guard:",null,null,null,null,"Other"]
["Other",0,null,"Sprint (x3)","Light",null,null,null,null,null,{"$f":"($U$44)*3","v":135},null,"5/rnd",null,null,null,null,null,null,"Throat prot:",null,null,null,null,"Total ESF",null,null,{"$f":"IF((AB65+AB66-AB67-AB68<=0),0,AB65+AB66-AB67-AB68)","v":0}]
[null,null,null,"Fast sprint (x4)","Medium",null,null,null,null,null,{"$f":"($U$44)*4","v":180},null,"25/rnd"]
[null,null,null,"Dash (x5)","Hard",null,null,null,null,null,{"$f":"($U$44)*5","v":225},null,"40/rnd",null,null,null,null,null,null,null,null,null,null,null,"QU-Limit",null,{"$f":"IF(I73=1,Diverse!I65,IF(I73=2,Diverse!I66,IF(I73=3,Diverse!I67,IF(I73=4,Diverse!I68,IF(I73=5,Diverse!I69,IF(I73=6,Diverse!I70,IF(I73=7,Diverse!I71)))))))","v":30}]
["Total",{"$f":"IF(B68>B67,IF(B68>0,B68+B69,B67+B69),B67+B69)","v":0},null,"Movement = (Base Rate) x (Pace Multiplier) x (Maneuver Roll Result) /100"]
[null,null,null,null,null,null,null,null,4]

{"sheet":"Secondary","index":2,"n_rows":229,"n_cols":58,"rows_kept":229,"cut":false,"hidden":false,"merged":[]}
["Secondary Skills","Dev.pts per level","Cost 1","Cost 2","Grupp","Adolescence",null,"Annat","Level 1","Level 2","Level 3","Level 4","Level 5","Level 6","Level 7","Level 8","Level 9","Level 10","Level 11","Level 12","Level 13","Level 14","Level 15","Level 16","Level 17","Level 18","Level 19","Level 20","Total ranks","Skill","Stat","Levelbonus","Level","Racial","Armor mods.","Items","Total","Adolescence","Level 1","Level 2","Level 3","Level 4","Level 5","Level 6","Level 7","Level 8","Level 9","Level 10","Level 11","Level 12","Level 13","Level 14","Level 15","Level 16","Level 17","Level 18","Level 19","Level 20"]
["Academic",{"$f":"HLOOKUP(Diverse!$G$2,'2nd'!$B$1:$CR$18,2,FALSE)","v":34},null,null,null,{"$f":"SUM(AL3:AL38)","v":0},null,null,{"$f":"SUM(AM3:AM38)","v":0},0,0,0,0,0,0,0,0,0,0,0,0,0,0,0,0,0,0,0,"Rank","Skill","Stat",null,"Lvl","Race","Armor","Item","Total"]
["Administration",{"$f":"VLOOKUP(A3,AllaSkills!$A$2:$BV$317,'Ny NPC'!$A$2+3,FALSE)","v":"2/5"},{"$f":"IF(LEN(B3)=3,LEFT(B3,1),IF(LEN(B3)<3,B3,99))","v":"2"},{"$f":"IF(RIGHT(B3,1)=\"*\",LEFT(B3,1),IF(LEN(B3)=3,RIGHT(B3,1),IF(LEN(B3)<3,B3,RIGHT(B3,2))))","v":"5"},"Academic",null,null,null,null,null,null,null,null,null,null,null,null,null,null,null,null,null,null,null,null,null,null,null,{"$f":"SUM(F3:AB3)","v":0},{"$f":"IF(AC3<1,-25,IF(AC3>30,80+((AC3-30)*0.5),IF(AC3>20,70+(AC3-20),IF(AC3>10,50+((AC3-10)*2),AC3*5))))","v":-25},{"$f":"(RE+PR)/2","v":2.5},{"$f":"HLOOKUP(Yrke,Levelbonus!$B$1:$CR$20,2,FALSE)","v":3},{"$f":"AF3*Level","v":9},{"$f":"IF(ISNUMBER(VLOOKUP($A3,Rasbonus!$A$61:$AJ$295,MATCH(Ras,Rasbonus!$A$1:$AJ$1,0),FALSE)),VLOOKUP($A3,Rasbonus!$A$61:$AJ$295,MATCH(Ras,Rasbonus!$A$1:$AJ$1,0),FALSE),\"0\")","v":"0"},null,null,{"$f":"ROUND(AD3+AE3+AG3+AH3+AI3+AJ3,0)","v":-14},{"$f":"IF(F3>2,\"99\",IF(F3<1,0,IF(F3=1,$C3+$C3-$C3,IF(F3=2,$C3+$D3))))","v":0},{"$f":"IF(I3>2,\"99\",IF(I3<1,0,IF(I3=1,$C3+$C3-$C3,IF(I3=2,$C3+$D3))))","v":0},0,0,0,0,0,0,0,0,0,0,0,0,0,0,0,0,0,0,0]
["Alchemy",{"$f":"VLOOKUP(A4,AllaSkills!$A$2:$BV$317,'Ny NPC'!$A$2+3,FALSE)","v":"1/3"},"1",{"$f":"IF(RIGHT(B4,1)=\"*\",LEFT(B4,1),IF(LEN(B4)=3,RIGHT(B4,1),IF(LEN(B4)<3,B4,RIGHT(B4,2))))","v":"3"},"Academic",null,null,null,null,null,null,null,null,null,null,null,null,null,null,null,null,null,null,null,null,null,null,null,{"$f":"SUM(F4:AB4)","v":0},{"$f":"IF(AC4<1,-25,IF(AC4>30,80+((AC4-30)*0.5),IF(AC4>20,70+(AC4-20),IF(AC4>10,50+((AC4-10)*2),AC4*5))))","v":-25},{"$f":"(RE)","v":5},{"$f":"HLOOKUP(Yrke,Levelbonus!$B$1:$CR$20,2,FALSE)","v":3},9,{"$f":"IF(ISNUMBER(VLOOKUP($A4,Rasbonus!$A$61:$AJ$295,MATCH(Ras,Rasbonus!$A$1:$AJ$1,0),FALSE)),VLOOKUP($A4,Rasbonus!$A$61:$AJ$295,MATCH(Ras,Rasbonus!$A$1:$AJ$1,0),FALSE),\"0\")","v":"0"},null,null,{"$f":"ROUND(AD4+AE4+AG4+AH4+AI4+AJ4,0)","v":-11},{"$f":"IF(F4>2,\"99\",IF(F4<1,0,IF(F4=1,$C4+$C4-$C4,IF(F4=2,$C4+$D4))))","v":0},{"$f":"IF(I4>2,\"99\",IF(I4<1,0,IF(I4=1,$C4+$C4-$C4,IF(I4=2,$C4+$D4))))","v":0},{"$f":"IF(J4>2,\"99\",IF(J4<1,0,IF(J4=1,$C4+$C4-$C4,IF(J4=2,$C4+$D4))))","v":0},{"$f":"IF(K4>2,\"99\",IF(K4<1,0,IF(K4=1,$C4+$C4-$C4,IF(K4=2,$C4+$D4))))","v":0},{"$f":"IF(L4>2,\"99\",IF(L4<1,0,IF(L4=1,$C4+$C4-$C4,IF(L4=2,$C4+$D4))))","v":0},{"$f":"IF(M4>2,\"99\",IF(M4<1,0,IF(M4=1,$C4+$C4-$C4,IF(M4=2,$C4+$D4))))","v":0},{"$f":"IF(N4>2,\"99\",IF(N4<1,0,IF(N4=1,$C4+$C4-$C4,IF(N4=2,$C4+$D4))))","v":0},{"$f":"IF(O4>2,\"99\",IF(O4<1,0,IF(O4=1,$C4+$C4-$C4,IF(O4=2,$C4+$D4))))","v":0},{"$f":"IF(P4>2,\"99\",IF(P4<1,0,IF(P4=1,$C4+$C4-$C4,IF(P4=2,$C4+$D4))))","v":0},{"$f":"IF(Q4>2,\"99\",IF(Q4<1,0,IF(Q4=1,$C4+$C4-$C4,IF(Q4=2,$C4+$D4))))","v":0},{"$f":"IF(R4>2,\"99\",IF(R4<1,0,IF(R4=1,$C4+$C4-$C4,IF(R4=2,$C4+$D4))))","v":0},{"$f":"IF(S4>2,\"99\",IF(S4<1,0,IF(S4=1,$C4+$C4-$C4,IF(S4=2,$C4+$D4))))","v":0},{"$f":"IF(T4>2,\"99\",IF(T4<1,0,IF(T4=1,$C4+$C4-$C4,IF(T4=2,$C4+$D4))))","v":0},{"$f":"IF(U4>2,\"99\",IF(U4<1,0,IF(U4=1,$C4+$C4-$C4,IF(U4=2,$C4+$D4))))","v":0},{"$f":"IF(V4>2,\"99\",IF(V4<1,0,IF(V4=1,$C4+$C4-$C4,IF(V4=2,$C4+$D4))))","v":0},{"$f":"IF(W4>2,\"99\",IF(W4<1,0,IF(W4=1,$C4+$C4-$C4,IF(W4=2,$C4+$D4))))","v":0},{"$f":"IF(X4>2,\"99\",IF(X4<1,0,IF(X4=1,$C4+$C4-$C4,IF(X4=2,$C4+$D4))))","v":0},{"$f":"IF(Y4>2,\"99\",IF(Y4<1,0,IF(Y4=1,$C4+$C4-$C4,IF(Y4=2,$C4+$D4))))","v":0},{"$f":"IF(Z4>2,\"99\",IF(Z4<1,0,IF(Z4=1,$C4+$C4-$C4,IF(Z4=2,$C4+$D4))))","v":0},{"$f":"IF(AA4>2,\"99\",IF(AA4<1,0,IF(AA4=1,$C4+$C4-$C4,IF(AA4=2,$C4+$D4))))","v":0},{"$f":"IF(AB4>2,\"99\",IF(AB4<1,0,IF(AB4=1,$C4+$C4-$C4,IF(AB4=2,$C4+$D4))))","v":0}]
["Architecture",{"$f":"VLOOKUP(A5,AllaSkills!$A$2:$BV$317,'Ny NPC'!$A$2+3,FALSE)","v":"2/5"},"2","5","Academic",null,null,null,null,null,null,null,null,null,null,null,null,null,null,null,null,null,null,null,null,null,null,null,0,-25,{"$f":"(RE+EM)/2","v":2.5},{"$f":"HLOOKUP(Yrke,Levelbonus!$B$1:$CR$20,2,FALSE)","v":3},9,{"$f":"IF(ISNUMBER(VLOOKUP($A5,Rasbonus!$A$61:$AJ$295,MATCH(Ras,Rasbonus!$A$1:$AJ$1,0),FALSE)),VLOOKUP($A5,Rasbonus!$A$61:$AJ$295,MATCH(Ras,Rasbonus!$A$1:$AJ$1,0),FALSE),\"0\")","v":"0"},null,null,-14,0,0,0,0,0,0,0,0,0,0,0,0,0,0,0,0,0,0,0,0,0]
["Basic Mathematics",{"$f":"VLOOKUP(A6,AllaSkills!$A$2:$BV$317,'Ny NPC'!$A$2+3,FALSE)","v":"1/4"},"1","4","Academic",null,null,null,null,null,null,null,null,null,null,null,null,null,null,null,null,null,null,null,null,null,null,null,0,-25,{"$f":"(RE)","v":5},{"$f":"HLOOKUP(Yrke,Levelbonus!$B$1:$CR$20,2,FALSE)","v":3},9,{"$f":"IF(ISNUMBER(VLOOKUP($A6,Rasbonus!$A$61:$AJ$295,MATCH(Ras,Rasbonus!$A$1:$AJ$1,0),FALSE)),VLOOKUP($A6,Rasbonus!$A$61:$AJ$295,MATCH(Ras,Rasbonus!$A$1:$AJ$1,0),FALSE),\"0\")","v":"0"},null,null,-11,0,0,0,0,0,0,0,0,0,0,0,0,0,0,0,0,0,0,0,0,0]
["Biochemistry",{"$f":"VLOOKUP(A7,AllaSkills!$A$2:$BV$317,'Ny NPC'!$A$2+3,FALSE)","v":"5"},"5","5","Academic",null,null,null,null,null,null,null,null,null,null,null,null,null,null,null,null,null,null,null,null,null,null,null,0,-25,{"$f":"(IN+RE)/2","v":5},{"$f":"HLOOKUP(Yrke,Levelbonus!$B$1:$CR$20,2,FALSE)","v":3},9,{"$f":"IF(ISNUMBER(VLOOKUP($A7,Rasbonus!$A$61:$AJ$295,MATCH(Ras,Rasbonus!$A$1:$AJ$1,0),FALSE)),VLOOKUP($A7,Rasbonus!$A$61:$AJ$295,MATCH(Ras,Rasbonus!$A$1:$AJ$1,0),FALSE),\"0\")","v":"0"},null,null,-11,0,0,0,0,0,0,0,0,0,0,0,0,0,0,0,0,0,0,0,0,0]
["Boat Pilot",{"$f":"VLOOKUP(A8,AllaSkills!$A$2:$BV$317,'Ny NPC'!$A$2+3,FALSE)","v":"2/6"},"2","6","Academic",null,null,null,null,null,null,null,null,null,null,null,null,null,null,null,null,null,null,null,null,null,null,null,0,-25,{"$f":"(RE+AG)/2","v":2.5},{"$f":"HLOOKUP(Yrke,Levelbonus!$B$1:$CR$20,2,FALSE)","v":3},9,{"$f":"IF(ISNUMBER(VLOOKUP($A8,Rasbonus!$A$61:$AJ$295,MATCH(Ras,Rasbonus!$A$1:$AJ$1,0),FALSE)),VLOOKUP($A8,Rasbonus!$A$61:$AJ$295,MATCH(Ras,Rasbonus!$A$1:$AJ$1,0),FALSE),\"0\")","v":"0"},null,null,-14,0,0,0,0,0,0,0,0,0,0,0,0,0,0,0,0,0,0,0,0,0]
["Cryptography",{"$f":"VLOOKUP(A9,AllaSkills!$A$2:$BV$317,'Ny NPC'!$A$2+3,FALSE)","v":"2/6"},"2","6","Academic",null,null,null,null,null,null,null,null,null,null,null,null,null,null,null,null,null,null,null,null,null,null,null,0,-25,{"$f":"(IN+RE)/2","v":5},{"$f":"HLOOKUP(Yrke,Levelbonus!$B$1:$CR$20,2,FALSE)","v":3},9,{"$f":"IF(ISNUMBER(VLOOKUP($A9,Rasbonus!$A$61:$AJ$295,MATCH(Ras,Rasbonus!$A$1:$AJ$1,0),FALSE)),VLOOKUP($A9,Rasbonus!$A$61:$AJ$295,MATCH(Ras,Rasbonus!$A$1:$AJ$1,0),FALSE),\"0\")","v":"0"},null,null,-11,0,0,0,0,0,0,0,0,0,0,0,0,0,0,0,0,0,0,0,0,0]
["Demon/Devil Lore",{"$f":"VLOOKUP(A10,AllaSkills!$A$2:$BV$317,'Ny NPC'!$A$2+3,FALSE)","v":"1/3"},"1","3","Academic",null,null,null,null,null,null,null,null,null,null,null,null,null,null,null,null,null,null,null,null,null,null,null,0,-25,{"$f":"(RE)","v":5},{"$f":"HLOOKUP(Yrke,Levelbonus!$B$1:$CR$20,2,FALSE)","v":3},9,{"$f":"IF(ISNUMBER(VLOOKUP($A10,Rasbonus!$A$61:$AJ$295,MATCH(Ras,Rasbonus!$A$1:$AJ$1,0),FALSE)),VLOOKUP($A10,Rasbonus!$A$61:$AJ$295,MATCH(Ras,Rasbonus!$A$1:$AJ$1,0),FALSE),\"0\")","v":"0"},null,null,-11,0,0,0,0,0,0,0,0,0,0,0,0,0,0,0,0,0,0,0,0,0]
["Drafting",{"$f":"VLOOKUP(A11,AllaSkills!$A$2:$BV$317,'Ny NPC'!$A$2+3,FALSE)","v":"1/3"},"1","3","Academic",null,null,null,null,null,null,null,null,null,null,null,null,null,null,null,null,null,null,null,null,null,null,null,0,-25,{"$f":"(RE)","v":5},{"$f":"HLOOKUP(Yrke,Levelbonus!$B$1:$CR$20,2,FALSE)","v":3},9,{"$f":"IF(ISNUMBER(VLOOKUP($A11,Rasbonus!$A$61:$AJ$295,MATCH(Ras,Rasbonus!$A$1:$AJ$1,0),FALSE)),VLOOKUP($A11,Rasbonus!$A$61:$AJ$295,MATCH(Ras,Rasbonus!$A$1:$AJ$1,0),FALSE),\"0\")","v":"0"},null,null,-11,0,0,0,0,0,0,0,0,0,0,0,0,0,0,0,0,0,0,0,0,0]
["Dragon Lore",{"$f":"VLOOKUP(A12,AllaSkills!$A$2:$BV$317,'Ny NPC'!$A$2+3,FALSE)","v":"1/3"},"1","3","Academic",null,null,null,null,null,null,null,null,null,null,null,null,null,null,null,null,null,null,null,null,null,null,null,0,-25,{"$f":"(RE)","v":5},{"$f":"HLOOKUP(Yrke,Levelbonus!$B$1:$CR$20,2,FALSE)","v":3},9,{"$f":"IF(ISNUMBER(VLOOKUP($A12,Rasbonus!$A$61:$AJ$295,MATCH(Ras,Rasbonus!$A$1:$AJ$1,0),FALSE)),VLOOKUP($A12,Rasbonus!$A$61:$AJ$295,MATCH(Ras,Rasbonus!$A$1:$AJ$1,0),FALSE),\"0\")","v":"0"},null,null,-11,0,0,0,0,0,0,0,0,0,0,0,0,0,0,0,0,0,0,0,0,0]
["Engineering",{"$f":"VLOOKUP(A13,AllaSkills!$A$2:$BV$317,'Ny NPC'!$A$2+3,FALSE)","v":"1/2"},"1","2","Academic",null,null,null,null,null,null,null,null,null,null,null,null,null,null,null,null,null,null,null,null,null,null,null,0,-25,{"$f":"(IN+RE)/2","v":5},{"$f":"HLOOKUP(Yrke,Levelbonus!$B$1:$CR$20,2,FALSE)","v":3},9,{"$f":"IF(ISNUMBER(VLOOKUP($A13,Rasbonus!$A$61:$AJ$295,MATCH(Ras,Rasbonus!$A$1:$AJ$1,0),FALSE)),VLOOKUP($A13,Rasbonus!$A$61:$AJ$295,MATCH(Ras,Rasbonus!$A$1:$AJ$1,0),FALSE),\"0\")","v":"0"},null,null,-11,0,0,0,0,0,0,0,0,0,0,0,0,0,0,0,0,0,0,0,0,0]
["Faerie Lore",{"$f":"VLOOKUP(A14,AllaSkills!$A$2:$BV$317,'Ny NPC'!$A$2+3,FALSE)","v":"1/3"},"1","3","Academic",null,null,null,null,null,null,null,null,null,null,null,null,null,null,null,null,null,null,null,null,null,null,null,0,-25,{"$f":"(RE)","v":5},{"$f":"HLOOKUP(Yrke,Levelbonus!$B$1:$CR$20,2,FALSE)","v":3},9,{"$f":"IF(ISNUMBER(VLOOKUP($A14,Rasbonus!$A$61:$AJ$295,MATCH(Ras,Rasbonus!$A$1:$AJ$1,0),FALSE)),VLOOKUP($A14,Rasbonus!$A$61:$AJ$295,MATCH(Ras,Rasbonus!$A$1:$AJ$1,0),FALSE),\"0\")","v":"0"},null,null,-11,0,0,0,0,0,0,0,0,0,0,0,0,0,0,0,0,0,0,0,0,0]
["Fauna Lore",{"$f":"VLOOKUP(A15,AllaSkills!$A$2:$BV$317,'Ny NPC'!$A$2+3,FALSE)","v":"1/4"},"1","4","Academic",null,null,null,null,null,null,null,null,null,null,null,null,null,null,null,null,null,null,null,null,null,null,null,0,-25,5,{"$f":"HLOOKUP(Yrke,Levelbonus!$B$1:$CR$20,2,FALSE)","v":3},9,{"$f":"IF(ISNUMBER(VLOOKUP($A15,Rasbonus!$A$61:$AJ$295,MATCH(Ras,Rasbonus!$A$1:$AJ$1,0),FALSE)),VLOOKUP($A15,Rasbonus!$A$61:$AJ$295,MATCH(Ras,Rasbonus!$A$1:$AJ$1,0),FALSE),\"0\")","v":"0"},null,null,-11,0,0,0,0,0,0,0,0,0,0,0,0,0,0,0,0,0,0,0,0,0]
["Flora Lore",{"$f":"VLOOKUP(A16,AllaSkills!$A$2:$BV$317,'Ny NPC'!$A$2+3,FALSE)","v":"1/4"},"1","4","Academic",null,null,null,null,null,null,null,null,null,null,null,null,null,null,null,null,null,null,null,null,null,null,null,0,-25,5,{"$f":"HLOOKUP(Yrke,Levelbonus!$B$1:$CR$20,2,FALSE)","v":3},9,{"$f":"IF(ISNUMBER(VLOOKUP($A16,Rasbonus!$A$61:$AJ$295,MATCH(Ras,Rasbonus!$A$1:$AJ$1,0),FALSE)),VLOOKUP($A16,Rasbonus!$A$61:$AJ$295,MATCH(Ras,Rasbonus!$A$1:$AJ$1,0),FALSE),\"0\")","v":"0"},null,null,-11,0,0,0,0,0,0,0,0,0,0,0,0,0,0,0,0,0,0,0,0,0]
["Heraldry",{"$f":"VLOOKUP(A17,AllaSkills!$A$2:$BV$317,'Ny NPC'!$A$2+3,FALSE)","v":"3/5"},"3","5","Academic",null,null,null,null,null,null,null,null,null,null,null,null,null,null,null,null,null,null,null,null,null,null,null,0,-25,5,{"$f":"HLOOKUP(Yrke,Levelbonus!$B$1:$CR$20,2,FALSE)","v":3},9,{"$f":"IF(ISNUMBER(VLOOKUP($A17,Rasbonus!$A$61:$AJ$295,MATCH(Ras,Rasbonus!$A$1:$AJ$1,0),FALSE)),VLOOKUP($A17,Rasbonus!$A$61:$AJ$295,MATCH(Ras,Rasbonus!$A$1:$AJ$1,0),FALSE),\"0\")","v":"0"},null,null,-11,0,0,0,0,0,0,0,0,0,0,0,0,0,0,0,0,0,0,0,0,0]
["Herb Lore",{"$f":"VLOOKUP(A18,AllaSkills!$A$2:$BV$317,'Ny NPC'!$A$2+3,FALSE)","v":"1/3"},"1","3","Academic",null,null,null,null,null,null,null,null,null,null,null,null,null,null,null,null,null,null,null,null,null,null,null,0,-25,5,{"$f":"HLOOKUP(Yrke,Levelbonus!$B$1:$CR$20,2,FALSE)","v":3},9,{"$f":"IF(ISNUMBER(VLOOKUP($A18,Rasbonus!$A$61:$AJ$295,MATCH(Ras,Rasbonus!$A$1:$AJ$1,0),FALSE)),VLOOKUP($A18,Rasbonus!$A$61:$AJ$295,MATCH(Ras,Rasbonus!$A$1:$AJ$1,0),FALSE),\"0\")","v":"0"},null,null,-11,0,0,0,0,0,0,0,0,0,0,0,0,0,0,0,0,0,0,0,0,0]
["Lock Lore",{"$f":"VLOOKUP(A19,AllaSkills!$A$2:$BV$317,'Ny NPC'!$A$2+3,FALSE)","v":"1/3"},"1","3","Academic",null,null,null,null,null,null,null,null,null,null,null,null,null,null,null,null,null,null,null,null,null,null,null,0,-25,5,{"$f":"HLOOKUP(Yrke,Levelbonus!$B$1:$CR$20,2,FALSE)","v":3},9,{"$f":"IF(ISNUMBER(VLOOKUP($A19,Rasbonus!$A$61:$AJ$295,MATCH(Ras,Rasbonus!$A$1:$AJ$1,0),FALSE)),VLOOKUP($A19,Rasbonus!$A$61:$AJ$295,MATCH(Ras,Rasbonus!$A$1:$AJ$1,0),FALSE),\"0\")","v":10},null,null,-1,0,0,0,0,0,0,0,0,0,0,0,0,0,0,0,0,0,0,0,0,0]
["Mapping",{"$f":"VLOOKUP(A20,AllaSkills!$A$2:$BV$317,'Ny NPC'!$A$2+3,FALSE)","v":"2"},"2","2","Academic",null,null,null,null,null,null,null,null,null,null,null,null,null,null,null,null,null,null,null,null,null,null,null,0,-25,5,{"$f":"HLOOKUP(Yrke,Levelbonus!$B$1:$CR$20,2,FALSE)","v":3},9,{"$f":"IF(ISNUMBER(VLOOKUP($A20,Rasbonus!$A$61:$AJ$295,MATCH(Ras,Rasbonus!$A$1:$AJ$1,0),FALSE)),VLOOKUP($A20,Rasbonus!$A$61:$AJ$295,MATCH(Ras,Rasbonus!$A$1:$AJ$1,0),FALSE),\"0\")","v":"0"},null,null,-11,0,0,0,0,0,0,0,0,0,0,0,0,0,0,0,0,0,0,0,0,0]
["Mechanition",{"$f":"VLOOKUP(A21,AllaSkills!$A$2:$BV$317,'Ny NPC'!$A$2+3,FALSE)","v":"1/2"},"1","2","Academic",null,null,null,null,null,null,null,null,null,null,null,null,null,null,null,null,null,null,null,null,null,null,null,0,-25,{"$f":"(AG+RE)/2","v":2.5},{"$f":"HLOOKUP(Yrke,Levelbonus!$B$1:$CR$20,2,FALSE)","v":3},9,{"$f":"IF(ISNUMBER(VLOOKUP($A21,Rasbonus!$A$61:$AJ$295,MATCH(Ras,Rasbonus!$A$1:$AJ$1,0),FALSE)),VLOOKUP($A21,Rasbonus!$A$61:$AJ$295,MATCH(Ras,Rasbonus!$A$1:$AJ$1,0),FALSE),\"0\")","v":"0"},null,null,-14,0,0,0,0,0,0,0,0,0,0,0,0,0,0,0,0,0,0,0,0,0]
["Metal Lore",{"$f":"VLOOKUP(A22,AllaSkills!$A$2:$BV$317,'Ny NPC'!$A$2+3,FALSE)","v":"1/2"},"1","2","Academic",null,null,null,null,null,null,null,null,null,null,null,null,null,null,null,null,null,null,null,null,null,null,null,0,-25,{"$f":"(RE)","v":5},{"$f":"HLOOKUP(Yrke,Levelbonus!$B$1:$CR$20,2,FALSE)","v":3},9,{"$f":"IF(ISNUMBER(VLOOKUP($A22,Rasbonus!$A$61:$AJ$295,MATCH(Ras,Rasbonus!$A$1:$AJ$1,0),FALSE)),VLOOKUP($A22,Rasbonus!$A$61:$AJ$295,MATCH(Ras,Rasbonus!$A$1:$AJ$1,0),FALSE),\"0\")","v":10},null,null,-1,0,0,0,0,0,0,0,0,0,0,0,0,0,0,0,0,0,0,0,0,0]
["Military Organization",{"$f":"VLOOKUP(A23,AllaSkills!$A$2:$BV$317,'Ny NPC'!$A$2+3,FALSE)","v":"3/6"},"3","6","Academic",null,null,null,null,null,null,null,null,null,null,null,null,null,null,null,null,null,null,null,null,null,null,null,0,-25,{"$f":"(PR+RE)/2","v":2.5},{"$f":"HLOOKUP(Yrke,Levelbonus!$B$1:$CR$20,2,FALSE)","v":3},9,{"$f":"IF(ISNUMBER(VLOOKUP($A23,Rasbonus!$A$61:$AJ$295,MATCH(Ras,Rasbonus!$A$1:$AJ$1,0),FALSE)),VLOOKUP($A23,Rasbonus!$A$61:$AJ$295,MATCH(Ras,Rasbonus!$A$1:$AJ$1,0),FALSE),\"0\")","v":"0"},null,null,-14,0,0,0,0,0,0,0,0,0,0,0,0,0,0,0,0,0,0,0,0,0]
["Mining",{"$f":"VLOOKUP(A24,AllaSkills!$A$2:$BV$317,'Ny NPC'!$A$2+3,FALSE)","v":"3"},"3","3","Academic",null,null,null,null,null,null,null,null,null,null,null,null,null,null,null,null,null,null,null,null,null,null,null,0,-25,{"$f":"(RE+IN)/2","v":5},{"$f":"HLOOKUP(Yrke,Levelbonus!$B$1:$CR$20,2,FALSE)","v":3},9,{"$f":"IF(ISNUMBER(VLOOKUP($A24,Rasbonus!$A$61:$AJ$295,MATCH(Ras,Rasbonus!$A$1:$AJ$1,0),FALSE)),VLOOKUP($A24,Rasbonus!$A$61:$AJ$295,MATCH(Ras,Rasbonus!$A$1:$AJ$1,0),FALSE),\"0\")","v":10},null,null,-1,0,0,0,0,0,0,0,0,0,0,0,0,0,0,0,0,0,0,0,0,0]
["Navigation",{"$f":"VLOOKUP(A25,AllaSkills!$A$2:$BV$317,'Ny NPC'!$A$2+3,FALSE)","v":"2/6"},"2","6","Academic",null,null,null,null,null,null,null,null,null,null,null,null,null,null,null,null,null,null,null,null,null,null,null,0,-25,{"$f":"(RE+IN)/2","v":5},{"$f":"HLOOKUP(Yrke,Levelbonus!$B$1:$CR$20,2,FALSE)","v":3},9,{"$f":"IF(ISNUMBER(VLOOKUP($A25,Rasbonus!$A$61:$AJ$295,MATCH(Ras,Rasbonus!$A$1:$AJ$1,0),FALSE)),VLOOKUP($A25,Rasbonus!$A$61:$AJ$295,MATCH(Ras,Rasbonus!$A$1:$AJ$1,0),FALSE),\"0\")","v":"0"},null,null,-11,0,0,0,0,0,0,0,0,0,0,0,0,0,0,0,0,0,0,0,0,0]
["Phil/Relig. Doctrine",{"$f":"VLOOKUP(A26,AllaSkills!$A$2:$BV$317,'Ny NPC'!$A$2+3,FALSE)","v":"1/2"},"1","2","Academic",null,null,null,null,null,null,null,null,null,null,null,null,null,null,null,null,null,null,null,null,null,null,null,0,-25,{"$f":"(IN+RE)/2","v":5},{"$f":"HLOOKUP(Yrke,Levelbonus!$B$1:$CR$20,2,FALSE)","v":3},9,{"$f":"IF(ISNUMBER(VLOOKUP($A26,Rasbonus!$A$61:$AJ$295,MATCH(Ras,Rasbonus!$A$1:$AJ$1,0),FALSE)),VLOOKUP($A26,Rasbonus!$A$61:$AJ$295,MATCH(Ras,Rasbonus!$A$1:$AJ$1,0),FALSE),\"0\")","v":"0"},null,null,-11,0,0,0,0,0,0,0,0,0,0,0,0,0,0,0,0,0,0,0,0,0]
["Poison Lore",{"$f":"VLOOKUP(A27,AllaSkills!$A$2:$BV$317,'Ny NPC'!$A$2+3,FALSE)","v":"1/3"},"1","3","Academic",null,null,null,null,null,null,null,null,null,null,null,null,null,null,null,null,null,null,null,null,null,null,null,0,-25,{"$f":"(RE)","v":5},{"$f":"HLOOKUP(Yrke,Levelbonus!$B$1:$CR$20,2,FALSE)","v":3},9,{"$f":"IF(ISNUMBER(VLOOKUP($A27,Rasbonus!$A$61:$AJ$295,MATCH(Ras,Rasbonus!$A$1:$AJ$1,0),FALSE)),VLOOKUP($A27,Rasbonus!$A$61:$AJ$295,MATCH(Ras,Rasbonus!$A$1:$AJ$1,0),FALSE),\"0\")","v":"0"},null,null,-11,0,0,0,0,0,0,0,0,0,0,0,0,0,0,0,0,0,0,0,0,0]
["Racial History",{"$f":"VLOOKUP(A28,AllaSkills!$A$2:$BV$317,'Ny NPC'!$A$2+3,FALSE)","v":"1/4"},"1",{"$f":"IF(RIGHT(B28,1)=\"*\",LEFT(B28,1),IF(LEN(B28)=3,RIGHT(B28,1),IF(LEN(B28)<3,B28,RIGHT(B28,2))))","v":"4"},"Academic",null,null,null,null,null,null,null,null,null,null,null,null,null,null,null,null,null,null,null,null,null,null,null,{"$f":"SUM(F28:AB28)","v":0},-25,{"$f":"(RE)","v":5},{"$f":"HLOOKUP(Yrke,Levelbonus!$B$1:$CR$20,2,FALSE)","v":3},9,{"$f":"IF(ISNUMBER(VLOOKUP($A28,Rasbonus!$A$61:$AJ$295,MATCH(Ras,Rasbonus!$A$1:$AJ$1,0),FALSE)),VLOOKUP($A28,Rasbonus!$A$61:$AJ$295,MATCH(Ras,Rasbonus!$A$1:$AJ$1,0),FALSE),\"0\")","v":"0"},null,null,-11,0,0,0,0,0,0,0,0,0,0,0,0,0,0,0,0,0,0,0,0,0]
[null,null,null,null,null,null,null,null,null,null,null,null,null,null,null,null,null,null,null,null,null,null,null,null,null,null,null,null,null,null,null,null,null,null,null,null,null,0,0,0,0,0,0,0,0,0,0,0,0,0,0,0,0,0,0,0,0,0]
["Sanity Healing Lore",{"$f":"VLOOKUP(A30,AllaSkills!$A$2:$BV$317,'Ny NPC'!$A$2+3,FALSE)","v":"2"},{"$f":"IF(LEN(B30)=3,LEFT(B30,1),IF(LEN(B30)<3,B30,99))","v":"2"},"2","Academic",null,null,null,null,null,null,null,null,null,null,null,null,null,null,null,null,null,null,null,null,null,null,null,0,-25,{"$f":"(EM)","v":0},{"$f":"HLOOKUP(Yrke,Levelbonus!$B$1:$CR$20,2,FALSE)","v":3},9,{"$f":"IF(ISNUMBER(VLOOKUP($A30,Rasbonus!$A$61:$AJ$295,MATCH(Ras,Rasbonus!$A$1:$AJ$1,0),FALSE)),VLOOKUP($A30,Rasbonus!$A$61:$AJ$295,MATCH(Ras,Rasbonus!$A$1:$AJ$1,0),FALSE),\"0\")","v":"0"},null,null,-16,0,0,0,0,0,0,0,0,0,0,0,0,0,0,0,0,0,0,0,0,0]
["Siege Engineer",{"$f":"VLOOKUP(A31,AllaSkills!$A$2:$BV$317,'Ny NPC'!$A$2+3,FALSE)","v":"2/4"},{"$f":"IF(LEN(B31)=3,LEFT(B31,1),IF(LEN(B31)<3,B31,99))","v":"2"},"4","Academic",null,null,null,null,null,null,null,null,null,null,null,null,null,null,null,null,null,null,null,null,null,null,null,0,-25,{"$f":"(RE+IN)/2","v":5},{"$f":"HLOOKUP(Yrke,Levelbonus!$B$1:$CR$20,2,FALSE)","v":3},9,{"$f":"IF(ISNUMBER(VLOOKUP($A31,Rasbonus!$A$61:$AJ$295,MATCH(Ras,Rasbonus!$A$1:$AJ$1,0),FALSE)),VLOOKUP($A31,Rasbonus!$A$61:$AJ$295,MATCH(Ras,Rasbonus!$A$1:$AJ$1,0),FALSE),\"0\")","v":"0"},null,null,-11,0,0,0,0,0,0,0,0,0,0,0,0,0,0,0,0,0,0,0,0,0]
["Spec. know. Lore",{"$f":"VLOOKUP(A32,AllaSkills!$A$2:$BV$317,'Ny NPC'!$A$2+3,FALSE)","v":"1/3"},{"$f":"IF(LEN(B32)=3,LEFT(B32,1),IF(LEN(B32)<3,B32,99))","v":"1"},"3","Academic",null,null,null,null,null,null,null,null,null,null,null,null,null,null,null,null,null,null,null,null,null,null,null,0,-25,{"$f":"(RE)","v":5},{"$f":"HLOOKUP(Yrke,Levelbonus!$B$1:$CR$20,2,FALSE)","v":3},9,{"$f":"IF(ISNUMBER(VLOOKUP($A32,Rasbonus!$A$61:$AJ$295,MATCH(Ras,Rasbonus!$A$1:$AJ$1,0),FALSE)),VLOOKUP($A32,Rasbonus!$A$61:$AJ$295,MATCH(Ras,Rasbonus!$A$1:$AJ$1,0),FALSE),\"0\")","v":"0"},null,null,-11,0,0,0,0,0,0,0,0,0,0,0,0,0,0,0,0,0,0,0,0,0]
[null,null,null,null,null,null,null,null,null,null,null,null,null,null,null,null,null,null,null,null,null,null,null,null,null,null,null,null,null,null,null,null,null,null,null,null,null,0,0,0,0,0,0,0,0,0,0,0,0,0,0,0,0,0,0,0,0,0]
["Star-gazing",{"$f":"VLOOKUP(A34,AllaSkills!$A$2:$BV$317,'Ny NPC'!$A$2+3,FALSE)","v":"2/6"},{"$f":"IF(LEN(B34)=3,LEFT(B34,1),IF(LEN(B34)<3,B34,99))","v":"2"},"6","Academic",null,null,null,null,null,null,null,null,null,null,null,null,null,null,null,null,null,null,null,null,null,null,null,0,-25,{"$f":"(IN+RE)/2","v":5},{"$f":"HLOOKUP(Yrke,Levelbonus!$B$1:$CR$20,2,FALSE)","v":3},9,{"$f":"IF(ISNUMBER(VLOOKUP($A34,Rasbonus!$A$61:$AJ$295,MATCH(Ras,Rasbonus!$A$1:$AJ$1,0),FALSE)),VLOOKUP($A34,Rasbonus!$A$61:$AJ$295,MATCH(Ras,Rasbonus!$A$1:$AJ$1,0),FALSE),\"0\")","v":"0"},null,null,-11,0,0,0,0,0,0,0,0,0,0,0,0,0,0,0,0,0,0,0,0,0]
["Stone Lore",{"$f":"VLOOKUP(A35,AllaSkills!$A$2:$BV$317,'Ny NPC'!$A$2+3,FALSE)","v":"1/2"},{"$f":"IF(LEN(B35)=3,LEFT(B35,1),IF(LEN(B35)<3,B35,99))","v":"1"},"2","Academic",null,null,null,null,null,null,null,null,null,null,null,null,null,null,null,null,null,null,null,null,null,null,null,0,-25,{"$f":"(RE)","v":5},{"$f":"HLOOKUP(Yrke,Levelbonus!$B$1:$CR$20,2,FALSE)","v":3},9,{"$f":"IF(ISNUMBER(VLOOKUP($A35,Rasbonus!$A$61:$AJ$295,MATCH(Ras,Rasbonus!$A$1:$AJ$1,0),FALSE)),VLOOKUP($A35,Rasbonus!$A$61:$AJ$295,MATCH(Ras,Rasbonus!$A$1:$AJ$1,0),FALSE),\"0\")","v":10},null,null,-1,0,0,0,0,0,0,0,0,0,0,0,0,0,0,0,0,0,0,0,0,0]
["Tactics",{"$f":"VLOOKUP(A36,AllaSkills!$A$2:$BV$317,'Ny NPC'!$A$2+3,FALSE)","v":"2/4"},{"$f":"IF(LEN(B36)=3,LEFT(B36,1),IF(LEN(B36)<3,B36,99))","v":"2"},"4","Academic",null,null,null,null,null,null,null,null,null,null,null,null,null,null,null,null,null,null,null,null,null,null,null,0,-25,{"$f":"(IN+RE)/2","v":5},{"$f":"HLOOKUP(Yrke,Levelbonus!$B$1:$CR$20,2,FALSE)","v":3},9,{"$f":"IF(ISNUMBER(VLOOKUP($A36,Rasbonus!$A$61:$AJ$295,MATCH(Ras,Rasbonus!$A$1:$AJ$1,0),FALSE)),VLOOKUP($A36,Rasbonus!$A$61:$AJ$295,MATCH(Ras,Rasbonus!$A$1:$AJ$1,0),FALSE),\"0\")","v":"0"},null,null,-11,0,0,0,0,0,0,0,0,0,0,0,0,0,0,0,0,0,0,0,0,0]
["Trading lore",{"$f":"VLOOKUP(A37,AllaSkills!$A$2:$BV$317,'Ny NPC'!$A$2+3,FALSE)","v":"2/6"},{"$f":"IF(LEN(B37)=3,LEFT(B37,1),IF(LEN(B37)<3,B37,99))","v":"2"},"6","Academic",null,null,null,null,null,null,null,null,null,null,null,null,null,null,null,null,null,null,null,null,null,null,null,0,-25,{"$f":"(RE)","v":5},{"$f":"HLOOKUP(Yrke,Levelbonus!$B$1:$CR$20,2,FALSE)","v":3},9,{"$f":"IF(ISNUMBER(VLOOKUP($A37,Rasbonus!$A$61:$AJ$295,MATCH(Ras,Rasbonus!$A$1:$AJ$1,0),FALSE)),VLOOKUP($A37,Rasbonus!$A$61:$AJ$295,MATCH(Ras,Rasbonus!$A$1:$AJ$1,0),FALSE),\"0\")","v":"0"},null,null,-11,0,0,0,0,0,0,0,0,0,0,0,0,0,0,0,0,0,0,0,0,0]
["Weather Watching",{"$f":"VLOOKUP(A38,AllaSkills!$A$2:$BV$317,'Ny NPC'!$A$2+3,FALSE)","v":"1/4"},{"$f":"IF(LEN(B38)=3,LEFT(B38,1),IF(LEN(B38)<3,B38,99))","v":"1"},{"$f":"IF(RIGHT(B38,1)=\"*\",LEFT(B38,1),IF(LEN(B38)=3,RIGHT(B38,1),IF(LEN(B38)<3,B38,RIGHT(B38,2))))","v":"4"},"Academic",null,null,null,null,null,null,null,null,null,null,null,null,null,null,null,null,null,null,null,null,null,null,null,{"$f":"SUM(F38:AB38)","v":0},{"$f":"IF(AC38<1,-25,IF(AC38>30,80+((AC38-30)*0.5),IF(AC38>20,70+(AC38-20),IF(AC38>10,50+((AC38-10)*2),AC38*5))))","v":-25},{"$f":"(IN+EM)/2","v":2.5},{"$f":"HLOOKUP(Yrke,Levelbonus!$B$1:$CR$20,2,FALSE)","v":3},{"$f":"AF38*Level","v":9},{"$f":"IF(ISNUMBER(VLOOKUP($A38,Rasbonus!$A$61:$AJ$295,MATCH(Ras,Rasbonus!$A$1:$AJ$1,0),FALSE)),VLOOKUP($A38,Rasbonus!$A$61:$AJ$295,MATCH(Ras,Rasbonus!$A$1:$AJ$1,0),FALSE),\"0\")","v":"0"},null,null,-14,0,0,0,0,0,0,0,0,0,0,0,0,0,0,0,0,0,0,0,0,0]
["Animal",{"$f":"HLOOKUP(Diverse!$G$2,'2nd'!$B$1:$CR$18,3,FALSE)","v":0},null,null,null,{"$f":"SUM(AL40:AL45)","v":0},null,null,{"$f":"SUM(AM40:AM45)","v":0},{"$f":"SUM(AN40:AN45)","v":0},0,0,0,0,0,0,0,0,0,0,0,0,0,0,0,0,0,0,"Rank","Skill","Stat",null,"Lvl","Race","Armor","Item","Total"]
["Animal handling",{"$f":"VLOOKUP(A40,AllaSkills!$A$3:$BV$317,'Ny NPC'!$A$2+3,FALSE)","v":"2/5"},{"$f":"IF(LEN(B40)=3,LEFT(B40,1),IF(LEN(B40)<3,B40,99))","v":"2"},"5","Animal",null,null,null,null,null,null,null,null,null,null,null,null,null,null,null,null,null,null,null,null,null,null,null,0,-25,{"$f":"(EM+PR+AP)/3","v":1.6666666666666667},{"$f":"HLOOKUP(Yrke,Levelbonus!$B$1:$CR$20,3,FALSE)","v":0},0,{"$f":"IF(ISNUMBER(VLOOKUP($A40,Rasbonus!$A$61:$AJ$295,MATCH(Ras,Rasbonus!$A$1:$AJ$1,0),FALSE)),VLOOKUP($A40,Rasbonus!$A$61:$AJ$295,MATCH(Ras,Rasbonus!$A$1:$AJ$1,0),FALSE),\"0\")","v":"0"},null,null,-23,0,{"$f":"IF(I40>2,\"99\",IF(I40<1,0,IF(I40=1,$C40+$C40-$C40,IF(I40=2,$C40+$D40))))","v":0},0,0,0,0,0,0,0,0,0,0,0,0,0,0,0,0,0,0,0]
["Animal training",{"$f":"VLOOKUP(A41,AllaSkills!$A$3:$BV$317,'Ny NPC'!$A$2+3,FALSE)","v":"4"},"4","4","Animal",null,null,null,null,null,null,null,null,null,null,null,null,null,null,null,null,null,null,null,null,null,null,null,0,-25,{"$f":"(EM+PR+AP)/3","v":1.6666666666666667},{"$f":"HLOOKUP(Yrke,Levelbonus!$B$1:$CR$20,3,FALSE)","v":0},0,{"$f":"IF(ISNUMBER(VLOOKUP($A41,Rasbonus!$A$61:$AJ$295,MATCH(Ras,Rasbonus!$A$1:$AJ$1,0),FALSE)),VLOOKUP($A41,Rasbonus!$A$61:$AJ$295,MATCH(Ras,Rasbonus!$A$1:$AJ$1,0),FALSE),\"0\")","v":"0"},null,null,-23,0,{"$f":"IF(I41>2,\"99\",IF(I41<1,0,IF(I41=1,$C41+$C41-$C41,IF(I41=2,$C41+$D41))))","v":0},0,0,0,0,0,0,0,0,0,{"$f":"IF(S41>2,\"99\",IF(S41<1,0,IF(S41=1,$C41+$C41-$C41,IF(S41=2,$C41+$D41))))","v":0},0,0,0,0,0,0,0,0,0]
["Beast Master",{"$f":"VLOOKUP(A42,AllaSkills!$A$3:$BV$317,'Ny NPC'!$A$2+3,FALSE)","v":"5"},"5","5","Animal",null,null,null,null,null,null,null,null,null,null,null,null,null,null,null,null,null,null,null,null,null,null,null,0,-25,{"$f":"(EM+PR)/2","v":0},{"$f":"HLOOKUP(Yrke,Levelbonus!$B$1:$CR$20,3,FALSE)","v":0},0,{"$f":"IF(ISNUMBER(VLOOKUP($A42,Rasbonus!$A$61:$AJ$295,MATCH(Ras,Rasbonus!$A$1:$AJ$1,0),FALSE)),VLOOKUP($A42,Rasbonus!$A$61:$AJ$295,MATCH(Ras,Rasbonus!$A$1:$AJ$1,0),FALSE),\"0\")","v":"0"},null,null,-25,0,0,0,0,0,0,0,0,0,0,0,0,0,0,0,0,0,0,0,0,0]
["Driving",{"$f":"VLOOKUP(A43,AllaSkills!$A$3:$BV$317,'Ny NPC'!$A$2+3,FALSE)","v":"3"},"3","3","Animal",null,null,null,null,null,null,null,null,null,null,null,null,null,null,null,null,null,null,null,null,null,null,null,0,-25,{"$f":"(AG+QU)/2","v":0},{"$f":"HLOOKUP(Yrke,Levelbonus!$B$1:$CR$20,3,FALSE)","v":0},0,{"$f":"IF(ISNUMBER(VLOOKUP($A43,Rasbonus!$A$61:$AJ$295,MATCH(Ras,Rasbonus!$A$1:$AJ$1,0),FALSE)),VLOOKUP($A43,Rasbonus!$A$61:$AJ$295,MATCH(Ras,Rasbonus!$A$1:$AJ$1,0),FALSE),\"0\")","v":"0"},null,null,-25,0,0,0,0,0,0,0,0,0,0,0,0,0,0,0,0,0,0,0,0,0]
["Herding",{"$f":"VLOOKUP(A44,AllaSkills!$A$3:$BV$317,'Ny NPC'!$A$2+3,FALSE)","v":"2/6"},"2","6","Animal",null,null,null,null,null,null,null,null,null,null,null,null,null,null,null,null,null,null,null,null,null,null,null,0,-25,{"$f":"(EM+PR)/2","v":0},{"$f":"HLOOKUP(Yrke,Levelbonus!$B$1:$CR$20,3,FALSE)","v":0},0,{"$f":"IF(ISNUMBER(VLOOKUP($A44,Rasbonus!$A$61:$AJ$295,MATCH(Ras,Rasbonus!$A$1:$AJ$1,0),FALSE)),VLOOKUP($A44,Rasbonus!$A$61:$AJ$295,MATCH(Ras,Rasbonus!$A$1:$AJ$1,0),FALSE),\"0\")","v":"0"},null,null,-25,0,0,0,0,0,0,0,0,0,0,0,0,0,0,0,0,0,0,0,0,0]
["Loading",{"$f":"VLOOKUP(A45,AllaSkills!$A$3:$BV$317,'Ny NPC'!$A$2+3,FALSE)","v":"3"},"3","3","Animal",null,null,null,null,null,null,null,null,null,null,null,null,null,null,null,null,null,null,null,null,null,null,null,0,-25,{"$f":"(EM+RE)/2","v":2.5},{"$f":"HLOOKUP(Yrke,Levelbonus!$B$1:$CR$20,3,FALSE)","v":0},0,{"$f":"IF(ISNUMBER(VLOOKUP($A45,Rasbonus!$A$61:$AJ$295,MATCH(Ras,Rasbonus!$A$1:$AJ$1,0),FALSE)),VLOOKUP($A45,Rasbonus!$A$61:$AJ$295,MATCH(Ras,Rasbonus!$A$1:$AJ$1,0),FALSE),\"0\")","v":"0"},null,null,-23,0,0,0,0,0,0,0,0,0,0,0,0,0,0,0,0,0,0,0,0,0]
["Athletic",{"$f":"HLOOKUP(Diverse!$G$2,'2nd'!$B$1:$CR$18,4,FALSE)","v":0},null,null,null,{"$f":"SUM(AL47:AL59)","v":0},null,null,{"$f":"SUM(AM47:AM59)","v":0},{"$f":"SUM(AN47:AN59)","v":0},0,0,0,0,0,0,0,0,0,0,0,0,0,0,0,0,0,0,"Rank","Skill","Stat",null,"Lvl","Race","Armor","Item","Total"]
["Athletic Games",{"$f":"VLOOKUP(A47,AllaSkills!$A$3:$BV$317,'Ny NPC'!$A$2+3,FALSE)","v":"7"},{"$f":"IF(LEN(B47)=3,LEFT(B47,1),IF(LEN(B47)<3,B47,99))","v":"7"},"7","Athletic",null,null,null,null,null,null,null,null,null,null,null,null,null,null,null,null,null,null,null,null,null,null,null,0,-25,{"$f":"(ST+AG+QU)/3","v":5},{"$f":"HLOOKUP(Yrke,Levelbonus!$B$1:$CR$20,4,FALSE)","v":0},0,{"$f":"IF(ISNUMBER(VLOOKUP($A47,Rasbonus!$A$61:$AJ$295,MATCH(Ras,Rasbonus!$A$1:$AJ$1,0),FALSE)),VLOOKUP($A47,Rasbonus!$A$61:$AJ$295,MATCH(Ras,Rasbonus!$A$1:$AJ$1,0),FALSE),\"0\")","v":"0"},{"$f":"'Ny NPC'!$N$3","v":"0"},null,-20,0,{"$f":"IF(I47>2,\"99\",IF(I47<1,0,IF(I47=1,$C47+$C47-$C47,IF(I47=2,$C47+$D47))))","v":0},{"$f":"IF(J47>2,\"99\",IF(J47<1,0,IF(J47=1,$C47+$C47-$C47,IF(J47=2,$C47+$D47))))","v":0},0,0,0,0,0,0,0,0,0,0,0,0,0,0,0,0,0,0]
["Dancing",{"$f":"VLOOKUP(A48,AllaSkills!$A$3:$BV$317,'Ny NPC'!$A$2+3,FALSE)","v":"2/6"},"2","6","Athletic",null,null,null,null,null,null,null,null,null,null,null,null,null,null,null,null,null,null,null,null,null,null,null,0,-25,{"$f":"(AG+IN)/2","v":2.5},{"$f":"HLOOKUP(Yrke,Levelbonus!$B$1:$CR$20,4,FALSE)","v":0},0,{"$f":"IF(ISNUMBER(VLOOKUP($A48,Rasbonus!$A$61:$AJ$295,MATCH(Ras,Rasbonus!$A$1:$AJ$1,0),FALSE)),VLOOKUP($A48,Rasbonus!$A$61:$AJ$295,MATCH(Ras,Rasbonus!$A$1:$AJ$1,0),FALSE),\"0\")","v":"0"},{"$f":"'Ny NPC'!$N$3","v":"0"},null,-23,0,{"$f":"IF(I48>2,\"99\",IF(I48<1,0,IF(I48=1,$C48+$C48-$C48,IF(I48=2,$C48+$D48))))","v":0},{"$f":"IF(J48>2,\"99\",IF(J48<1,0,IF(J48=1,$C48+$C48-$C48,IF(J48=2,$C48+$D48))))","v":0},{"$f":"IF(K48>2,\"99\",IF(K48<1,0,IF(K48=1,$C48+$C48-$C48,IF(K48=2,$C48+$D48))))","v":0},{"$f":"IF(L48>2,\"99\",IF(L48<1,0,IF(L48=1,$C48+$C48-$C48,IF(L48=2,$C48+$D48))))","v":0},{"$f":"IF(M48>2,\"99\",IF(M48<1,0,IF(M48=1,$C48+$C48-$C48,IF(M48=2,$C48+$D48))))","v":0},{"$f":"IF(N48>2,\"99\",IF(N48<1,0,IF(N48=1,$C48+$C48-$C48,IF(N48=2,$C48+$D48))))","v":0},{"$f":"IF(O48>2,\"99\",IF(O48<1,0,IF(O48=1,$C48+$C48-$C48,IF(O48=2,$C48+$D48))))","v":0},{"$f":"IF(P48>2,\"99\",IF(P48<1,0,IF(P48=1,$C48+$C48-$C48,IF(P48=2,$C48+$D48))))","v":0},{"$f":"IF(Q48>2,\"99\",IF(Q48<1,0,IF(Q48=1,$C48+$C48-$C48,IF(Q48=2,$C48+$D48))))","v":0},{"$f":"IF(R48>2,\"99\",IF(R48<1,0,IF(R48=1,$C48+$C48-$C48,IF(R48=2,$C48+$D48))))","v":0},{"$f":"IF(S48>2,\"99\",IF(S48<1,0,IF(S48=1,$C48+$C48-$C48,IF(S48=2,$C48+$D48))))","v":0},{"$f":"IF(T48>2,\"99\",IF(T48<1,0,IF(T48=1,$C48+$C48-$C48,IF(T48=2,$C48+$D48))))","v":0},{"$f":"IF(U48>2,\"99\",IF(U48<1,0,IF(U48=1,$C48+$C48-$C48,IF(U48=2,$C48+$D48))))","v":0},{"$f":"IF(V48>2,\"99\",IF(V48<1,0,IF(V48=1,$C48+$C48-$C48,IF(V48=2,$C48+$D48))))","v":0},{"$f":"IF(W48>2,\"99\",IF(W48<1,0,IF(W48=1,$C48+$C48-$C48,IF(W48=2,$C48+$D48))))","v":0},{"$f":"IF(X48>2,\"99\",IF(X48<1,0,IF(X48=1,$C48+$C48-$C48,IF(X48=2,$C48+$D48))))","v":0},{"$f":"IF(Y48>2,\"99\",IF(Y48<1,0,IF(Y48=1,$C48+$C48-$C48,IF(Y48=2,$C48+$D48))))","v":0},{"$f":"IF(Z48>2,\"99\",IF(Z48<1,0,IF(Z48=1,$C48+$C48-$C48,IF(Z48=2,$C48+$D48))))","v":0},{"$f":"IF(AA48>2,\"99\",IF(AA48<1,0,IF(AA48=1,$C48+$C48-$C48,IF(AA48=2,$C48+$D48))))","v":0},{"$f":"IF(AB48>2,\"99\",IF(AB48<1,0,IF(AB48=1,$C48+$C48-$C48,IF(AB48=2,$C48+$D48))))","v":0}]
["Distance Running",{"$f":"VLOOKUP(A49,AllaSkills!$A$3:$BV$317,'Ny NPC'!$A$2+3,FALSE)","v":"3"},"3","3","Athletic",null,null,null,null,null,null,null,null,null,null,null,null,null,null,null,null,null,null,null,null,null,null,null,0,-25,{"$f":"CO","v":20},{"$f":"HLOOKUP(Yrke,Levelbonus!$B$1:$CR$20,4,FALSE)","v":0},0,{"$f":"IF(ISNUMBER(VLOOKUP($A49,Rasbonus!$A$61:$AJ$295,MATCH(Ras,Rasbonus!$A$1:$AJ$1,0),FALSE)),VLOOKUP($A49,Rasbonus!$A$61:$AJ$295,MATCH(Ras,Rasbonus!$A$1:$AJ$1,0),FALSE),\"0\")","v":"0"},{"$f":"'Ny NPC'!$N$3","v":"0"},null,-5,0,0,0,0,0,0,0,0,0,0,0,0,0,0,0,0,0,0,0,0,0]
["Diving",{"$f":"VLOOKUP(A50,AllaSkills!$A$3:$BV$317,'Ny NPC'!$A$2+3,FALSE)","v":"3"},"3","3","Athletic",null,null,null,null,null,null,null,null,null,null,null,null,null,null,null,null,null,null,null,null,null,null,null,0,-25,{"$f":"(SD+AG)/2","v":5},{"$f":"HLOOKUP(Yrke,Levelbonus!$B$1:$CR$20,4,FALSE)","v":0},0,{"$f":"IF(ISNUMBER(VLOOKUP($A50,Rasbonus!$A$61:$AJ$295,MATCH(Ras,Rasbonus!$A$1:$AJ$1,0),FALSE)),VLOOKUP($A50,Rasbonus!$A$61:$AJ$295,MATCH(Ras,Rasbonus!$A$1:$AJ$1,0),FALSE),\"0\")","v":"0"},{"$f":"'Ny NPC'!$N$3","v":"0"},null,-20,0,0,0,0,0,0,0,0,0,0,0,0,0,0,0,0,0,0,0,0,0]
["Flying/Gliding",{"$f":"VLOOKUP(A51,AllaSkills!$A$3:$BV$317,'Ny NPC'!$A$2+3,FALSE)","v":"3"},"3","3","Athletic",null,null,null,null,null,null,null,null,null,null,null,null,null,null,null,null,null,null,null,null,null,null,null,0,-25,{"$f":"AG","v":0},{"$f":"HLOOKUP(Yrke,Levelbonus!$B$1:$CR$20,4,FALSE)","v":0},0,{"$f":"IF(ISNUMBER(VLOOKUP($A51,Rasbonus!$A$61:$AJ$295,MATCH(Ras,Rasbonus!$A$1:$AJ$1,0),FALSE)),VLOOKUP($A51,Rasbonus!$A$61:$AJ$295,MATCH(Ras,Rasbonus!$A$1:$AJ$1,0),FALSE),\"0\")","v":"0"},{"$f":"'Ny NPC'!$N$3","v":"0"},null,-25,0,0,0,0,0,0,0,0,0,0,0,0,0,0,0,0,0,0,0,0,0]
["Holding Breath",{"$f":"VLOOKUP(A52,AllaSkills!$A$3:$BV$317,'Ny NPC'!$A$2+3,FALSE)","v":"6"},"6","6","Athletic",null,null,null,null,null,null,null,null,null,null,null,null,null,null,null,null,null,null,null,null,null,null,null,0,-25,{"$f":"(CO+SD)/2","v":15},{"$f":"HLOOKUP(Yrke,Levelbonus!$B$1:$CR$20,4,FALSE)","v":0},0,{"$f":"IF(ISNUMBER(VLOOKUP($A52,Rasbonus!$A$61:$AJ$295,MATCH(Ras,Rasbonus!$A$1:$AJ$1,0),FALSE)),VLOOKUP($A52,Rasbonus!$A$61:$AJ$295,MATCH(Ras,Rasbonus!$A$1:$AJ$1,0),FALSE),\"0\")","v":"0"},null,null,-10,0,0,0,0,0,0,0,0,0,0,0,0,0,0,0,0,0,0,0,0,0]
["Portaging",{"$f":"VLOOKUP(A53,AllaSkills!$A$3:$BV$317,'Ny NPC'!$A$2+3,FALSE)","v":"2/4"},"2","4","Athletic",null,null,null,null,null,null,null,null,null,null,null,null,null,null,null,null,null,null,null,null,null,null,null,0,-25,null,{"$f":"HLOOKUP(Yrke,Levelbonus!$B$1:$CR$20,4,FALSE)","v":0},0,{"$f":"IF(ISNUMBER(VLOOKUP($A53,Rasbonus!$A$61:$AJ$295,MATCH(Ras,Rasbonus!$A$1:$AJ$1,0),FALSE)),VLOOKUP($A53,Rasbonus!$A$61:$AJ$295,MATCH(Ras,Rasbonus!$A$1:$AJ$1,0),FALSE),\"0\")","v":10},{"$f":"'Ny NPC'!$N$3","v":"0"},null,-15,0,0,0,0,0,0,0,0,0,0,0,0,0,0,0,0,0,0,0,0,0]
["Rappelling",{"$f":"VLOOKUP(A54,AllaSkills!$A$3:$BV$317,'Ny NPC'!$A$2+3,FALSE)","v":"7"},"7","7","Athletic",null,null,null,null,null,null,null,null,null,null,null,null,null,null,null,null,null,null,null,null,null,null,null,0,-25,{"$f":"AG","v":0},{"$f":"HLOOKUP(Yrke,Levelbonus!$B$1:$CR$20,4,FALSE)","v":0},0,{"$f":"IF(ISNUMBER(VLOOKUP($A54,Rasbonus!$A$61:$AJ$295,MATCH(Ras,Rasbonus!$A$1:$AJ$1,0),FALSE)),VLOOKUP($A54,Rasbonus!$A$61:$AJ$295,MATCH(Ras,Rasbonus!$A$1:$AJ$1,0),FALSE),\"0\")","v":"0"},{"$f":"'Ny NPC'!$N$3","v":"0"},null,-25,0,0,0,0,0,0,0,0,0,0,0,0,0,0,0,0,0,0,0,0,0]
["Rowing",{"$f":"VLOOKUP(A55,AllaSkills!$A$3:$BV$317,'Ny NPC'!$A$2+3,FALSE)","v":"3"},"3","3","Athletic",null,null,null,null,null,null,null,null,null,null,null,null,null,null,null,null,null,null,null,null,null,null,null,0,-25,{"$f":"(ST+SD)/2","v":12.5},{"$f":"HLOOKUP(Yrke,Levelbonus!$B$1:$CR$20,4,FALSE)","v":0},0,{"$f":"IF(ISNUMBER(VLOOKUP($A55,Rasbonus!$A$61:$AJ$295,MATCH(Ras,Rasbonus!$A$1:$AJ$1,0),FALSE)),VLOOKUP($A55,Rasbonus!$A$61:$AJ$295,MATCH(Ras,Rasbonus!$A$1:$AJ$1,0),FALSE),\"0\")","v":"0"},{"$f":"'Ny NPC'!$N$3","v":"0"},null,-13,0,0,0,0,0,0,0,0,0,0,0,0,0,0,0,0,0,0,0,0,0]
["Sailing",{"$f":"VLOOKUP(A56,AllaSkills!$A$3:$BV$317,'Ny NPC'!$A$2+3,FALSE)","v":"3"},"3","3","Athletic",null,null,null,null,null,null,null,null,null,null,null,null,null,null,null,null,null,null,null,null,null,null,null,0,-25,{"$f":"(EM+IN)/2","v":2.5},{"$f":"HLOOKUP(Yrke,Levelbonus!$B$1:$CR$20,4,FALSE)","v":0},0,{"$f":"IF(ISNUMBER(VLOOKUP($A56,Rasbonus!$A$61:$AJ$295,MATCH(Ras,Rasbonus!$A$1:$AJ$1,0),FALSE)),VLOOKUP($A56,Rasbonus!$A$61:$AJ$295,MATCH(Ras,Rasbonus!$A$1:$AJ$1,0),FALSE),\"0\")","v":"0"},{"$f":"'Ny NPC'!$N$3","v":"0"},null,-23,0,0,0,0,0,0,0,0,0,0,0,0,0,0,0,0,0,0,0,0,0]
["Skating",{"$f":"VLOOKUP(A57,AllaSkills!$A$3:$BV$317,'Ny NPC'!$A$2+3,FALSE)","v":"3"},"3","3","Athletic",null,null,null,null,null,null,null,null,null,null,null,null,null,null,null,null,null,null,null,null,null,null,null,0,-25,{"$f":"(AG+SD)/2","v":5},{"$f":"HLOOKUP(Yrke,Levelbonus!$B$1:$CR$20,4,FALSE)","v":0},0,{"$f":"IF(ISNUMBER(VLOOKUP($A57,Rasbonus!$A$61:$AJ$295,MATCH(Ras,Rasbonus!$A$1:$AJ$1,0),FALSE)),VLOOKUP($A57,Rasbonus!$A$61:$AJ$295,MATCH(Ras,Rasbonus!$A$1:$AJ$1,0),FALSE),\"0\")","v":"0"},{"$f":"'Ny NPC'!$N$3","v":"0"},null,-20,0,0,0,0,0,0,0,0,0,0,0,0,0,0,0,0,0,0,0,0,0]
["Skiing",{"$f":"VLOOKUP(A58,AllaSkills!$A$3:$BV$317,'Ny NPC'!$A$2+3,FALSE)","v":"3"},"3","3","Athletic",null,null,null,null,null,null,null,null,null,null,null,null,null,null,null,null,null,null,null,null,null,null,null,0,-25,{"$f":"(AG+SD)/2","v":5},{"$f":"HLOOKUP(Yrke,Levelbonus!$B$1:$CR$20,4,FALSE)","v":0},0,{"$f":"IF(ISNUMBER(VLOOKUP($A58,Rasbonus!$A$61:$AJ$295,MATCH(Ras,Rasbonus!$A$1:$AJ$1,0),FALSE)),VLOOKUP($A58,Rasbonus!$A$61:$AJ$295,MATCH(Ras,Rasbonus!$A$1:$AJ$1,0),FALSE),\"0\")","v":"0"},{"$f":"'Ny NPC'!$N$3","v":"0"},null,-20,0,0,0,0,0,0,0,0,0,0,0,0,0,0,0,0,0,0,0,0,0]
["Sprinting",{"$f":"VLOOKUP(A59,AllaSkills!$A$3:$BV$317,'Ny NPC'!$A$2+3,FALSE)","v":"3"},"3","3","Athletic",null,null,null,null,null,null,null,null,null,null,null,null,null,null,null,null,null,null,null,null,null,null,null,0,-25,{"$f":"QU","v":0},{"$f":"HLOOKUP(Yrke,Levelbonus!$B$1:$CR$20,4,FALSE)","v":0},0,{"$f":"IF(ISNUMBER(VLOOKUP($A59,Rasbonus!$A$61:$AJ$295,MATCH(Ras,Rasbonus!$A$1:$AJ$1,0),FALSE)),VLOOKUP($A59,Rasbonus!$A$61:$AJ$295,MATCH(Ras,Rasbonus!$A$1:$AJ$1,0),FALSE),\"0\")","v":"0"},{"$f":"'Ny NPC'!$N$3","v":"0"},null,-25,0,0,0,0,0,0,0,0,0,0,0,0,0,0,0,0,0,0,0,0,0]
["Combat",{"$f":"HLOOKUP(Diverse!$G$2,'2nd'!$B$1:$CR$18,5,FALSE)","v":0},null,null,null,{"$f":"SUM(AL61:AL88)","v":0},null,null,{"$f":"SUM(AM61:AM88)","v":0},{"$f":"SUM(AN61:AN88)","v":0},0,0,0,0,0,0,0,0,0,0,0,0,0,0,0,0,0,0,"Rank","Skill","Stat",null,"Lvl","Race","Armor","Item","Total"]
["Brawling",{"$f":"VLOOKUP(A61,AllaSkills!$A$3:$BV$317,'Ny NPC'!$A$2+3,FALSE)","v":"18"},{"$f":"IF(LEN(B61)=3,LEFT(B61,1),IF(LEN(B61)<3,B61,99))","v":"18"},"18","Combat",null,null,null,null,null,null,null,null,null,null,null,null,null,null,null,null,null,null,null,null,null,null,null,0,-25,{"$f":"(ST+AG+EQ)/3","v":6.666666666666667},{"$f":"HLOOKUP(Yrke,Levelbonus!$B$1:$CR$20,5,FALSE)","v":0},0,{"$f":"IF(ISNUMBER(VLOOKUP($A61,Rasbonus!$A$61:$AJ$295,MATCH(Ras,Rasbonus!$A$1:$AJ$1,0),FALSE)),VLOOKUP($A61,Rasbonus!$A$61:$AJ$295,MATCH(Ras,Rasbonus!$A$1:$AJ$1,0),FALSE),\"0\")","v":20},null,null,2,0,{"$f":"IF(I61>2,\"99\",IF(I61<1,0,IF(I61=1,$C61+$C61-$C61,IF(I61=2,$C61+$D61))))","v":0},{"$f":"IF(J61>2,\"99\",IF(J61<1,0,IF(J61=1,$C61+$C61-$C61,IF(J61=2,$C61+$D61))))","v":0},0,0,0,0,0,0,0,0,0,0,0,0,0,0,0,0,0,0]
["Defensive Technique",{"$f":"VLOOKUP(A62,AllaSkills!$A$3:$BV$317,'Ny NPC'!$A$2+3,FALSE)","v":"20"},{"$f":"IF(LEN(B62)=3,LEFT(B62,1),IF(LEN(B62)<3,B62,99))","v":"20"},{"$f":"IF(RIGHT(B62,1)=\"*\",LEFT(B62,1),IF(LEN(B62)=3,RIGHT(B62,1),IF(LEN(B62)<3,B62,RIGHT(B62,2))))","v":"20"},"Combat",null,null,null,null,null,null,null,null,null,null,null,null,null,null,null,null,null,null,null,null,null,null,null,0,{"$f":"IF(AC62<1,-25,IF(AC62>30,60,IF(AC62>20,50+(AC62-20),IF(AC62>10,30+((AC62-10)*2),AC62*3))))","v":-25},null,{"$f":"HLOOKUP(Yrke,Levelbonus!$B$1:$CR$20,5,FALSE)","v":0},null,null,null,null,-25,0,0,{"$f":"IF(J62>2,\"99\",IF(J62<1,0,IF(J62=1,$C62+$C62-$C62,IF(J62=2,$C62+$D62))))","v":0},{"$f":"IF(K62>2,\"99\",IF(K62<1,0,IF(K62=1,$C62+$C62-$C62,IF(K62=2,$C62+$D62))))","v":0},{"$f":"IF(L62>2,\"99\",IF(L62<1,0,IF(L62=1,$C62+$C62-$C62,IF(L62=2,$C62+$D62))))","v":0},{"$f":"IF(M62>2,\"99\",IF(M62<1,0,IF(M62=1,$C62+$C62-$C62,IF(M62=2,$C62+$D62))))","v":0},{"$f":"IF(N62>2,\"99\",IF(N62<1,0,IF(N62=1,$C62+$C62-$C62,IF(N62=2,$C62+$D62))))","v":0},{"$f":"IF(O62>2,\"99\",IF(O62<1,0,IF(O62=1,$C62+$C62-$C62,IF(O62=2,$C62+$D62))))","v":0},{"$f":"IF(P62>2,\"99\",IF(P62<1,0,IF(P62=1,$C62+$C62-$C62,IF(P62=2,$C62+$D62))))","v":0},{"$f":"IF(Q62>2,\"99\",IF(Q62<1,0,IF(Q62=1,$C62+$C62-$C62,IF(Q62=2,$C62+$D62))))","v":0},{"$f":"IF(R62>2,\"99\",IF(R62<1,0,IF(R62=1,$C62+$C62-$C62,IF(R62=2,$C62+$D62))))","v":0},{"$f":"IF(S62>2,\"99\",IF(S62<1,0,IF(S62=1,$C62+$C62-$C62,IF(S62=2,$C62+$D62))))","v":0},{"$f":"IF(T62>2,\"99\",IF(T62<1,0,IF(T62=1,$C62+$C62-$C62,IF(T62=2,$C62+$D62))))","v":0},{"$f":"IF(U62>2,\"99\",IF(U62<1,0,IF(U62=1,$C62+$C62-$C62,IF(U62=2,$C62+$D62))))","v":0},{"$f":"IF(V62>2,\"99\",IF(V62<1,0,IF(V62=1,$C62+$C62-$C62,IF(V62=2,$C62+$D62))))","v":0},{"$f":"IF(W62>2,\"99\",IF(W62<1,0,IF(W62=1,$C62+$C62-$C62,IF(W62=2,$C62+$D62))))","v":0},{"$f":"IF(X62>2,\"99\",IF(X62<1,0,IF(X62=1,$C62+$C62-$C62,IF(X62=2,$C62+$D62))))","v":0},{"$f":"IF(Y62>2,\"99\",IF(Y62<1,0,IF(Y62=1,$C62+$C62-$C62,IF(Y62=2,$C62+$D62))))","v":0},{"$f":"IF(Z62>2,\"99\",IF(Z62<1,0,IF(Z62=1,$C62+$C62-$C62,IF(Z62=2,$C62+$D62))))","v":0},{"$f":"IF(AA62>2,\"99\",IF(AA62<1,0,IF(AA62=1,$C62+$C62-$C62,IF(AA62=2,$C62+$D62))))","v":0},{"$f":"IF(AB62>2,\"99\",IF(AB62<1,0,IF(AB62=1,$C62+$C62-$C62,IF(AB62=2,$C62+$D62))))","v":0}]
["Defensive Weaving",{"$f":"VLOOKUP(A63,AllaSkills!$A$3:$BV$317,'Ny NPC'!$A$2+3,FALSE)","v":"20"},{"$f":"IF(LEN(B63)=3,LEFT(B63,1),IF(LEN(B63)<3,B63,99))","v":"20"},{"$f":"IF(RIGHT(B63,1)=\"*\",LEFT(B63,1),IF(LEN(B63)=3,RIGHT(B63,1),IF(LEN(B63)<3,B63,RIGHT(B63,2))))","v":"20"},"Combat",null,null,null,null,null,null,null,null,null,null,null,null,null,null,null,null,null,null,null,null,null,null,null,0,{"$f":"IF(AC63<1,-25,IF(AC63>30,60,IF(AC63>20,50+(AC63-20),IF(AC63>10,30+((AC63-10)*2),AC63*3))))","v":-25},null,{"$f":"HLOOKUP(Yrke,Levelbonus!$B$1:$CR$20,5,FALSE)","v":0},null,null,null,null,-25,0,0,0,0,0,0,0,0,0,0,0,0,0,0,0,0,0,0,0,0,0]
["Disarm, Armed",{"$f":"VLOOKUP(A64,AllaSkills!$A$3:$BV$317,'Ny NPC'!$A$2+3,FALSE)","v":"6"},{"$f":"IF(LEN(B64)=3,LEFT(B64,1),IF(LEN(B64)<3,B64,99))","v":"6"},{"$f":"IF(RIGHT(B64,1)=\"*\",LEFT(B64,1),IF(LEN(B64)=3,RIGHT(B64,1),IF(LEN(B64)<3,B64,RIGHT(B64,2))))","v":"6"},"Combat",null,null,null,null,null,null,null,null,null,null,null,null,null,null,null,null,null,null,null,null,null,null,null,{"$f":"SUM(F64:AB64)","v":0},{"$f":"IF(AC64<1,-25,IF(AC64>30,80+((AC64-30)*0.5),IF(AC64>20,70+(AC64-20),IF(AC64>10,50+((AC64-10)*2),AC64*5))))","v":-25},{"$f":"(AG+EQ)/2","v":2.5},{"$f":"HLOOKUP(Yrke,Levelbonus!$B$1:$CR$20,5,FALSE)","v":0},{"$f":"AF64*Level","v":0},{"$f":"IF(ISNUMBER(VLOOKUP($A64,Rasbonus!$A$61:$AJ$295,MATCH(Ras,Rasbonus!$A$1:$AJ$1,0),FALSE)),VLOOKUP($A64,Rasbonus!$A$61:$AJ$295,MATCH(Ras,Rasbonus!$A$1:$AJ$1,0),FALSE),\"0\")","v":"0"},null,null,-23,0,0,0,0,0,0,0,0,0,0,0,0,0,0,0,0,0,0,0,0,0]
["Disarm, Unarmed",{"$f":"VLOOKUP(A65,AllaSkills!$A$3:$BV$317,'Ny NPC'!$A$2+3,FALSE)","v":"9"},"9","9","Combat",null,null,null,null,null,null,null,null,null,null,null,null,null,null,null,null,null,null,null,null,null,null,null,0,-25,{"$f":"(AG+EQ)/2","v":2.5},{"$f":"HLOOKUP(Yrke,Levelbonus!$B$1:$CR$20,5,FALSE)","v":0},0,{"$f":"IF(ISNUMBER(VLOOKUP($A65,Rasbonus!$A$61:$AJ$295,MATCH(Ras,Rasbonus!$A$1:$AJ$1,0),FALSE)),VLOOKUP($A65,Rasbonus!$A$61:$AJ$295,MATCH(Ras,Rasbonus!$A$1:$AJ$1,0),FALSE),\"0\")","v":"0"},null,null,-23,0,0,0,0,0,0,0,0,0,0,0,0,0,0,0,0,0,0,0,0,0]
["Donning/Doffing Chain",{"$f":"VLOOKUP(A66,AllaSkills!$A$3:$BV$317,'Ny NPC'!$A$2+3,FALSE)","v":10},10,10,"Combat",null,null,null,null,null,null,null,null,null,null,null,null,null,null,null,null,null,null,null,null,null,null,null,0,-25,{"$f":"(AG+QU)/2","v":0},{"$f":"HLOOKUP(Yrke,Levelbonus!$B$1:$CR$20,5,FALSE)","v":0},0,{"$f":"IF(ISNUMBER(VLOOKUP($A66,Rasbonus!$A$61:$AJ$295,MATCH(Ras,Rasbonus!$A$1:$AJ$1,0),FALSE)),VLOOKUP($A66,Rasbonus!$A$61:$AJ$295,MATCH(Ras,Rasbonus!$A$1:$AJ$1,0),FALSE),\"0\")","v":"0"},null,null,-25,0,0,0,0,0,0,0,0,0,0,0,0,0,0,0,0,0,0,0,0,0]
["Donning/Doffing Plate",{"$f":"VLOOKUP(A67,AllaSkills!$A$3:$BV$317,'Ny NPC'!$A$2+3,FALSE)","v":11},11,11,"Combat",null,null,null,null,null,null,null,null,null,null,null,null,null,null,null,null,null,null,null,null,null,null,null,0,-25,{"$f":"(AG+QU)/2","v":0},{"$f":"HLOOKUP(Yrke,Levelbonus!$B$1:$CR$20,5,FALSE)","v":0},0,{"$f":"IF(ISNUMBER(VLOOKUP($A67,Rasbonus!$A$61:$AJ$295,MATCH(Ras,Rasbonus!$A$1:$AJ$1,0),FALSE)),VLOOKUP($A67,Rasbonus!$A$61:$AJ$295,MATCH(Ras,Rasbonus!$A$1:$AJ$1,0),FALSE),\"0\")","v":"0"},null,null,-25,0,0,0,0,0,0,0,0,0,0,0,0,0,0,0,0,0,0,0,0,0]
["Donning/Doffing RL",{"$f":"VLOOKUP(A68,AllaSkills!$A$3:$BV$317,'Ny NPC'!$A$2+3,FALSE)","v":9},9,9,"Combat",null,null,null,null,null,null,null,null,null,null,null,null,null,null,null,null,null,null,null,null,null,null,null,0,-25,{"$f":"(AG+QU)/2","v":0},{"$f":"HLOOKUP(Yrke,Levelbonus!$B$1:$CR$20,5,FALSE)","v":0},0,{"$f":"IF(ISNUMBER(VLOOKUP($A68,Rasbonus!$A$61:$AJ$295,MATCH(Ras,Rasbonus!$A$1:$AJ$1,0),FALSE)),VLOOKUP($A68,Rasbonus!$A$61:$AJ$295,MATCH(Ras,Rasbonus!$A$1:$AJ$1,0),FALSE),\"0\")","v":"0"},null,null,{"$f":"ROUND(AD68+AE68+AG68+AH68+AI68+AJ68,0)","v":-25},{"$f":"IF(F68>2,\"99\",IF(F68<1,0,IF(F68=1,$C68+$C68-$C68,IF(F68=2,$C68+$D68))))","v":0},0,0,0,0,0,0,0,0,0,0,0,0,0,0,0,0,0,0,0,0]
["Donning/Doffing SL",{"$f":"VLOOKUP(A69,AllaSkills!$A$3:$BV$317,'Ny NPC'!$A$2+3,FALSE)","v":9},9,9,"Combat",null,null,null,null,null,null,null,null,null,null,null,null,null,null,null,null,null,null,null,null,null,null,null,0,-25,{"$f":"(AG+QU)/2","v":0},{"$f":"HLOOKUP(Yrke,Levelbonus!$B$1:$CR$20,5,FALSE)","v":0},0,{"$f":"IF(ISNUMBER(VLOOKUP($A69,Rasbonus!$A$61:$AJ$295,MATCH(Ras,Rasbonus!$A$1:$AJ$1,0),FALSE)),VLOOKUP($A69,Rasbonus!$A$61:$AJ$295,MATCH(Ras,Rasbonus!$A$1:$AJ$1,0),FALSE),\"0\")","v":"0"},null,null,-25,0,0,0,0,0,0,0,0,0,0,0,0,0,0,0,0,0,0,0,0,0]
["Expertise",{"$f":"VLOOKUP(A70,AllaSkills!$A$3:$BV$317,'Ny NPC'!$A$2+3,FALSE)","v":"20"},"20","20","Combat",null,null,null,null,null,null,null,null,null,null,null,null,null,null,null,null,null,null,null,null,null,null,null,0,null,null,{"$f":"HLOOKUP(Yrke,Levelbonus!$B$1:$CR$20,5,FALSE)","v":0},null,null,null,null,{"$f":"ROUND(AC70+AD70+AE70+AG70+AH70+AI70+AJ70,0)","v":0},0,0,0,0,0,0,0,0,0,0,0,0,0,0,0,0,0,0,0,0,0]
["Feinting",{"$f":"VLOOKUP(A71,AllaSkills!$A$3:$BV$317,'Ny NPC'!$A$2+3,FALSE)","v":"6"},"6","6","Combat",null,null,null,null,null,null,null,null,null,null,null,null,null,null,null,null,null,null,null,null,null,null,null,0,-25,{"$f":"(QU+PR)/2","v":0},{"$f":"HLOOKUP(Yrke,Levelbonus!$B$1:$CR$20,5,FALSE)","v":0},0,{"$f":"IF(ISNUMBER(VLOOKUP($A71,Rasbonus!$A$61:$AJ$295,MATCH(Ras,Rasbonus!$A$1:$AJ$1,0),FALSE)),VLOOKUP($A71,Rasbonus!$A$61:$AJ$295,MATCH(Ras,Rasbonus!$A$1:$AJ$1,0),FALSE),\"0\")","v":"0"},{"$f":"'Ny NPC'!$N$3","v":"0"},null,-25,0,0,0,0,0,0,0,0,0,0,0,0,0,0,0,0,0,0,0,0,0]
["Grappling Hook",{"$f":"VLOOKUP(A72,AllaSkills!$A$3:$BV$317,'Ny NPC'!$A$2+3,FALSE)","v":"3"},"3","3","Combat",null,null,null,null,null,null,null,null,null,null,null,null,null,null,null,null,null,null,null,null,null,null,null,0,-25,{"$f":"AG","v":0},{"$f":"HLOOKUP(Yrke,Levelbonus!$B$1:$CR$20,5,FALSE)","v":0},0,{"$f":"IF(ISNUMBER(VLOOKUP($A72,Rasbonus!$A$61:$AJ$295,MATCH(Ras,Rasbonus!$A$1:$AJ$1,0),FALSE)),VLOOKUP($A72,Rasbonus!$A$61:$AJ$295,MATCH(Ras,Rasbonus!$A$1:$AJ$1,0),FALSE),\"0\")","v":"0"},{"$f":"'Ny NPC'!$AB$62","v":0},null,-25,0,0,0,0,0,0,0,0,0,0,0,0,0,0,0,0,0,0,0,0,0]
["Honing",{"$f":"VLOOKUP(A73,AllaSkills!$A$3:$BV$317,'Ny NPC'!$A$2+3,FALSE)","v":"20"},"20","20","Combat",null,null,null,null,null,null,null,null,null,null,null,null,null,null,null,null,null,null,null,null,null,null,null,0,-25,{"$f":"(AG+EM)/2","v":0},{"$f":"HLOOKUP(Yrke,Levelbonus!$B$1:$CR$20,5,FALSE)","v":0},0,{"$f":"IF(ISNUMBER(VLOOKUP($A73,Rasbonus!$A$61:$AJ$295,MATCH(Ras,Rasbonus!$A$1:$AJ$1,0),FALSE)),VLOOKUP($A73,Rasbonus!$A$61:$AJ$295,MATCH(Ras,Rasbonus!$A$1:$AJ$1,0),FALSE),\"0\")","v":"0"},null,null,-25,0,0,0,0,0,0,0,0,0,0,0,0,0,0,0,0,0,0,0,0,0]
["Iai",{"$f":"VLOOKUP(A74,AllaSkills!$A$3:$BV$317,'Ny NPC'!$A$2+3,FALSE)","v":"15"},"15","15","Combat",null,null,null,null,null,null,null,null,null,null,null,null,null,null,null,null,null,null,null,null,null,null,null,0,-25,{"$f":"(QU+EQ)/2","v":2.5},{"$f":"HLOOKUP(Yrke,Levelbonus!$B$1:$CR$20,5,FALSE)","v":0},0,{"$f":"IF(ISNUMBER(VLOOKUP($A74,Rasbonus!$A$61:$AJ$295,MATCH(Ras,Rasbonus!$A$1:$AJ$1,0),FALSE)),VLOOKUP($A74,Rasbonus!$A$61:$AJ$295,MATCH(Ras,Rasbonus!$A$1:$AJ$1,0),FALSE),\"0\")","v":"0"},{"$f":"'Ny NPC'!$N$3","v":"0"},null,-23,0,0,0,0,0,0,0,0,0,0,0,0,0,0,0,0,0,0,0,0,0]
["Instinctive Maneuver",{"$f":"VLOOKUP(A75,AllaSkills!$A$3:$BV$317,'Ny NPC'!$A$2+3,FALSE)","v":"6"},"6","6","Combat",null,null,null,null,null,null,null,null,null,null,null,null,null,null,null,null,null,null,null,null,null,null,null,0,-25,{"$f":"(QU+EQ)/2","v":2.5},{"$f":"HLOOKUP(Yrke,Levelbonus!$B$1:$CR$20,5,FALSE)","v":0},0,{"$f":"IF(ISNUMBER(VLOOKUP($A75,Rasbonus!$A$61:$AJ$295,MATCH(Ras,Rasbonus!$A$1:$AJ$1,0),FALSE)),VLOOKUP($A75,Rasbonus!$A$61:$AJ$295,MATCH(Ras,Rasbonus!$A$1:$AJ$1,0),FALSE),\"0\")","v":"0"},null,null,-23,0,0,0,0,0,0,0,0,0,0,0,0,0,0,0,0,0,0,0,0,0]
["Lancing",{"$f":"VLOOKUP(A76,AllaSkills!$A$3:$BV$317,'Ny NPC'!$A$2+3,FALSE)","v":"18"},"18","18","Combat",null,null,null,null,null,null,null,null,null,null,null,null,null,null,null,null,null,null,null,null,null,null,null,0,-25,{"$f":"(ST+AG)/2","v":7.5},{"$f":"HLOOKUP(Yrke,Levelbonus!$B$1:$CR$20,5,FALSE)","v":0},0,{"$f":"IF(ISNUMBER(VLOOKUP($A76,Rasbonus!$A$61:$AJ$295,MATCH(Ras,Rasbonus!$A$1:$AJ$1,0),FALSE)),VLOOKUP($A76,Rasbonus!$A$61:$AJ$295,MATCH(Ras,Rasbonus!$A$1:$AJ$1,0),FALSE),\"0\")","v":"0"},null,null,-18,0,0,0,0,0,0,0,0,0,0,0,0,0,0,0,0,0,0,0,0,0]
["Melee Scuffle",{"$f":"VLOOKUP(A77,AllaSkills!$A$3:$BV$317,'Ny NPC'!$A$2+3,FALSE)","v":"8"},"8","8","Combat",null,null,null,null,null,null,null,null,null,null,null,null,null,null,null,null,null,null,null,null,null,null,null,0,-25,{"$f":"(ST+AG)/2","v":7.5},{"$f":"HLOOKUP(Yrke,Levelbonus!$B$1:$CR$20,5,FALSE)","v":0},0,{"$f":"IF(ISNUMBER(VLOOKUP($A77,Rasbonus!$A$61:$AJ$295,MATCH(Ras,Rasbonus!$A$1:$AJ$1,0),FALSE)),VLOOKUP($A77,Rasbonus!$A$61:$AJ$295,MATCH(Ras,Rasbonus!$A$1:$AJ$1,0),FALSE),\"0\")","v":10},{"$f":"'Ny NPC'!$AB$63","v":0},null,-8,0,0,0,0,0,0,0,0,0,0,0,0,0,0,0,0,0,0,0,0,0]
["Missile Artillery",{"$f":"VLOOKUP(A78,AllaSkills!$A$3:$BV$317,'Ny NPC'!$A$2+3,FALSE)","v":"3/6"},"3","6","Combat",null,null,null,null,null,null,null,null,null,null,null,null,null,null,null,null,null,null,null,null,null,null,null,0,-25,{"$f":"(IN+AG)/2","v":2.5},{"$f":"HLOOKUP(Yrke,Levelbonus!$B$1:$CR$20,5,FALSE)","v":0},0,{"$f":"IF(ISNUMBER(VLOOKUP($A78,Rasbonus!$A$61:$AJ$295,MATCH(Ras,Rasbonus!$A$1:$AJ$1,0),FALSE)),VLOOKUP($A78,Rasbonus!$A$61:$AJ$295,MATCH(Ras,Rasbonus!$A$1:$AJ$1,0),FALSE),\"0\")","v":"0"},null,null,-23,0,0,0,0,0,0,0,0,0,0,0,0,0,0,0,0,0,0,0,0,0]
["SeaBorn Combat",{"$f":"VLOOKUP(A79,AllaSkills!$A$3:$BV$317,'Ny NPC'!$A$2+3,FALSE)","v":"3"},"3","3","Combat",null,null,null,null,null,null,null,null,null,null,null,null,null,null,null,null,null,null,null,null,null,null,null,0,-25,{"$f":"(AG+AG+EQ)/3","v":1.6666666666666667},{"$f":"HLOOKUP(Yrke,Levelbonus!$B$1:$CR$20,5,FALSE)","v":0},0,{"$f":"IF(ISNUMBER(VLOOKUP($A79,Rasbonus!$A$61:$AJ$295,MATCH(Ras,Rasbonus!$A$1:$AJ$1,0),FALSE)),VLOOKUP($A79,Rasbonus!$A$61:$AJ$295,MATCH(Ras,Rasbonus!$A$1:$AJ$1,0),FALSE),\"0\")","v":"0"},{"$f":"'Ny NPC'!$N$3","v":"0"},null,-23,0,0,0,0,0,0,0,0,0,0,0,0,0,0,0,0,0,0,0,0,0]
["Shield Bash",{"$f":"VLOOKUP(A80,AllaSkills!$A$3:$BV$317,'Ny NPC'!$A$2+3,FALSE)","v":"20"},"20","20","Combat",null,null,null,null,null,null,null,null,null,null,null,null,null,null,null,null,null,null,null,null,null,null,null,0,-25,{"$f":"(ST+ST+AG)/3","v":10},{"$f":"HLOOKUP(Yrke,Levelbonus!$B$1:$CR$20,5,FALSE)","v":0},0,{"$f":"IF(ISNUMBER(VLOOKUP($A80,Rasbonus!$A$61:$AJ$295,MATCH(Ras,Rasbonus!$A$1:$AJ$1,0),FALSE)),VLOOKUP($A80,Rasbonus!$A$61:$AJ$295,MATCH(Ras,Rasbonus!$A$1:$AJ$1,0),FALSE),\"0\")","v":"0"},null,null,-15,0,0,0,0,0,0,0,0,0,0,0,0,0,0,0,0,0,0,0,0,0]
["Shield Expertise",{"$f":"VLOOKUP(A81,AllaSkills!$A$3:$BV$317,'Ny NPC'!$A$2+3,FALSE)","v":"20"},"20",{"$f":"IF(RIGHT(B81,1)=\"*\",LEFT(B81,1),IF(LEN(B81)=3,RIGHT(B81,1),IF(LEN(B81)<3,B81,RIGHT(B81,2))))","v":"20"},"Combat",null,null,null,null,null,null,null,null,null,null,null,null,null,null,null,null,null,null,null,null,null,null,null,{"$f":"SUM(F81:AB81)","v":0},null,null,{"$f":"HLOOKUP(Yrke,Levelbonus!$B$1:$CR$20,5,FALSE)","v":0},null,null,null,null,{"$f":"ROUND(AC81+AD81+AE81+AG81+AH81+AI81+AJ81,0)","v":0},0,{"$f":"IF(I81>2,\"99\",IF(I81<1,0,IF(I81=1,$C81+$C81-$C81,IF(I81=2,$C81+$D81))))","v":0},0,0,0,0,0,0,0,0,0,0,0,0,0,0,0,0,0,0,0]
["Stunned Maneuver",{"$f":"VLOOKUP(A82,AllaSkills!$A$3:$BV$317,'Ny NPC'!$A$2+3,FALSE)","v":"4"},"4","4","Combat",null,null,null,null,null,null,null,null,null,null,null,null,null,null,null,null,null,null,null,null,null,null,null,0,-25,{"$f":"SD","v":10},{"$f":"HLOOKUP(Yrke,Levelbonus!$B$1:$CR$20,5,FALSE)","v":0},0,{"$f":"IF(ISNUMBER(VLOOKUP($A82,Rasbonus!$A$61:$AJ$295,MATCH(Ras,Rasbonus!$A$1:$AJ$1,0),FALSE)),VLOOKUP($A82,Rasbonus!$A$61:$AJ$295,MATCH(Ras,Rasbonus!$A$1:$AJ$1,0),FALSE),\"0\")","v":"0"},null,null,-15,0,{"$f":"IF(I82>2,\"99\",IF(I82<1,0,IF(I82=1,$C82+$C82-$C82,IF(I82=2,$C82+$D82))))","v":0},0,0,0,0,0,0,0,0,0,0,0,0,0,0,0,0,0,0,0]
["Subduing",{"$f":"VLOOKUP(A83,AllaSkills!$A$3:$BV$317,'Ny NPC'!$A$2+3,FALSE)","v":"6"},"6","6","Combat",null,null,null,null,null,null,null,null,null,null,null,null,null,null,null,null,null,null,null,null,null,null,null,0,-25,{"$f":"(AG+QU)/2","v":0},{"$f":"HLOOKUP(Yrke,Levelbonus!$B$1:$CR$20,5,FALSE)","v":0},0,{"$f":"IF(ISNUMBER(VLOOKUP($A83,Rasbonus!$A$61:$AJ$295,MATCH(Ras,Rasbonus!$A$1:$AJ$1,0),FALSE)),VLOOKUP($A83,Rasbonus!$A$61:$AJ$295,MATCH(Ras,Rasbonus!$A$1:$AJ$1,0),FALSE),\"0\")","v":"0"},null,null,-25,0,0,0,0,0,0,0,0,0,0,0,0,0,0,0,0,0,0,0,0,0]
["Tackling",{"$f":"VLOOKUP(A84,AllaSkills!$A$3:$BV$317,'Ny NPC'!$A$2+3,FALSE)","v":"9"},"9","9","Combat",null,null,null,null,null,null,null,null,null,null,null,null,null,null,null,null,null,null,null,null,null,null,null,0,-25,{"$f":"(ST+AG)/2","v":7.5},{"$f":"HLOOKUP(Yrke,Levelbonus!$B$1:$CR$20,5,FALSE)","v":0},0,{"$f":"IF(ISNUMBER(VLOOKUP($A84,Rasbonus!$A$61:$AJ$295,MATCH(Ras,Rasbonus!$A$1:$AJ$1,0),FALSE)),VLOOKUP($A84,Rasbonus!$A$61:$AJ$295,MATCH(Ras,Rasbonus!$A$1:$AJ$1,0),FALSE),\"0\")","v":10},{"$f":"'Ny NPC'!$AB$63","v":0},null,-8,0,0,0,0,0,0,0,0,0,0,0,0,0,0,0,0,0,0,0,0,0]
["Unarmed Expertise",{"$f":"VLOOKUP(A85,AllaSkills!$A$3:$BV$317,'Ny NPC'!$A$2+3,FALSE)","v":"9"},"9",{"$f":"IF(RIGHT(B85,1)=\"*\",LEFT(B85,1),IF(LEN(B85)=3,RIGHT(B85,1),IF(LEN(B85)<3,B85,RIGHT(B85,2))))","v":"9"},"Combat",null,null,null,null,null,null,null,null,null,null,null,null,null,null,null,null,null,null,null,null,null,null,null,{"$f":"SUM(F85:AB85)","v":0},-25,{"$f":"(ST+AG+EQ)/3","v":6.666666666666667},{"$f":"HLOOKUP(Yrke,Levelbonus!$B$1:$CR$20,5,FALSE)","v":0},0,{"$f":"IF(ISNUMBER(VLOOKUP($A85,Rasbonus!$A$61:$AJ$295,MATCH(Ras,Rasbonus!$A$1:$AJ$1,0),FALSE)),VLOOKUP($A85,Rasbonus!$A$61:$AJ$295,MATCH(Ras,Rasbonus!$A$1:$AJ$1,0),FALSE),\"0\")","v":"0"},{"$f":"'Ny NPC'!$N$3","v":"0"},null,-18,0,0,0,0,0,0,0,0,0,0,0,0,0,0,0,0,0,0,0,0,0]
["Weapon Brawling",{"$f":"VLOOKUP(A86,AllaSkills!$A$3:$BV$317,'Ny NPC'!$A$2+3,FALSE)","v":"9"},"9","9","Combat",null,null,null,null,null,null,null,null,null,null,null,null,null,null,null,null,null,null,null,null,null,null,null,0,-25,{"$f":"(ST+AG+QU)/3","v":5},{"$f":"HLOOKUP(Yrke,Levelbonus!$B$1:$CR$20,5,FALSE)","v":0},0,{"$f":"IF(ISNUMBER(VLOOKUP($A86,Rasbonus!$A$61:$AJ$295,MATCH(Ras,Rasbonus!$A$1:$AJ$1,0),FALSE)),VLOOKUP($A86,Rasbonus!$A$61:$AJ$295,MATCH(Ras,Rasbonus!$A$1:$AJ$1,0),FALSE),\"0\")","v":"0"},null,null,-20,0,0,0,0,0,0,0,0,0,0,0,0,0,0,0,0,0,0,0,0,0]
["Weapon Kata",{"$f":"VLOOKUP(A87,AllaSkills!$A$3:$BV$317,'Ny NPC'!$A$2+3,FALSE)","v":"9"},"9","9","Combat",null,null,null,null,null,null,null,null,null,null,null,null,null,null,null,null,null,null,null,null,null,null,null,0,-25,{"$f":"(ST+AG+EQ)/3","v":6.666666666666667},{"$f":"HLOOKUP(Yrke,Levelbonus!$B$1:$CR$20,5,FALSE)","v":0},0,{"$f":"IF(ISNUMBER(VLOOKUP($A87,Rasbonus!$A$61:$AJ$295,MATCH(Ras,Rasbonus!$A$1:$AJ$1,0),FALSE)),VLOOKUP($A87,Rasbonus!$A$61:$AJ$295,MATCH(Ras,Rasbonus!$A$1:$AJ$1,0),FALSE),\"0\")","v":"0"},{"$f":"'Ny NPC'!$N$3","v":"0"},null,-18,0,0,0,0,0,0,0,0,0,0,0,0,0,0,0,0,0,0,0,0,0]
["Yado",{"$f":"VLOOKUP(A88,AllaSkills!$A$3:$BV$317,'Ny NPC'!$A$2+3,FALSE)","v":"6"},"6","6","Combat",null,null,null,null,null,null,null,null,null,null,null,null,null,null,null,null,null,null,null,null,null,null,null,0,-25,{"$f":"(QU+AG)/2","v":0},{"$f":"HLOOKUP(Yrke,Levelbonus!$B$1:$CR$20,5,FALSE)","v":0},0,{"$f":"IF(ISNUMBER(VLOOKUP($A88,Rasbonus!$A$61:$AJ$295,MATCH(Ras,Rasbonus!$A$1:$AJ$1,0),FALSE)),VLOOKUP($A88,Rasbonus!$A$61:$AJ$295,MATCH(Ras,Rasbonus!$A$1:$AJ$1,0),FALSE),\"0\")","v":"0"},{"$f":"'Ny NPC'!$N$3","v":"0"},null,-25,0,0,0,0,0,0,0,0,0,0,0,0,0,0,0,0,0,0,0,0,0]
["Concentration",{"$f":"HLOOKUP(Diverse!$G$2,'2nd'!$B$1:$CR$18,6,FALSE)","v":1},null,null,null,{"$f":"SUM(AL90:AL107)","v":0},null,null,{"$f":"SUM(AM90:AM107)","v":0},{"$f":"SUM(AN90:AN107)","v":0},0,0,0,0,0,0,0,0,0,0,0,0,0,0,0,0,0,0,"Rank","Skill","Stat",null,"Lvl","Race","Armor","Item","Total"]
["AM Quickdraw",{"$f":"VLOOKUP(A90,AllaSkills!$A$3:$BV$317,'Ny NPC'!$A$2+3,FALSE)","v":"4"},"4","4","Concentration",null,null,null,null,null,null,null,null,null,null,null,null,null,null,null,null,null,null,null,null,null,null,null,0,-25,{"$f":"(AG+EQ)/2","v":2.5},{"$f":"HLOOKUP(Yrke,Levelbonus!$B$1:$CR$20,6,FALSE)","v":0},0,{"$f":"IF(ISNUMBER(VLOOKUP($A90,Rasbonus!$A$61:$AJ$295,MATCH(Ras,Rasbonus!$A$1:$AJ$1,0),FALSE)),VLOOKUP($A90,Rasbonus!$A$61:$AJ$295,MATCH(Ras,Rasbonus!$A$1:$AJ$1,0),FALSE),\"0\")","v":"0"},{"$f":"'Ny NPC'!$N$3","v":"0"},null,-23,0,{"$f":"IF(I90>2,\"99\",IF(I90<1,0,IF(I90=1,$C90+$C90-$C90,IF(I90=2,$C90+$D90))))","v":0},{"$f":"IF(J90>2,\"99\",IF(J90<1,0,IF(J90=1,$C90+$C90-$C90,IF(J90=2,$C90+$D90))))","v":0},0,0,0,0,0,0,0,0,0,0,0,0,0,0,0,0,0,0]
["Blind Fighting",{"$f":"VLOOKUP(A91,AllaSkills!$A$3:$BV$317,'Ny NPC'!$A$2+3,FALSE)","v":"10"},"10","10","Concentration",null,null,null,null,null,null,null,null,null,null,null,null,null,null,null,null,null,null,null,null,null,null,null,0,-25,{"$f":"(RE+EM)/2","v":2.5},{"$f":"HLOOKUP(Yrke,Levelbonus!$B$1:$CR$20,6,FALSE)","v":0},0,{"$f":"IF(ISNUMBER(VLOOKUP($A91,Rasbonus!$A$61:$AJ$295,MATCH(Ras,Rasbonus!$A$1:$AJ$1,0),FALSE)),VLOOKUP($A91,Rasbonus!$A$61:$AJ$295,MATCH(Ras,Rasbonus!$A$1:$AJ$1,0),FALSE),\"0\")","v":"0"},null,null,-23,0,{"$f":"IF(I91>2,\"99\",IF(I91<1,0,IF(I91=1,$C91+$C91-$C91,IF(I91=2,$C91+$D91))))","v":0},{"$f":"IF(J91>2,\"99\",IF(J91<1,0,IF(J91=1,$C91+$C91-$C91,IF(J91=2,$C91+$D91))))","v":0},{"$f":"IF(K91>2,\"99\",IF(K91<1,0,IF(K91=1,$C91+$C91-$C91,IF(K91=2,$C91+$D91))))","v":0},{"$f":"IF(L91>2,\"99\",IF(L91<1,0,IF(L91=1,$C91+$C91-$C91,IF(L91=2,$C91+$D91))))","v":0},{"$f":"IF(M91>2,\"99\",IF(M91<1,0,IF(M91=1,$C91+$C91-$C91,IF(M91=2,$C91+$D91))))","v":0},{"$f":"IF(N91>2,\"99\",IF(N91<1,0,IF(N91=1,$C91+$C91-$C91,IF(N91=2,$C91+$D91))))","v":0},{"$f":"IF(O91>2,\"99\",IF(O91<1,0,IF(O91=1,$C91+$C91-$C91,IF(O91=2,$C91+$D91))))","v":0},{"$f":"IF(P91>2,\"99\",IF(P91<1,0,IF(P91=1,$C91+$C91-$C91,IF(P91=2,$C91+$D91))))","v":0},{"$f":"IF(Q91>2,\"99\",IF(Q91<1,0,IF(Q91=1,$C91+$C91-$C91,IF(Q91=2,$C91+$D91))))","v":0},{"$f":"IF(R91>2,\"99\",IF(R91<1,0,IF(R91=1,$C91+$C91-$C91,IF(R91=2,$C91+$D91))))","v":0},{"$f":"IF(S91>2,\"99\",IF(S91<1,0,IF(S91=1,$C91+$C91-$C91,IF(S91=2,$C91+$D91))))","v":0},{"$f":"IF(T91>2,\"99\",IF(T91<1,0,IF(T91=1,$C91+$C91-$C91,IF(T91=2,$C91+$D91))))","v":0},{"$f":"IF(U91>2,\"99\",IF(U91<1,0,IF(U91=1,$C91+$C91-$C91,IF(U91=2,$C91+$D91))))","v":0},{"$f":"IF(V91>2,\"99\",IF(V91<1,0,IF(V91=1,$C91+$C91-$C91,IF(V91=2,$C91+$D91))))","v":0},{"$f":"IF(W91>2,\"99\",IF(W91<1,0,IF(W91=1,$C91+$C91-$C91,IF(W91=2,$C91+$D91))))","v":0},{"$f":"IF(X91>2,\"99\",IF(X91<1,0,IF(X91=1,$C91+$C91-$C91,IF(X91=2,$C91+$D91))))","v":0},{"$f":"IF(Y91>2,\"99\",IF(Y91<1,0,IF(Y91=1,$C91+$C91-$C91,IF(Y91=2,$C91+$D91))))","v":0},{"$f":"IF(Z91>2,\"99\",IF(Z91<1,0,IF(Z91=1,$C91+$C91-$C91,IF(Z91=2,$C91+$D91))))","v":0},{"$f":"IF(AA91>2,\"99\",IF(AA91<1,0,IF(AA91=1,$C91+$C91-$C91,IF(AA91=2,$C91+$D91))))","v":0},{"$f":"IF(AB91>2,\"99\",IF(AB91<1,0,IF(AB91=1,$C91+$C91-$C91,IF(AB91=2,$C91+$D91))))","v":0}]
["Body Damage Stabilization",{"$f":"VLOOKUP(A92,AllaSkills!$A$3:$BV$317,'Ny NPC'!$A$2+3,FALSE)","v":"3/5"},"3","5","Concentration",null,null,null,null,null,null,null,null,null,null,null,null,null,null,null,null,null,null,null,null,null,null,null,0,-25,{"$f":"(SD+EM)/2","v":5},{"$f":"HLOOKUP(Yrke,Levelbonus!$B$1:$CR$20,6,FALSE)","v":0},0,{"$f":"IF(ISNUMBER(VLOOKUP($A92,Rasbonus!$A$61:$AJ$295,MATCH(Ras,Rasbonus!$A$1:$AJ$1,0),FALSE)),VLOOKUP($A92,Rasbonus!$A$61:$AJ$295,MATCH(Ras,Rasbonus!$A$1:$AJ$1,0),FALSE),\"0\")","v":"0"},null,null,-20,0,0,0,0,0,0,0,0,0,0,0,0,0,0,0,0,0,0,0,0,0]
["Control Lycantrophy",{"$f":"VLOOKUP(A93,AllaSkills!$A$3:$BV$317,'Ny NPC'!$A$2+3,FALSE)","v":"3/6"},"3","6","Concentration",null,null,null,null,null,null,null,null,null,null,null,null,null,null,null,null,null,null,null,null,null,null,null,0,-25,{"$f":"SD","v":10},{"$f":"HLOOKUP(Yrke,Levelbonus!$B$1:$CR$20,6,FALSE)","v":0},0,{"$f":"IF(ISNUMBER(VLOOKUP($A93,Rasbonus!$A$61:$AJ$295,MATCH(Ras,Rasbonus!$A$1:$AJ$1,0),FALSE)),VLOOKUP($A93,Rasbonus!$A$61:$AJ$295,MATCH(Ras,Rasbonus!$A$1:$AJ$1,0),FALSE),\"0\")","v":"0"},null,null,-15,0,0,0,0,0,0,0,0,0,0,0,0,0,0,0,0,0,0,0,0,0]
["Dowsing",{"$f":"VLOOKUP(A94,AllaSkills!$A$3:$BV$317,'Ny NPC'!$A$2+3,FALSE)","v":"2/5"},"2","5","Concentration",null,null,null,null,null,null,null,null,null,null,null,null,null,null,null,null,null,null,null,null,null,null,null,0,-25,{"$f":"EM","v":0},{"$f":"HLOOKUP(Yrke,Levelbonus!$B$1:$CR$20,6,FALSE)","v":0},0,{"$f":"IF(ISNUMBER(VLOOKUP($A94,Rasbonus!$A$61:$AJ$295,MATCH(Ras,Rasbonus!$A$1:$AJ$1,0),FALSE)),VLOOKUP($A94,Rasbonus!$A$61:$AJ$295,MATCH(Ras,Rasbonus!$A$1:$AJ$1,0),FALSE),\"0\")","v":"0"},null,null,-25,0,0,0,0,0,0,0,0,0,0,0,0,0,0,0,0,0,0,0,0,0]
["Frenzy",{"$f":"VLOOKUP(A95,AllaSkills!$A$3:$BV$317,'Ny NPC'!$A$2+3,FALSE)","v":"6"},"6","6","Concentration",null,null,null,null,null,null,null,null,null,null,null,null,null,null,null,null,null,null,null,null,null,null,null,0,-25,{"$f":"(EM+SD)/2","v":5},{"$f":"HLOOKUP(Yrke,Levelbonus!$B$1:$CR$20,6,FALSE)","v":0},0,{"$f":"IF(ISNUMBER(VLOOKUP($A95,Rasbonus!$A$61:$AJ$295,MATCH(Ras,Rasbonus!$A$1:$AJ$1,0),FALSE)),VLOOKUP($A95,Rasbonus!$A$61:$AJ$295,MATCH(Ras,Rasbonus!$A$1:$AJ$1,0),FALSE),\"0\")","v":"0"},null,null,-20,0,0,0,0,0,0,0,0,0,0,0,0,0,0,0,0,0,0,0,0,0]
["Meditation Cleansing",{"$f":"VLOOKUP(A96,AllaSkills!$A$3:$BV$317,'Ny NPC'!$A$2+3,FALSE)","v":"2/4"},"2","4","Concentration",null,null,null,null,null,null,null,null,null,null,null,null,null,null,null,null,null,null,null,null,null,null,null,0,-25,{"$f":"(SD+EM)/2","v":5},{"$f":"HLOOKUP(Yrke,Levelbonus!$B$1:$CR$20,6,FALSE)","v":0},0,{"$f":"IF(ISNUMBER(VLOOKUP($A96,Rasbonus!$A$61:$AJ$295,MATCH(Ras,Rasbonus!$A$1:$AJ$1,0),FALSE)),VLOOKUP($A96,Rasbonus!$A$61:$AJ$295,MATCH(Ras,Rasbonus!$A$1:$AJ$1,0),FALSE),\"0\")","v":"0"},null,null,-20,0,0,0,0,0,0,0,0,0,0,0,0,0,0,0,0,0,0,0,0,0]
["Meditation Death",{"$f":"VLOOKUP(A97,AllaSkills!$A$3:$BV$317,'Ny NPC'!$A$2+3,FALSE)","v":"1/5"},"1","5","Concentration",null,null,null,null,null,null,null,null,null,null,null,null,null,null,null,null,null,null,null,null,null,null,null,0,-25,{"$f":"(SD+PR)/2","v":5},{"$f":"HLOOKUP(Yrke,Levelbonus!$B$1:$CR$20,6,FALSE)","v":0},0,{"$f":"IF(ISNUMBER(VLOOKUP($A97,Rasbonus!$A$61:$AJ$295,MATCH(Ras,Rasbonus!$A$1:$AJ$1,0),FALSE)),VLOOKUP($A97,Rasbonus!$A$61:$AJ$295,MATCH(Ras,Rasbonus!$A$1:$AJ$1,0),FALSE),\"0\")","v":"0"},null,null,-20,0,0,0,0,0,0,0,0,0,0,0,0,0,0,0,0,0,0,0,0,0]
["Meditation Healing",{"$f":"VLOOKUP(A98,AllaSkills!$A$3:$BV$317,'Ny NPC'!$A$2+3,FALSE)","v":"2/4"},"2","4","Concentration",null,null,null,null,null,null,null,null,null,null,null,null,null,null,null,null,null,null,null,null,null,null,null,0,-25,{"$f":"(SD+EM)/2","v":5},{"$f":"HLOOKUP(Yrke,Levelbonus!$B$1:$CR$20,6,FALSE)","v":0},0,{"$f":"IF(ISNUMBER(VLOOKUP($A98,Rasbonus!$A$61:$AJ$295,MATCH(Ras,Rasbonus!$A$1:$AJ$1,0),FALSE)),VLOOKUP($A98,Rasbonus!$A$61:$AJ$295,MATCH(Ras,Rasbonus!$A$1:$AJ$1,0),FALSE),\"0\")","v":"0"},null,null,-20,0,0,0,0,0,0,0,0,0,0,0,0,0,0,0,0,0,0,0,0,0]
["Meditation Ki",{"$f":"VLOOKUP(A99,AllaSkills!$A$3:$BV$317,'Ny NPC'!$A$2+3,FALSE)","v":"3/5"},"3","5","Concentration",null,null,null,null,null,null,null,null,null,null,null,null,null,null,null,null,null,null,null,null,null,null,null,0,-25,{"$f":"(SD+PR)/2","v":5},{"$f":"HLOOKUP(Yrke,Levelbonus!$B$1:$CR$20,6,FALSE)","v":0},0,{"$f":"IF(ISNUMBER(VLOOKUP($A99,Rasbonus!$A$61:$AJ$295,MATCH(Ras,Rasbonus!$A$1:$AJ$1,0),FALSE)),VLOOKUP($A99,Rasbonus!$A$61:$AJ$295,MATCH(Ras,Rasbonus!$A$1:$AJ$1,0),FALSE),\"0\")","v":"0"},null,null,-20,0,0,0,0,0,0,0,0,0,0,0,0,0,0,0,0,0,0,0,0,0]
["Meditation Sleep",{"$f":"VLOOKUP(A100,AllaSkills!$A$3:$BV$317,'Ny NPC'!$A$2+3,FALSE)","v":"1/4"},"1","4","Concentration",null,null,null,null,null,null,null,null,null,null,null,null,null,null,null,null,null,null,null,null,null,null,null,0,-25,{"$f":"(SD+IN)/2","v":7.5},{"$f":"HLOOKUP(Yrke,Levelbonus!$B$1:$CR$20,6,FALSE)","v":0},0,{"$f":"IF(ISNUMBER(VLOOKUP($A100,Rasbonus!$A$61:$AJ$295,MATCH(Ras,Rasbonus!$A$1:$AJ$1,0),FALSE)),VLOOKUP($A100,Rasbonus!$A$61:$AJ$295,MATCH(Ras,Rasbonus!$A$1:$AJ$1,0),FALSE),\"0\")","v":"0"},null,null,-18,0,0,0,0,0,0,0,0,0,0,0,0,0,0,0,0,0,0,0,0,0]
["Meditation Trance",{"$f":"VLOOKUP(A101,AllaSkills!$A$3:$BV$317,'Ny NPC'!$A$2+3,FALSE)","v":"1/4"},"1","4","Concentration",null,null,null,null,null,null,null,null,null,null,null,null,null,null,null,null,null,null,null,null,null,null,null,0,-25,{"$f":"(SD+PR)/2","v":5},{"$f":"HLOOKUP(Yrke,Levelbonus!$B$1:$CR$20,6,FALSE)","v":0},0,{"$f":"IF(ISNUMBER(VLOOKUP($A101,Rasbonus!$A$61:$AJ$295,MATCH(Ras,Rasbonus!$A$1:$AJ$1,0),FALSE)),VLOOKUP($A101,Rasbonus!$A$61:$AJ$295,MATCH(Ras,Rasbonus!$A$1:$AJ$1,0),FALSE),\"0\")","v":"0"},null,null,-20,0,0,0,0,0,0,0,0,0,0,0,0,0,0,0,0,0,0,0,0,0]
["Mnemonics",{"$f":"VLOOKUP(A102,AllaSkills!$A$3:$BV$317,'Ny NPC'!$A$2+3,FALSE)","v":"1/4"},"1","4","Concentration",null,null,null,null,null,null,null,null,null,null,null,null,null,null,null,null,null,null,null,null,null,null,null,0,-25,{"$f":"(RE+SD)/2","v":7.5},{"$f":"HLOOKUP(Yrke,Levelbonus!$B$1:$CR$20,6,FALSE)","v":0},0,{"$f":"IF(ISNUMBER(VLOOKUP($A102,Rasbonus!$A$61:$AJ$295,MATCH(Ras,Rasbonus!$A$1:$AJ$1,0),FALSE)),VLOOKUP($A102,Rasbonus!$A$61:$AJ$295,MATCH(Ras,Rasbonus!$A$1:$AJ$1,0),FALSE),\"0\")","v":"0"},null,null,-18,0,0,0,0,0,0,0,0,0,0,0,0,0,0,0,0,0,0,0,0,0]
["Prepared Shot",{"$f":"VLOOKUP(A103,AllaSkills!$A$3:$BV$317,'Ny NPC'!$A$2+3,FALSE)","v":"6"},"6","6","Concentration",null,null,null,null,null,null,null,null,null,null,null,null,null,null,null,null,null,null,null,null,null,null,null,0,-25,{"$f":"(SD+IN)/2","v":7.5},{"$f":"HLOOKUP(Yrke,Levelbonus!$B$1:$CR$20,6,FALSE)","v":0},0,{"$f":"IF(ISNUMBER(VLOOKUP($A103,Rasbonus!$A$61:$AJ$295,MATCH(Ras,Rasbonus!$A$1:$AJ$1,0),FALSE)),VLOOKUP($A103,Rasbonus!$A$61:$AJ$295,MATCH(Ras,Rasbonus!$A$1:$AJ$1,0),FALSE),\"0\")","v":"0"},null,null,-18,0,0,0,0,0,0,0,0,0,0,0,0,0,0,0,0,0,0,0,0,0]
["WOW Fatigue",{"$f":"VLOOKUP(A104,AllaSkills!$A$3:$BV$317,'Ny NPC'!$A$2+3,FALSE)","v":"20"},"20","20","Concentration",null,null,null,null,null,null,null,null,null,null,null,null,null,null,null,null,null,null,null,null,null,null,null,0,-25,{"$f":"SD","v":10},{"$f":"HLOOKUP(Yrke,Levelbonus!$B$1:$CR$20,6,FALSE)","v":0},0,{"$f":"IF(ISNUMBER(VLOOKUP($A104,Rasbonus!$A$61:$AJ$295,MATCH(Ras,Rasbonus!$A$1:$AJ$1,0),FALSE)),VLOOKUP($A104,Rasbonus!$A$61:$AJ$295,MATCH(Ras,Rasbonus!$A$1:$AJ$1,0),FALSE),\"0\")","v":10},null,null,-5,0,0,0,0,0,0,0,0,0,0,0,0,0,0,0,0,0,0,0,0,0]
["WOW Pain",{"$f":"VLOOKUP(A105,AllaSkills!$A$3:$BV$317,'Ny NPC'!$A$2+3,FALSE)","v":"20"},{"$f":"IF(LEN(B105)=3,LEFT(B105,1),IF(LEN(B105)<3,B105,99))","v":"20"},"20","Concentration",null,null,null,null,null,null,null,null,null,null,null,null,null,null,null,null,null,null,null,null,null,null,null,0,{"$f":"IF(AC105<1,-25,IF(AC105>30,80+((AC105-30)*0.5),IF(AC105>20,70+(AC105-20),IF(AC105>10,50+((AC105-10)*2),AC105*5))))","v":-25},{"$f":"SD","v":10},{"$f":"HLOOKUP(Yrke,Levelbonus!$B$1:$CR$20,6,FALSE)","v":0},{"$f":"AF105*Level","v":0},{"$f":"IF(ISNUMBER(VLOOKUP($A105,Rasbonus!$A$61:$AJ$295,MATCH(Ras,Rasbonus!$A$1:$AJ$1,0),FALSE)),VLOOKUP($A105,Rasbonus!$A$61:$AJ$295,MATCH(Ras,Rasbonus!$A$1:$AJ$1,0),FALSE),\"0\")","v":10},null,null,-5,0,0,0,0,0,0,0,0,0,0,0,0,0,0,0,0,0,0,0,0,0]
["WOW Unconsciousness",{"$f":"VLOOKUP(A106,AllaSkills!$A$3:$BV$317,'Ny NPC'!$A$2+3,FALSE)","v":"20"},"20","20","Concentration",null,null,null,null,null,null,null,null,null,null,null,null,null,null,null,null,null,null,null,null,null,null,null,0,-25,{"$f":"SD","v":10},{"$f":"HLOOKUP(Yrke,Levelbonus!$B$1:$CR$20,6,FALSE)","v":0},0,{"$f":"IF(ISNUMBER(VLOOKUP($A106,Rasbonus!$A$61:$AJ$295,MATCH(Ras,Rasbonus!$A$1:$AJ$1,0),FALSE)),VLOOKUP($A106,Rasbonus!$A$61:$AJ$295,MATCH(Ras,Rasbonus!$A$1:$AJ$1,0),FALSE),\"0\")","v":10},null,null,-5,0,0,0,0,0,0,0,0,0,0,0,0,0,0,0,0,0,0,0,0,0]
["WOW Will",{"$f":"VLOOKUP(A107,AllaSkills!$A$3:$BV$317,'Ny NPC'!$A$2+3,FALSE)","v":"20"},"20",{"$f":"IF(RIGHT(B107,1)=\"*\",LEFT(B107,1),IF(LEN(B107)=3,RIGHT(B107,1),IF(LEN(B107)<3,B107,RIGHT(B107,2))))","v":"20"},"Concentration",null,null,null,null,null,null,null,null,null,null,null,null,null,null,null,null,null,null,null,null,null,null,null,{"$f":"SUM(F107:AB107)","v":0},-25,{"$f":"SD","v":10},{"$f":"HLOOKUP(Yrke,Levelbonus!$B$1:$CR$20,6,FALSE)","v":0},0,{"$f":"IF(ISNUMBER(VLOOKUP($A107,Rasbonus!$A$61:$AJ$295,MATCH(Ras,Rasbonus!$A$1:$AJ$1,0),FALSE)),VLOOKUP($A107,Rasbonus!$A$61:$AJ$295,MATCH(Ras,Rasbonus!$A$1:$AJ$1,0),FALSE),\"0\")","v":10},null,null,-5,0,0,0,0,0,0,0,0,0,0,0,0,0,0,0,0,0,0,0,0,0]
["Deadly",{"$f":"HLOOKUP(Diverse!$G$2,'2nd'!$B$1:$CR$18,7,FALSE)","v":0},null,null,null,{"$f":"SUM(AL109:AL110)","v":0},null,null,{"$f":"SUM(AM109:AM110)","v":0},{"$f":"SUM(AN109:AN110)","v":0},0,0,0,0,0,0,0,0,0,0,0,0,0,0,0,0,0,0,"Rank","Skill","Stat",null,"Lvl","Race","Armor","Item","Total"]
["Silent Kill",{"$f":"VLOOKUP(A109,AllaSkills!$A$3:$BV$317,'Ny NPC'!$A$2+3,FALSE)","v":"6"},"6","6","Deadly",null,null,null,null,null,null,null,null,null,null,null,null,null,null,null,null,null,null,null,null,null,null,null,0,-25,{"$f":"AG","v":0},{"$f":"HLOOKUP(Yrke,Levelbonus!$B$1:$CR$20,7,FALSE)","v":0},0,{"$f":"IF(ISNUMBER(VLOOKUP($A109,Rasbonus!$A$61:$AJ$295,MATCH(Ras,Rasbonus!$A$1:$AJ$1,0),FALSE)),VLOOKUP($A109,Rasbonus!$A$61:$AJ$295,MATCH(Ras,Rasbonus!$A$1:$AJ$1,0),FALSE),\"0\")","v":"0"},{"$f":"'Ny NPC'!$N$3","v":"0"},null,-25,0,{"$f":"IF(I109>2,\"99\",IF(I109<1,0,IF(I109=1,$C109+$C109-$C109,IF(I109=2,$C109+$D109))))","v":0},{"$f":"IF(J109>2,\"99\",IF(J109<1,0,IF(J109=1,$C109+$C109-$C109,IF(J109=2,$C109+$D109))))","v":0},0,0,0,0,0,0,0,0,0,0,0,0,0,0,0,0,0,0]
["Use/Remove Poison",{"$f":"VLOOKUP(A110,AllaSkills!$A$3:$BV$317,'Ny NPC'!$A$2+3,FALSE)","v":"1/4"},"1","4","Deadly",null,null,null,null,null,null,null,null,null,null,null,null,null,null,null,null,null,null,null,null,null,null,null,0,-25,{"$f":"(AG+IN)/2","v":2.5},{"$f":"HLOOKUP(Yrke,Levelbonus!$B$1:$CR$20,7,FALSE)","v":0},0,{"$f":"IF(ISNUMBER(VLOOKUP($A110,Rasbonus!$A$61:$AJ$295,MATCH(Ras,Rasbonus!$A$1:$AJ$1,0),FALSE)),VLOOKUP($A110,Rasbonus!$A$61:$AJ$295,MATCH(Ras,Rasbonus!$A$1:$AJ$1,0),FALSE),\"0\")","v":"0"},null,null,-23,0,{"$f":"IF(I110>2,\"99\",IF(I110<1,0,IF(I110=1,$C110+$C110-$C110,IF(I110=2,$C110+$D110))))","v":0},{"$f":"IF(J110>2,\"99\",IF(J110<1,0,IF(J110=1,$C110+$C110-$C110,IF(J110=2,$C110+$D110))))","v":0},0,0,0,0,0,0,0,0,0,0,0,0,0,0,0,0,0,0]
["Evaluation",{"$f":"HLOOKUP(Diverse!$G$2,'2nd'!$B$1:$CR$18,8,FALSE)","v":10},null,null,null,{"$f":"SUM(AL112:AL116)","v":0},null,null,{"$f":"SUM(AM112:AM116)","v":0},{"$f":"SUM(AN112:AN116)","v":0},0,0,0,0,0,0,0,0,0,0,0,0,0,0,0,0,0,0,"Rank","Skill","Stat",null,"Lvl","Race","Armor","Item","Total"]
["Appraisal",{"$f":"VLOOKUP(A112,AllaSkills!$A$3:$BV$317,'Ny NPC'!$A$2+3,FALSE)","v":"1/2"},"1","2","Evaluation",null,null,null,null,null,null,null,null,null,null,null,null,null,null,null,null,null,null,null,null,null,null,null,0,-25,{"$f":"(RE)","v":5},{"$f":"HLOOKUP(Yrke,Levelbonus!$B$1:$CR$20,8,FALSE)","v":2},6,{"$f":"IF(ISNUMBER(VLOOKUP($A112,Rasbonus!$A$61:$AJ$295,MATCH(Ras,Rasbonus!$A$1:$AJ$1,0),FALSE)),VLOOKUP($A112,Rasbonus!$A$61:$AJ$295,MATCH(Ras,Rasbonus!$A$1:$AJ$1,0),FALSE),\"0\")","v":5},null,null,-9,0,{"$f":"IF(I112>2,\"99\",IF(I112<1,0,IF(I112=1,$C112+$C112-$C112,IF(I112=2,$C112+$D112))))","v":0},{"$f":"IF(J112>2,\"99\",IF(J112<1,0,IF(J112=1,$C112+$C112-$C112,IF(J112=2,$C112+$D112))))","v":0},0,0,0,0,0,0,0,0,0,0,0,0,0,0,0,0,0,0]
["Armor Evaluation",{"$f":"VLOOKUP(A113,AllaSkills!$A$3:$BV$317,'Ny NPC'!$A$2+3,FALSE)","v":"1/3"},"1","3","Evaluation",null,null,null,null,null,null,null,null,null,null,null,null,null,null,null,null,null,null,null,null,null,null,null,0,-25,{"$f":"(IN+RE)/2","v":5},{"$f":"HLOOKUP(Yrke,Levelbonus!$B$1:$CR$20,8,FALSE)","v":2},6,{"$f":"IF(ISNUMBER(VLOOKUP($A113,Rasbonus!$A$61:$AJ$295,MATCH(Ras,Rasbonus!$A$1:$AJ$1,0),FALSE)),VLOOKUP($A113,Rasbonus!$A$61:$AJ$295,MATCH(Ras,Rasbonus!$A$1:$AJ$1,0),FALSE),\"0\")","v":5},null,null,-9,0,{"$f":"IF(I113>2,\"99\",IF(I113<1,0,IF(I113=1,$C113+$C113-$C113,IF(I113=2,$C113+$D113))))","v":0},{"$f":"IF(J113>2,\"99\",IF(J113<1,0,IF(J113=1,$C113+$C113-$C113,IF(J113=2,$C113+$D113))))","v":0},0,0,0,0,0,0,0,0,0,{"$f":"IF(T113>2,\"99\",IF(T113<1,0,IF(T113=1,$C113+$C113-$C113,IF(T113=2,$C113+$D113))))","v":0},0,0,0,0,0,0,0,0]
["Metal Evaluation",{"$f":"VLOOKUP(A114,AllaSkills!$A$3:$BV$317,'Ny NPC'!$A$2+3,FALSE)","v":"1/2"},"1","2","Evaluation",null,null,null,null,null,null,null,null,null,null,null,null,null,null,null,null,null,null,null,null,null,null,null,0,-25,{"$f":"(IN+RE)/2","v":5},{"$f":"HLOOKUP(Yrke,Levelbonus!$B$1:$CR$20,8,FALSE)","v":2},6,{"$f":"IF(ISNUMBER(VLOOKUP($A114,Rasbonus!$A$61:$AJ$295,MATCH(Ras,Rasbonus!$A$1:$AJ$1,0),FALSE)),VLOOKUP($A114,Rasbonus!$A$61:$AJ$295,MATCH(Ras,Rasbonus!$A$1:$AJ$1,0),FALSE),\"0\")","v":5},null,null,-9,0,{"$f":"IF(I114>2,\"99\",IF(I114<1,0,IF(I114=1,$C114+$C114-$C114,IF(I114=2,$C114+$D114))))","v":0},0,0,0,0,0,0,0,0,0,0,0,0,0,0,0,0,0,0,0]
["Stone Evaluation",{"$f":"VLOOKUP(A115,AllaSkills!$A$3:$BV$317,'Ny NPC'!$A$2+3,FALSE)","v":"1/2"},"1","2","Evaluation",null,null,null,null,null,null,null,null,null,null,null,null,null,null,null,null,null,null,null,null,null,null,null,0,-25,{"$f":"(IN+RE)/2","v":5},{"$f":"HLOOKUP(Yrke,Levelbonus!$B$1:$CR$20,8,FALSE)","v":2},6,{"$f":"IF(ISNUMBER(VLOOKUP($A115,Rasbonus!$A$61:$AJ$295,MATCH(Ras,Rasbonus!$A$1:$AJ$1,0),FALSE)),VLOOKUP($A115,Rasbonus!$A$61:$AJ$295,MATCH(Ras,Rasbonus!$A$1:$AJ$1,0),FALSE),\"0\")","v":5},null,null,-9,0,{"$f":"IF(I115>2,\"99\",IF(I115<1,0,IF(I115=1,$C115+$C115-$C115,IF(I115=2,$C115+$D115))))","v":0},0,0,0,0,0,0,0,0,0,0,0,0,0,0,0,0,0,0,0]
["Weapon Evaluation",{"$f":"VLOOKUP(A116,AllaSkills!$A$3:$BV$317,'Ny NPC'!$A$2+3,FALSE)","v":"1/3"},"1","3","Evaluation",null,null,null,null,null,null,null,null,null,null,null,null,null,null,null,null,null,null,null,null,null,null,null,0,-25,{"$f":"(IN+RE)/2","v":5},{"$f":"HLOOKUP(Yrke,Levelbonus!$B$1:$CR$20,8,FALSE)","v":2},6,{"$f":"IF(ISNUMBER(VLOOKUP($A116,Rasbonus!$A$61:$AJ$295,MATCH(Ras,Rasbonus!$A$1:$AJ$1,0),FALSE)),VLOOKUP($A116,Rasbonus!$A$61:$AJ$295,MATCH(Ras,Rasbonus!$A$1:$AJ$1,0),FALSE),\"0\")","v":5},null,null,-9,0,{"$f":"IF(I116>2,\"99\",IF(I116<1,0,IF(I116=1,$C116+$C116-$C116,IF(I116=2,$C116+$D116))))","v":0},0,0,0,0,0,0,0,0,0,0,0,0,0,0,0,0,0,0,0]
["General",{"$f":"HLOOKUP(Diverse!$G$2,'2nd'!$B$1:$CR$18,9,FALSE)","v":12},null,null,null,{"$f":"SUM(AL118:AL137)","v":0},null,null,{"$f":"SUM(AM118:AM137)","v":0},{"$f":"SUM(AN118:AN137)","v":0},0,0,0,0,0,0,0,0,0,0,0,0,0,0,0,0,0,0,"Rank","Skill","Stat",null,"Lvl","Race","Armor","Item","Total"]
["Advertising",{"$f":"VLOOKUP(A118,AllaSkills!$A$3:$BV$317,'Ny NPC'!$A$2+3,FALSE)","v":"3/5"},"3","5","General",null,null,null,null,null,null,null,null,null,null,null,null,null,null,null,null,null,null,null,null,null,null,null,0,-25,{"$f":"(IN+RE)/2","v":5},{"$f":"HLOOKUP(Yrke,Levelbonus!$B$1:$CR$20,9,FALSE)","v":2},6,{"$f":"IF(ISNUMBER(VLOOKUP($A118,Rasbonus!$A$61:$AJ$295,MATCH(Ras,Rasbonus!$A$1:$AJ$1,0),FALSE)),VLOOKUP($A118,Rasbonus!$A$61:$AJ$295,MATCH(Ras,Rasbonus!$A$1:$AJ$1,0),FALSE),\"0\")","v":"0"},null,null,-14,0,{"$f":"IF(I118>2,\"99\",IF(I118<1,0,IF(I118=1,$C118+$C118-$C118,IF(I118=2,$C118+$D118))))","v":0},0,0,0,0,0,0,0,0,0,0,0,0,0,0,0,0,0,0,0]
["Cookery",{"$f":"VLOOKUP(A119,AllaSkills!$A$3:$BV$317,'Ny NPC'!$A$2+3,FALSE)","v":"1/2"},"1","2","General",null,null,null,null,null,null,null,null,null,null,null,null,null,null,null,null,null,null,null,null,null,null,null,0,-25,{"$f":"(IN+RE)/2","v":5},{"$f":"HLOOKUP(Yrke,Levelbonus!$B$1:$CR$20,9,FALSE)","v":2},6,{"$f":"IF(ISNUMBER(VLOOKUP($A119,Rasbonus!$A$61:$AJ$295,MATCH(Ras,Rasbonus!$A$1:$AJ$1,0),FALSE)),VLOOKUP($A119,Rasbonus!$A$61:$AJ$295,MATCH(Ras,Rasbonus!$A$1:$AJ$1,0),FALSE),\"0\")","v":"0"},null,null,-14,0,{"$f":"IF(I119>2,\"99\",IF(I119<1,0,IF(I119=1,$C119+$C119-$C119,IF(I119=2,$C119+$D119))))","v":0},{"$f":"IF(J119>2,\"99\",IF(J119<1,0,IF(J119=1,$C119+$C119-$C119,IF(J119=2,$C119+$D119))))","v":0},{"$f":"IF(K119>2,\"99\",IF(K119<1,0,IF(K119=1,$C119+$C119-$C119,IF(K119=2,$C119+$D119))))","v":0},{"$f":"IF(L119>2,\"99\",IF(L119<1,0,IF(L119=1,$C119+$C119-$C119,IF(L119=2,$C119+$D119))))","v":0},{"$f":"IF(M119>2,\"99\",IF(M119<1,0,IF(M119=1,$C119+$C119-$C119,IF(M119=2,$C119+$D119))))","v":0},{"$f":"IF(N119>2,\"99\",IF(N119<1,0,IF(N119=1,$C119+$C119-$C119,IF(N119=2,$C119+$D119))))","v":0},{"$f":"IF(O119>2,\"99\",IF(O119<1,0,IF(O119=1,$C119+$C119-$C119,IF(O119=2,$C119+$D119))))","v":0},{"$f":"IF(P119>2,\"99\",IF(P119<1,0,IF(P119=1,$C119+$C119-$C119,IF(P119=2,$C119+$D119))))","v":0},{"$f":"IF(Q119>2,\"99\",IF(Q119<1,0,IF(Q119=1,$C119+$C119-$C119,IF(Q119=2,$C119+$D119))))","v":0},{"$f":"IF(R119>2,\"99\",IF(R119<1,0,IF(R119=1,$C119+$C119-$C119,IF(R119=2,$C119+$D119))))","v":0},{"$f":"IF(S119>2,\"99\",IF(S119<1,0,IF(S119=1,$C119+$C119-$C119,IF(S119=2,$C119+$D119))))","v":0},{"$f":"IF(T119>2,\"99\",IF(T119<1,0,IF(T119=1,$C119+$C119-$C119,IF(T119=2,$C119+$D119))))","v":0},{"$f":"IF(U119>2,\"99\",IF(U119<1,0,IF(U119=1,$C119+$C119-$C119,IF(U119=2,$C119+$D119))))","v":0},{"$f":"IF(V119>2,\"99\",IF(V119<1,0,IF(V119=1,$C119+$C119-$C119,IF(V119=2,$C119+$D119))))","v":0},{"$f":"IF(W119>2,\"99\",IF(W119<1,0,IF(W119=1,$C119+$C119-$C119,IF(W119=2,$C119+$D119))))","v":0},{"$f":"IF(X119>2,\"99\",IF(X119<1,0,IF(X119=1,$C119+$C119-$C119,IF(X119=2,$C119+$D119))))","v":0},{"$f":"IF(Y119>2,\"99\",IF(Y119<1,0,IF(Y119=1,$C119+$C119-$C119,IF(Y119=2,$C119+$D119))))","v":0},{"$f":"IF(Z119>2,\"99\",IF(Z119<1,0,IF(Z119=1,$C119+$C119-$C119,IF(Z119=2,$C119+$D119))))","v":0},{"$f":"IF(AA119>2,\"99\",IF(AA119<1,0,IF(AA119=1,$C119+$C119-$C119,IF(AA119=2,$C119+$D119))))","v":0},{"$f":"IF(AB119>2,\"99\",IF(AB119<1,0,IF(AB119=1,$C119+$C119-$C119,IF(AB119=2,$C119+$D119))))","v":0}]
["Crafting",{"$f":"VLOOKUP(A120,AllaSkills!$A$3:$BV$317,'Ny NPC'!$A$2+3,FALSE)","v":"1/2"},"1","2","General",null,null,null,null,null,null,null,null,null,null,null,null,null,null,null,null,null,null,null,null,null,null,null,0,-25,{"$f":"(AG+SD)/2","v":5},{"$f":"HLOOKUP(Yrke,Levelbonus!$B$1:$CR$20,9,FALSE)","v":2},6,{"$f":"IF(ISNUMBER(VLOOKUP($A120,Rasbonus!$A$61:$AJ$295,MATCH(Ras,Rasbonus!$A$1:$AJ$1,0),FALSE)),VLOOKUP($A120,Rasbonus!$A$61:$AJ$295,MATCH(Ras,Rasbonus!$A$1:$AJ$1,0),FALSE),\"0\")","v":"0"},null,null,-14,0,0,0,0,0,0,0,0,0,0,0,0,0,0,0,0,0,0,0,0,0]
["Fletching",{"$f":"VLOOKUP(A121,AllaSkills!$A$3:$BV$317,'Ny NPC'!$A$2+3,FALSE)","v":"1/3"},"1","3","General",null,null,null,null,null,null,null,null,null,null,null,null,null,null,null,null,null,null,null,null,null,null,null,0,-25,{"$f":"(AG+SD)/2","v":5},{"$f":"HLOOKUP(Yrke,Levelbonus!$B$1:$CR$20,9,FALSE)","v":2},6,{"$f":"IF(ISNUMBER(VLOOKUP($A121,Rasbonus!$A$61:$AJ$295,MATCH(Ras,Rasbonus!$A$1:$AJ$1,0),FALSE)),VLOOKUP($A121,Rasbonus!$A$61:$AJ$295,MATCH(Ras,Rasbonus!$A$1:$AJ$1,0),FALSE),\"0\")","v":"0"},null,null,-14,0,0,0,0,0,0,0,0,0,0,0,0,0,0,0,0,0,0,0,0,0]
["Gimmickry",{"$f":"VLOOKUP(A122,AllaSkills!$A$3:$BV$317,'Ny NPC'!$A$2+3,FALSE)","v":"2/4"},"2","4","General",null,null,null,null,null,null,null,null,null,null,null,null,null,null,null,null,null,null,null,null,null,null,null,0,-25,{"$f":"RE","v":5},{"$f":"HLOOKUP(Yrke,Levelbonus!$B$1:$CR$20,9,FALSE)","v":2},6,{"$f":"IF(ISNUMBER(VLOOKUP($A122,Rasbonus!$A$61:$AJ$295,MATCH(Ras,Rasbonus!$A$1:$AJ$1,0),FALSE)),VLOOKUP($A122,Rasbonus!$A$61:$AJ$295,MATCH(Ras,Rasbonus!$A$1:$AJ$1,0),FALSE),\"0\")","v":"0"},null,null,-14,0,0,0,0,0,0,0,0,0,0,0,0,0,0,0,0,0,0,0,0,0]
["Horticulture",{"$f":"VLOOKUP(A123,AllaSkills!$A$3:$BV$317,'Ny NPC'!$A$2+3,FALSE)","v":"1/4"},"1","4","General",null,null,null,null,null,null,null,null,null,null,null,null,null,null,null,null,null,null,null,null,null,null,null,0,-25,{"$f":"(IN+EM)/2","v":2.5},{"$f":"HLOOKUP(Yrke,Levelbonus!$B$1:$CR$20,9,FALSE)","v":2},6,{"$f":"IF(ISNUMBER(VLOOKUP($A123,Rasbonus!$A$61:$AJ$295,MATCH(Ras,Rasbonus!$A$1:$AJ$1,0),FALSE)),VLOOKUP($A123,Rasbonus!$A$61:$AJ$295,MATCH(Ras,Rasbonus!$A$1:$AJ$1,0),FALSE),\"0\")","v":"0"},null,null,-17,0,0,0,0,0,0,0,0,0,0,0,0,0,0,0,0,0,0,0,0,0]
["Hygien",{"$f":"VLOOKUP(A124,AllaSkills!$A$3:$BV$317,'Ny NPC'!$A$2+3,FALSE)","v":"3"},"3","3","General",null,null,null,null,null,null,null,null,null,null,null,null,null,null,null,null,null,null,null,null,null,null,null,0,-25,{"$f":"(CO+SD)/2","v":15},{"$f":"HLOOKUP(Yrke,Levelbonus!$B$1:$CR$20,9,FALSE)","v":2},6,{"$f":"IF(ISNUMBER(VLOOKUP($A124,Rasbonus!$A$61:$AJ$295,MATCH(Ras,Rasbonus!$A$1:$AJ$1,0),FALSE)),VLOOKUP($A124,Rasbonus!$A$61:$AJ$295,MATCH(Ras,Rasbonus!$A$1:$AJ$1,0),FALSE),\"0\")","v":"0"},null,null,-4,0,0,0,0,0,0,0,0,0,0,0,0,0,0,0,0,0,0,0,0,0]
["Leatherworking",{"$f":"VLOOKUP(A125,AllaSkills!$A$3:$BV$317,'Ny NPC'!$A$2+3,FALSE)","v":"3"},"3","3","General",null,null,null,null,null,null,null,null,null,null,null,null,null,null,null,null,null,null,null,null,null,null,null,0,-25,{"$f":"(AG+RE)/2","v":2.5},{"$f":"HLOOKUP(Yrke,Levelbonus!$B$1:$CR$20,9,FALSE)","v":2},6,{"$f":"IF(ISNUMBER(VLOOKUP($A125,Rasbonus!$A$61:$AJ$295,MATCH(Ras,Rasbonus!$A$1:$AJ$1,0),FALSE)),VLOOKUP($A125,Rasbonus!$A$61:$AJ$295,MATCH(Ras,Rasbonus!$A$1:$AJ$1,0),FALSE),\"0\")","v":"0"},null,null,-17,0,0,0,0,0,0,0,0,0,0,0,0,0,0,0,0,0,0,0,0,0]
["Painting",{"$f":"VLOOKUP(A126,AllaSkills!$A$3:$BV$317,'Ny NPC'!$A$2+3,FALSE)","v":"2/5"},"2","5","General",null,null,null,null,null,null,null,null,null,null,null,null,null,null,null,null,null,null,null,null,null,null,null,0,-25,{"$f":"(IN+AG)/2","v":2.5},{"$f":"HLOOKUP(Yrke,Levelbonus!$B$1:$CR$20,9,FALSE)","v":2},6,{"$f":"IF(ISNUMBER(VLOOKUP($A126,Rasbonus!$A$61:$AJ$295,MATCH(Ras,Rasbonus!$A$1:$AJ$1,0),FALSE)),VLOOKUP($A126,Rasbonus!$A$61:$AJ$295,MATCH(Ras,Rasbonus!$A$1:$AJ$1,0),FALSE),\"0\")","v":"0"},null,null,-17,0,0,0,0,0,0,0,0,0,0,0,0,0,0,0,0,0,0,0,0,0]
["Play instrument #1",{"$f":"VLOOKUP(A127,AllaSkills!$A$3:$BV$317,'Ny NPC'!$A$2+3,FALSE)","v":"2/6"},"2","6","General",null,null,null,null,null,null,null,null,null,null,null,null,null,null,null,null,null,null,null,null,null,null,null,0,-25,{"$f":"(AG+RE)/2","v":2.5},{"$f":"HLOOKUP(Yrke,Levelbonus!$B$1:$CR$20,9,FALSE)","v":2},6,{"$f":"IF(ISNUMBER(VLOOKUP($A127,Rasbonus!$A$61:$AJ$295,MATCH(Ras,Rasbonus!$A$1:$AJ$1,0),FALSE)),VLOOKUP($A127,Rasbonus!$A$61:$AJ$295,MATCH(Ras,Rasbonus!$A$1:$AJ$1,0),FALSE),\"0\")","v":"0"},null,null,-17,0,0,0,0,0,0,0,0,0,0,0,0,0,0,0,0,0,0,0,0,0]
["Play instrument #2",{"$f":"VLOOKUP(A128,AllaSkills!$A$3:$BV$317,'Ny NPC'!$A$2+3,FALSE)","v":"3/7"},"3","7","General",null,null,null,null,null,null,null,null,null,null,null,null,null,null,null,null,null,null,null,null,null,null,null,0,-25,{"$f":"(AG+RE)/2","v":2.5},{"$f":"HLOOKUP(Yrke,Levelbonus!$B$1:$CR$20,9,FALSE)","v":2},6,{"$f":"IF(ISNUMBER(VLOOKUP($A128,Rasbonus!$A$61:$AJ$295,MATCH(Ras,Rasbonus!$A$1:$AJ$1,0),FALSE)),VLOOKUP($A128,Rasbonus!$A$61:$AJ$295,MATCH(Ras,Rasbonus!$A$1:$AJ$1,0),FALSE),\"0\")","v":"0"},null,null,-17,0,0,0,0,0,0,0,0,0,0,0,0,0,0,0,0,0,0,0,0,0]
["Play instrument #3",{"$f":"VLOOKUP(A129,AllaSkills!$A$3:$BV$317,'Ny NPC'!$A$2+3,FALSE)","v":"3"},"3","3","General",null,null,null,null,null,null,null,null,null,null,null,null,null,null,null,null,null,null,null,null,null,null,null,0,-25,{"$f":"(AG+RE)/2","v":2.5},{"$f":"HLOOKUP(Yrke,Levelbonus!$B$1:$CR$20,9,FALSE)","v":2},6,{"$f":"IF(ISNUMBER(VLOOKUP($A129,Rasbonus!$A$61:$AJ$295,MATCH(Ras,Rasbonus!$A$1:$AJ$1,0),FALSE)),VLOOKUP($A129,Rasbonus!$A$61:$AJ$295,MATCH(Ras,Rasbonus!$A$1:$AJ$1,0),FALSE),\"0\")","v":"0"},null,null,-17,0,0,0,0,0,0,0,0,0,0,0,0,0,0,0,0,0,0,0,0,0]
["Rope Mastery",{"$f":"VLOOKUP(A130,AllaSkills!$A$3:$BV$317,'Ny NPC'!$A$2+3,FALSE)","v":"3"},"3","3","General",null,null,null,null,null,null,null,null,null,null,null,null,null,null,null,null,null,null,null,null,null,null,null,0,-25,{"$f":"(AG+RE)/2","v":2.5},{"$f":"HLOOKUP(Yrke,Levelbonus!$B$1:$CR$20,9,FALSE)","v":2},6,{"$f":"IF(ISNUMBER(VLOOKUP($A130,Rasbonus!$A$61:$AJ$295,MATCH(Ras,Rasbonus!$A$1:$AJ$1,0),FALSE)),VLOOKUP($A130,Rasbonus!$A$61:$AJ$295,MATCH(Ras,Rasbonus!$A$1:$AJ$1,0),FALSE),\"0\")","v":"0"},null,null,-17,0,0,0,0,0,0,0,0,0,0,0,0,0,0,0,0,0,0,0,0,0]
["Sculpting",{"$f":"VLOOKUP(A131,AllaSkills!$A$3:$BV$317,'Ny NPC'!$A$2+3,FALSE)","v":"1/4"},"1","4","General",null,null,null,null,null,null,null,null,null,null,null,null,null,null,null,null,null,null,null,null,null,null,null,0,-25,{"$f":"(IN+AG)/2","v":2.5},{"$f":"HLOOKUP(Yrke,Levelbonus!$B$1:$CR$20,9,FALSE)","v":2},6,{"$f":"IF(ISNUMBER(VLOOKUP($A131,Rasbonus!$A$61:$AJ$295,MATCH(Ras,Rasbonus!$A$1:$AJ$1,0),FALSE)),VLOOKUP($A131,Rasbonus!$A$61:$AJ$295,MATCH(Ras,Rasbonus!$A$1:$AJ$1,0),FALSE),\"0\")","v":"0"},null,null,-17,0,0,0,0,0,0,0,0,0,0,0,0,0,0,0,0,0,0,0,0,0]
["Skinning",{"$f":"VLOOKUP(A132,AllaSkills!$A$3:$BV$317,'Ny NPC'!$A$2+3,FALSE)","v":"3"},"3","3","General",null,null,null,null,null,null,null,null,null,null,null,null,null,null,null,null,null,null,null,null,null,null,null,0,-25,{"$f":"(IN+AG)/2","v":2.5},{"$f":"HLOOKUP(Yrke,Levelbonus!$B$1:$CR$20,9,FALSE)","v":2},6,{"$f":"IF(ISNUMBER(VLOOKUP($A132,Rasbonus!$A$61:$AJ$295,MATCH(Ras,Rasbonus!$A$1:$AJ$1,0),FALSE)),VLOOKUP($A132,Rasbonus!$A$61:$AJ$295,MATCH(Ras,Rasbonus!$A$1:$AJ$1,0),FALSE),\"0\")","v":"0"},null,null,{"$f":"ROUND(AD132+AE132+AG132+AH132+AI132+AJ132,0)","v":-17},{"$f":"IF(F132>2,\"99\",IF(F132<1,0,IF(F132=1,$C132+$C132-$C132,IF(F132=2,$C132+$D132))))","v":0},0,0,0,0,0,0,0,0,0,0,0,0,0,0,0,0,0,0,0,0]
["Smithing",{"$f":"VLOOKUP(A133,AllaSkills!$A$3:$BV$317,'Ny NPC'!$A$2+3,FALSE)","v":"1/2"},"1","2","General",null,null,null,null,null,null,null,null,null,null,null,null,null,null,null,null,null,null,null,null,null,null,null,0,-25,{"$f":"(ST+AG)/2","v":7.5},{"$f":"HLOOKUP(Yrke,Levelbonus!$B$1:$CR$20,9,FALSE)","v":2},6,{"$f":"IF(ISNUMBER(VLOOKUP($A133,Rasbonus!$A$61:$AJ$295,MATCH(Ras,Rasbonus!$A$1:$AJ$1,0),FALSE)),VLOOKUP($A133,Rasbonus!$A$61:$AJ$295,MATCH(Ras,Rasbonus!$A$1:$AJ$1,0),FALSE),\"0\")","v":"0"},null,null,-12,0,0,0,0,0,0,0,0,0,0,0,0,0,0,0,0,0,0,0,0,0]
["Stonecrafts",{"$f":"VLOOKUP(A134,AllaSkills!$A$3:$BV$317,'Ny NPC'!$A$2+3,FALSE)","v":"1/2"},"1","2","General",null,null,null,null,null,null,null,null,null,null,null,null,null,null,null,null,null,null,null,null,null,null,null,0,-25,{"$f":"(AG+SD)/2","v":5},{"$f":"HLOOKUP(Yrke,Levelbonus!$B$1:$CR$20,9,FALSE)","v":2},6,{"$f":"IF(ISNUMBER(VLOOKUP($A134,Rasbonus!$A$61:$AJ$295,MATCH(Ras,Rasbonus!$A$1:$AJ$1,0),FALSE)),VLOOKUP($A134,Rasbonus!$A$61:$AJ$295,MATCH(Ras,Rasbonus!$A$1:$AJ$1,0),FALSE),\"0\")","v":10},null,null,-4,0,0,0,0,0,0,0,0,0,0,0,0,0,0,0,0,0,0,0,0,0]
["Tactical Games",{"$f":"VLOOKUP(A135,AllaSkills!$A$3:$BV$317,'Ny NPC'!$A$2+3,FALSE)","v":"1/4"},"1","4","General",null,null,null,null,null,null,null,null,null,null,null,null,null,null,null,null,null,null,null,null,null,null,null,0,-25,{"$f":"(RE)","v":5},{"$f":"HLOOKUP(Yrke,Levelbonus!$B$1:$CR$20,9,FALSE)","v":2},6,{"$f":"IF(ISNUMBER(VLOOKUP($A135,Rasbonus!$A$61:$AJ$295,MATCH(Ras,Rasbonus!$A$1:$AJ$1,0),FALSE)),VLOOKUP($A135,Rasbonus!$A$61:$AJ$295,MATCH(Ras,Rasbonus!$A$1:$AJ$1,0),FALSE),\"0\")","v":"0"},null,null,-14,0,0,0,0,0,0,0,0,0,0,0,0,0,0,0,0,0,0,0,0,0]
["WA Maintenance",{"$f":"VLOOKUP(A136,AllaSkills!$A$3:$BV$317,'Ny NPC'!$A$2+3,FALSE)","v":"1/2"},"1","2","General",null,null,null,null,null,null,null,null,null,null,null,null,null,null,null,null,null,null,null,null,null,null,null,0,-25,{"$f":"(AG+SD)/2","v":5},{"$f":"HLOOKUP(Yrke,Levelbonus!$B$1:$CR$20,9,FALSE)","v":2},6,{"$f":"IF(ISNUMBER(VLOOKUP($A136,Rasbonus!$A$61:$AJ$295,MATCH(Ras,Rasbonus!$A$1:$AJ$1,0),FALSE)),VLOOKUP($A136,Rasbonus!$A$61:$AJ$295,MATCH(Ras,Rasbonus!$A$1:$AJ$1,0),FALSE),\"0\")","v":"0"},null,null,-14,0,0,0,0,0,0,0,0,0,0,0,0,0,0,0,0,0,0,0,0,0]
["Woodcrafts",{"$f":"VLOOKUP(A137,AllaSkills!$A$3:$BV$317,'Ny NPC'!$A$2+3,FALSE)","v":"1/3"},"1","3","General",null,null,null,null,null,null,null,null,null,null,null,null,null,null,null,null,null,null,null,null,null,null,null,0,-25,{"$f":"(AG+EM)/2","v":0},{"$f":"HLOOKUP(Yrke,Levelbonus!$B$1:$CR$20,9,FALSE)","v":2},6,{"$f":"IF(ISNUMBER(VLOOKUP($A137,Rasbonus!$A$61:$AJ$295,MATCH(Ras,Rasbonus!$A$1:$AJ$1,0),FALSE)),VLOOKUP($A137,Rasbonus!$A$61:$AJ$295,MATCH(Ras,Rasbonus!$A$1:$AJ$1,0),FALSE),\"0\")","v":"0"},null,null,-19,0,0,0,0,0,0,0,0,0,0,0,0,0,0,0,0,0,0,0,0,0]
["Gymnastic",{"$f":"HLOOKUP(Diverse!$G$2,'2nd'!$B$1:$CR$18,10,FALSE)","v":0},null,null,null,{"$f":"SUM(AL139:AL147)","v":0},null,null,{"$f":"SUM(AM139:AM147)","v":0},{"$f":"SUM(AN139:AN147)","v":0},0,0,0,0,0,0,0,0,0,0,0,0,0,0,0,0,0,0,"Rank","Skill","Stat",null,"Lvl","Race","Armor","Item","Total"]
["Acrobatics",{"$f":"VLOOKUP(A139,AllaSkills!$A$3:$BV$317,'Ny NPC'!$A$2+3,FALSE)","v":"3"},"3","3","Gymnastic",null,null,null,null,null,null,null,null,null,null,null,null,null,null,null,null,null,null,null,null,null,null,null,0,-25,{"$f":"(AG+QU)/2","v":0},{"$f":"HLOOKUP(Yrke,Levelbonus!$B$1:$CR$20,10,FALSE)","v":0},0,{"$f":"IF(ISNUMBER(VLOOKUP($A139,Rasbonus!$A$61:$AJ$295,MATCH(Ras,Rasbonus!$A$1:$AJ$1,0),FALSE)),VLOOKUP($A139,Rasbonus!$A$61:$AJ$295,MATCH(Ras,Rasbonus!$A$1:$AJ$1,0),FALSE),\"0\")","v":"0"},{"$f":"'Ny NPC'!$N$3","v":"0"},null,{"$f":"ROUND(AD139+AE139+AG139+AH139+AI139+AJ139,0)","v":-25},{"$f":"IF(F139>2,\"99\",IF(F139<1,0,IF(F139=1,$C139+$C139-$C139,IF(F139=2,$C139+$D139))))","v":0},{"$f":"IF(I139>2,\"99\",IF(I139<1,0,IF(I139=1,$C139+$C139-$C139,IF(I139=2,$C139+$D139))))","v":0},0,0,0,0,0,0,0,0,0,0,0,0,0,0,0,0,0,0,0]
["Calisthenics",{"$f":"VLOOKUP(A140,AllaSkills!$A$3:$BV$317,'Ny NPC'!$A$2+3,FALSE)","v":"20"},"20","20","Gymnastic",null,null,null,null,null,null,null,null,null,null,null,null,null,null,null,null,null,null,null,null,null,null,null,0,-25,null,null,0,{"$f":"IF(ISNUMBER(VLOOKUP($A140,Rasbonus!$A$61:$AJ$295,MATCH(Ras,Rasbonus!$A$1:$AJ$1,0),FALSE)),VLOOKUP($A140,Rasbonus!$A$61:$AJ$295,MATCH(Ras,Rasbonus!$A$1:$AJ$1,0),FALSE),\"0\")","v":"0"},null,null,-25,0,0,0,0,0,0,0,0,0,0,0,0,0,0,0,0,0,0,0,0,0]
["Contortions",{"$f":"VLOOKUP(A141,AllaSkills!$A$3:$BV$317,'Ny NPC'!$A$2+3,FALSE)","v":"5"},"5","5","Gymnastic",null,null,null,null,null,null,null,null,null,null,null,null,null,null,null,null,null,null,null,null,null,null,null,0,-25,{"$f":"(AG+SD)/2","v":5},{"$f":"HLOOKUP(Yrke,Levelbonus!$B$1:$CR$20,10,FALSE)","v":0},0,{"$f":"IF(ISNUMBER(VLOOKUP($A141,Rasbonus!$A$61:$AJ$295,MATCH(Ras,Rasbonus!$A$1:$AJ$1,0),FALSE)),VLOOKUP($A141,Rasbonus!$A$61:$AJ$295,MATCH(Ras,Rasbonus!$A$1:$AJ$1,0),FALSE),\"0\")","v":"0"},{"$f":"'Ny NPC'!$N$3","v":"0"},null,-20,0,0,0,0,0,0,0,0,0,0,0,0,0,0,0,0,0,0,0,0,0]
["Juggling",{"$f":"VLOOKUP(A142,AllaSkills!$A$3:$BV$317,'Ny NPC'!$A$2+3,FALSE)","v":"3"},"3","3","Gymnastic",null,null,null,null,null,null,null,null,null,null,null,null,null,null,null,null,null,null,null,null,null,null,null,0,-25,{"$f":"(AG+IN)/2","v":2.5},{"$f":"HLOOKUP(Yrke,Levelbonus!$B$1:$CR$20,10,FALSE)","v":0},0,{"$f":"IF(ISNUMBER(VLOOKUP($A142,Rasbonus!$A$61:$AJ$295,MATCH(Ras,Rasbonus!$A$1:$AJ$1,0),FALSE)),VLOOKUP($A142,Rasbonus!$A$61:$AJ$295,MATCH(Ras,Rasbonus!$A$1:$AJ$1,0),FALSE),\"0\")","v":"0"},{"$f":"'Ny NPC'!$N$3","v":"0"},null,-23,0,0,0,0,0,0,0,0,0,0,0,0,0,0,0,0,0,0,0,0,0]
["Jumping",{"$f":"VLOOKUP(A143,AllaSkills!$A$3:$BV$317,'Ny NPC'!$A$2+3,FALSE)","v":"4"},"4","4","Gymnastic",null,null,null,null,null,null,null,null,null,null,null,null,null,null,null,null,null,null,null,null,null,null,null,0,-25,{"$f":"(ST+AG)/2","v":7.5},{"$f":"HLOOKUP(Yrke,Levelbonus!$B$1:$CR$20,10,FALSE)","v":0},0,{"$f":"IF(ISNUMBER(VLOOKUP($A143,Rasbonus!$A$61:$AJ$295,MATCH(Ras,Rasbonus!$A$1:$AJ$1,0),FALSE)),VLOOKUP($A143,Rasbonus!$A$61:$AJ$295,MATCH(Ras,Rasbonus!$A$1:$AJ$1,0),FALSE),\"0\")","v":"0"},{"$f":"'Ny NPC'!$N$3","v":"0"},null,-18,0,0,0,0,0,0,0,0,0,0,0,0,0,0,0,0,0,0,0,0,0]
["Pole Vaulting",{"$f":"VLOOKUP(A144,AllaSkills!$A$3:$BV$317,'Ny NPC'!$A$2+3,FALSE)","v":"5"},"5","5","Gymnastic",null,null,null,null,null,null,null,null,null,null,null,null,null,null,null,null,null,null,null,null,null,null,null,0,-25,{"$f":"(ST+AG)/2","v":7.5},{"$f":"HLOOKUP(Yrke,Levelbonus!$B$1:$CR$20,10,FALSE)","v":0},0,{"$f":"IF(ISNUMBER(VLOOKUP($A144,Rasbonus!$A$61:$AJ$295,MATCH(Ras,Rasbonus!$A$1:$AJ$1,0),FALSE)),VLOOKUP($A144,Rasbonus!$A$61:$AJ$295,MATCH(Ras,Rasbonus!$A$1:$AJ$1,0),FALSE),\"0\")","v":"0"},{"$f":"'Ny NPC'!$N$3","v":"0"},null,-18,0,0,0,0,0,0,0,0,0,0,0,0,0,0,0,0,0,0,0,0,0]
["Stilt Walking",{"$f":"VLOOKUP(A145,AllaSkills!$A$3:$BV$317,'Ny NPC'!$A$2+3,FALSE)","v":"4"},"4","4","Gymnastic",null,null,null,null,null,null,null,null,null,null,null,null,null,null,null,null,null,null,null,null,null,null,null,0,-25,{"$f":"(ST+AG)/2","v":7.5},{"$f":"HLOOKUP(Yrke,Levelbonus!$B$1:$CR$20,10,FALSE)","v":0},0,{"$f":"IF(ISNUMBER(VLOOKUP($A145,Rasbonus!$A$61:$AJ$295,MATCH(Ras,Rasbonus!$A$1:$AJ$1,0),FALSE)),VLOOKUP($A145,Rasbonus!$A$61:$AJ$295,MATCH(Ras,Rasbonus!$A$1:$AJ$1,0),FALSE),\"0\")","v":"0"},{"$f":"'Ny NPC'!$N$3","v":"0"},null,-18,0,0,0,0,0,0,0,0,0,0,0,0,0,0,0,0,0,0,0,0,0]
["Tightrope Walking",{"$f":"VLOOKUP(A146,AllaSkills!$A$3:$BV$317,'Ny NPC'!$A$2+3,FALSE)","v":"3"},"3","3","Gymnastic",null,null,null,null,null,null,null,null,null,null,null,null,null,null,null,null,null,null,null,null,null,null,null,0,-25,{"$f":"(AG+SD)/2","v":5},{"$f":"HLOOKUP(Yrke,Levelbonus!$B$1:$CR$20,10,FALSE)","v":0},0,{"$f":"IF(ISNUMBER(VLOOKUP($A146,Rasbonus!$A$61:$AJ$295,MATCH(Ras,Rasbonus!$A$1:$AJ$1,0),FALSE)),VLOOKUP($A146,Rasbonus!$A$61:$AJ$295,MATCH(Ras,Rasbonus!$A$1:$AJ$1,0),FALSE),\"0\")","v":"0"},{"$f":"'Ny NPC'!$N$3","v":"0"},null,-20,0,0,0,0,0,0,0,0,0,0,0,0,0,0,0,0,0,0,0,0,0]
["Tumbling",{"$f":"VLOOKUP(A147,AllaSkills!$A$3:$BV$317,'Ny NPC'!$A$2+3,FALSE)","v":"3"},"3","3","Gymnastic",null,null,null,null,null,null,null,null,null,null,null,null,null,null,null,null,null,null,null,null,null,null,null,0,-25,{"$f":"(AG+QU)/2","v":0},{"$f":"HLOOKUP(Yrke,Levelbonus!$B$1:$CR$20,10,FALSE)","v":0},0,{"$f":"IF(ISNUMBER(VLOOKUP($A147,Rasbonus!$A$61:$AJ$295,MATCH(Ras,Rasbonus!$A$1:$AJ$1,0),FALSE)),VLOOKUP($A147,Rasbonus!$A$61:$AJ$295,MATCH(Ras,Rasbonus!$A$1:$AJ$1,0),FALSE),\"0\")","v":"0"},{"$f":"'Ny NPC'!$N$3","v":"0"},null,-25,0,0,0,0,0,0,0,0,0,0,0,0,0,0,0,0,0,0,0,0,0]
["Linguistic",{"$f":"HLOOKUP(Diverse!$G$2,'2nd'!$B$1:$CR$18,11,FALSE)","v":3},null,null,null,{"$f":"SUM(AL149:AL161)","v":0},null,null,{"$f":"SUM(AM149:AM161)","v":0},{"$f":"SUM(AN149:AN161)","v":0},0,0,0,0,0,0,0,0,0,0,0,0,0,0,0,0,0,0,"Rank","Skill","Stat",null,"Lvl","Race","Armor","Item","Total"]
["Language",{"$f":"VLOOKUP(A149,AllaSkills!$A$3:$BV$317,'Ny NPC'!$A$2+3,FALSE)","v":"1/*"},"1","1","Linguistic",null,null,null,null,null,null,null,null,null,null,null,null,null,null,null,null,null,null,null,null,null,null,null,0,-25,null,{"$f":"HLOOKUP(Yrke,Levelbonus!$B$1:$CR$20,11,FALSE)","v":0},0,{"$f":"IF(ISNUMBER(VLOOKUP($A149,Rasbonus!$A$61:$AJ$295,MATCH(Ras,Rasbonus!$A$1:$AJ$1,0),FALSE)),VLOOKUP($A149,Rasbonus!$A$61:$AJ$295,MATCH(Ras,Rasbonus!$A$1:$AJ$1,0),FALSE),\"0\")","v":"0"},null,null,-25,{"$f":"IF(F149>2,\"99\",IF(F149<1,0,IF(F149=1,$C149+$C149-$C149,IF(F149=2,$C149+$D149))))","v":0},{"$f":"IF(I149>2,\"99\",IF(I149<1,0,IF(I149=1,$C149+$C149-$C149,IF(I149=2,$C149+$D149))))","v":0},0,0,0,0,0,0,0,0,0,0,0,0,0,0,0,0,0,0,0]
[null,null,null,null,null,null,null,null,null,null,null,null,null,null,null,null,null,null,null,null,null,null,null,null,null,null,null,null,null,null,null,null,null,null,null,null,null,0,0,0,0,0,0,0,0,0,0,0,0,0,0,0,0,0,0,0,0,0]
["Lip Reading",{"$f":"VLOOKUP(A151,AllaSkills!$A$3:$BV$317,'Ny NPC'!$A$2+3,FALSE)","v":"3/5"},"3","5","Linguistic",null,null,null,null,null,null,null,null,null,null,null,null,null,null,null,null,null,null,null,null,null,null,null,0,-25,{"$f":"(IN+RE)/2","v":5},{"$f":"HLOOKUP(Yrke,Levelbonus!$B$1:$CR$20,11,FALSE)","v":0},0,{"$f":"IF(ISNUMBER(VLOOKUP($A151,Rasbonus!$A$61:$AJ$295,MATCH(Ras,Rasbonus!$A$1:$AJ$1,0),FALSE)),VLOOKUP($A151,Rasbonus!$A$61:$AJ$295,MATCH(Ras,Rasbonus!$A$1:$AJ$1,0),FALSE),\"0\")","v":"0"},null,null,-20,0,0,0,0,0,0,0,0,0,0,0,0,0,0,0,0,0,0,0,0,0]
["Mimicry",{"$f":"VLOOKUP(A152,AllaSkills!$A$3:$BV$317,'Ny NPC'!$A$2+3,FALSE)","v":"2/6"},"2","6","Linguistic",null,null,null,null,null,null,null,null,null,null,null,null,null,null,null,null,null,null,null,null,null,null,null,0,-25,{"$f":"(IN+SD)/2","v":7.5},{"$f":"HLOOKUP(Yrke,Levelbonus!$B$1:$CR$20,11,FALSE)","v":0},0,{"$f":"IF(ISNUMBER(VLOOKUP($A152,Rasbonus!$A$61:$AJ$295,MATCH(Ras,Rasbonus!$A$1:$AJ$1,0),FALSE)),VLOOKUP($A152,Rasbonus!$A$61:$AJ$295,MATCH(Ras,Rasbonus!$A$1:$AJ$1,0),FALSE),\"0\")","v":"0"},null,null,-18,0,0,0,0,0,0,0,0,0,0,0,0,0,0,0,0,0,0,0,0,0]
["Music",{"$f":"VLOOKUP(A153,AllaSkills!$A$3:$BV$317,'Ny NPC'!$A$2+3,FALSE)","v":"2/6"},"2","6","Linguistic",null,null,null,null,null,null,null,null,null,null,null,null,null,null,null,null,null,null,null,null,null,null,null,0,-25,{"$f":"(AG+EM)/2","v":0},{"$f":"HLOOKUP(Yrke,Levelbonus!$B$1:$CR$20,11,FALSE)","v":0},0,{"$f":"IF(ISNUMBER(VLOOKUP($A153,Rasbonus!$A$61:$AJ$295,MATCH(Ras,Rasbonus!$A$1:$AJ$1,0),FALSE)),VLOOKUP($A153,Rasbonus!$A$61:$AJ$295,MATCH(Ras,Rasbonus!$A$1:$AJ$1,0),FALSE),\"0\")","v":"0"},null,null,-25,0,0,0,0,0,0,0,0,0,0,0,0,0,0,0,0,0,0,0,0,0]
["Poetic Improvisation",{"$f":"VLOOKUP(A154,AllaSkills!$A$3:$BV$317,'Ny NPC'!$A$2+3,FALSE)","v":"2/6"},"2","6","Linguistic",null,null,null,null,null,null,null,null,null,null,null,null,null,null,null,null,null,null,null,null,null,null,null,0,-25,{"$f":"(IN+RE)/2","v":5},{"$f":"HLOOKUP(Yrke,Levelbonus!$B$1:$CR$20,11,FALSE)","v":0},0,{"$f":"IF(ISNUMBER(VLOOKUP($A154,Rasbonus!$A$61:$AJ$295,MATCH(Ras,Rasbonus!$A$1:$AJ$1,0),FALSE)),VLOOKUP($A154,Rasbonus!$A$61:$AJ$295,MATCH(Ras,Rasbonus!$A$1:$AJ$1,0),FALSE),\"0\")","v":"0"},null,null,-20,0,0,0,0,0,0,0,0,0,0,0,0,0,0,0,0,0,0,0,0,0]
["Propaganda",{"$f":"VLOOKUP(A155,AllaSkills!$A$3:$BV$317,'Ny NPC'!$A$2+3,FALSE)","v":"3/5"},"3","5","Linguistic",null,null,null,null,null,null,null,null,null,null,null,null,null,null,null,null,null,null,null,null,null,null,null,0,-25,{"$f":"(IN+EM)/2","v":2.5},{"$f":"HLOOKUP(Yrke,Levelbonus!$B$1:$CR$20,11,FALSE)","v":0},0,{"$f":"IF(ISNUMBER(VLOOKUP($A155,Rasbonus!$A$61:$AJ$295,MATCH(Ras,Rasbonus!$A$1:$AJ$1,0),FALSE)),VLOOKUP($A155,Rasbonus!$A$61:$AJ$295,MATCH(Ras,Rasbonus!$A$1:$AJ$1,0),FALSE),\"0\")","v":"0"},null,null,-23,0,0,0,0,0,0,0,0,0,0,0,0,0,0,0,0,0,0,0,0,0]
["Public Speaking",{"$f":"VLOOKUP(A156,AllaSkills!$A$3:$BV$317,'Ny NPC'!$A$2+3,FALSE)","v":"3/5"},"3","5","Linguistic",null,null,null,null,null,null,null,null,null,null,null,null,null,null,null,null,null,null,null,null,null,null,null,0,-25,{"$f":"AVERAGE(EM,PR)","v":0},{"$f":"HLOOKUP(Yrke,Levelbonus!$B$1:$CR$20,11,FALSE)","v":0},0,{"$f":"IF(ISNUMBER(VLOOKUP($A156,Rasbonus!$A$61:$AJ$295,MATCH(Ras,Rasbonus!$A$1:$AJ$1,0),FALSE)),VLOOKUP($A156,Rasbonus!$A$61:$AJ$295,MATCH(Ras,Rasbonus!$A$1:$AJ$1,0),FALSE),\"0\")","v":"0"},null,null,-25,0,0,0,0,0,0,0,0,0,0,0,0,0,0,0,0,0,0,0,0,0]
["Signaling",{"$f":"VLOOKUP(A157,AllaSkills!$A$3:$BV$317,'Ny NPC'!$A$2+3,FALSE)","v":"1/5"},"1","5","Linguistic",null,null,null,null,null,null,null,null,null,null,null,null,null,null,null,null,null,null,null,null,null,null,null,0,-25,{"$f":"(RE+SD)/2","v":7.5},{"$f":"HLOOKUP(Yrke,Levelbonus!$B$1:$CR$20,11,FALSE)","v":0},0,{"$f":"IF(ISNUMBER(VLOOKUP($A157,Rasbonus!$A$61:$AJ$295,MATCH(Ras,Rasbonus!$A$1:$AJ$1,0),FALSE)),VLOOKUP($A157,Rasbonus!$A$61:$AJ$295,MATCH(Ras,Rasbonus!$A$1:$AJ$1,0),FALSE),\"0\")","v":"0"},null,null,-18,0,0,0,0,0,0,0,0,0,0,0,0,0,0,0,0,0,0,0,0,0]
["Singing",{"$f":"VLOOKUP(A158,AllaSkills!$A$3:$BV$317,'Ny NPC'!$A$2+3,FALSE)","v":"2/6"},"2","6","Linguistic",null,null,null,null,null,null,null,null,null,null,null,null,null,null,null,null,null,null,null,null,null,null,null,0,-25,{"$f":"(PR+IN)/2","v":2.5},{"$f":"HLOOKUP(Yrke,Levelbonus!$B$1:$CR$20,11,FALSE)","v":0},0,{"$f":"IF(ISNUMBER(VLOOKUP($A158,Rasbonus!$A$61:$AJ$295,MATCH(Ras,Rasbonus!$A$1:$AJ$1,0),FALSE)),VLOOKUP($A158,Rasbonus!$A$61:$AJ$295,MATCH(Ras,Rasbonus!$A$1:$AJ$1,0),FALSE),\"0\")","v":"0"},null,null,-23,0,0,0,0,0,0,0,0,0,0,0,0,0,0,0,0,0,0,0,0,0]
["Tale Telling",{"$f":"VLOOKUP(A159,AllaSkills!$A$3:$BV$317,'Ny NPC'!$A$2+3,FALSE)","v":"2/6"},"2","6","Linguistic",null,null,null,null,null,null,null,null,null,null,null,null,null,null,null,null,null,null,null,null,null,null,null,0,-25,{"$f":"PR","v":0},{"$f":"HLOOKUP(Yrke,Levelbonus!$B$1:$CR$20,11,FALSE)","v":0},0,{"$f":"IF(ISNUMBER(VLOOKUP($A159,Rasbonus!$A$61:$AJ$295,MATCH(Ras,Rasbonus!$A$1:$AJ$1,0),FALSE)),VLOOKUP($A159,Rasbonus!$A$61:$AJ$295,MATCH(Ras,Rasbonus!$A$1:$AJ$1,0),FALSE),\"0\")","v":"0"},null,null,-25,0,0,0,0,0,0,0,0,0,0,0,0,0,0,0,0,0,0,0,0,0]
["Trading",{"$f":"VLOOKUP(A160,AllaSkills!$A$3:$BV$317,'Ny NPC'!$A$2+3,FALSE)","v":"3/5"},"3","5","Linguistic",null,null,null,null,null,null,null,null,null,null,null,null,null,null,null,null,null,null,null,null,null,null,null,0,-25,{"$f":"(RE)","v":5},{"$f":"HLOOKUP(Yrke,Levelbonus!$B$1:$CR$20,11,FALSE)","v":0},0,{"$f":"IF(ISNUMBER(VLOOKUP($A160,Rasbonus!$A$61:$AJ$295,MATCH(Ras,Rasbonus!$A$1:$AJ$1,0),FALSE)),VLOOKUP($A160,Rasbonus!$A$61:$AJ$295,MATCH(Ras,Rasbonus!$A$1:$AJ$1,0),FALSE),\"0\")","v":"0"},null,null,-20,0,0,0,0,0,0,0,0,0,0,0,0,0,0,0,0,0,0,0,0,0]
["Ventriloquism",{"$f":"VLOOKUP(A161,AllaSkills!$A$3:$BV$317,'Ny NPC'!$A$2+3,FALSE)","v":"3/6"},"3","6","Linguistic",null,null,null,null,null,null,null,null,null,null,null,null,null,null,null,null,null,null,null,null,null,null,null,0,-25,{"$f":"(SD+IN)/2","v":7.5},{"$f":"HLOOKUP(Yrke,Levelbonus!$B$1:$CR$20,11,FALSE)","v":0},0,{"$f":"IF(ISNUMBER(VLOOKUP($A161,Rasbonus!$A$61:$AJ$295,MATCH(Ras,Rasbonus!$A$1:$AJ$1,0),FALSE)),VLOOKUP($A161,Rasbonus!$A$61:$AJ$295,MATCH(Ras,Rasbonus!$A$1:$AJ$1,0),FALSE),\"0\")","v":"0"},null,null,-18,0,0,0,0,0,0,0,0,0,0,0,0,0,0,0,0,0,0,0,0,0]
["Magical",{"$f":"HLOOKUP(Diverse!$G$2,'2nd'!$B$1:$CR$18,12,FALSE)","v":26},null,null,null,{"$f":"SUM(AL163:AL181)","v":0},null,null,{"$f":"SUM(AM163:AM181)","v":0},{"$f":"SUM(AN163:AN181)","v":0},0,0,0,0,0,0,0,0,0,0,0,0,0,0,0,0,0,0,"Rank","Skill","Stat",null,"Lvl","Race","Armor","Item","Total"]
["Circle Lore",{"$f":"VLOOKUP(A163,AllaSkills!$A$3:$BV$317,'Ny NPC'!$A$2+3,FALSE)","v":"2/4"},"2","4","Magical",null,null,null,null,null,null,null,null,null,null,null,null,null,null,null,null,null,null,null,null,null,null,null,0,-25,{"$f":"RE","v":5},{"$f":"HLOOKUP(Yrke,Levelbonus!$B$1:$CR$20,12,FALSE)","v":3},9,{"$f":"IF(ISNUMBER(VLOOKUP($A163,Rasbonus!$A$61:$AJ$295,MATCH(Ras,Rasbonus!$A$1:$AJ$1,0),FALSE)),VLOOKUP($A163,Rasbonus!$A$61:$AJ$295,MATCH(Ras,Rasbonus!$A$1:$AJ$1,0),FALSE),\"0\")","v":"0"},null,null,-11,{"$f":"IF(F163>2,\"99\",IF(F163<1,0,IF(F163=1,$C163+$C163-$C163,IF(F163=2,$C163+$D163))))","v":0},{"$f":"IF(I163>2,\"99\",IF(I163<1,0,IF(I163=1,$C163+$C163-$C163,IF(I163=2,$C163+$D163))))","v":0},0,0,0,0,0,0,0,0,0,0,0,0,0,0,0,0,0,0,0]
[null,null,null,null,null,null,null,null,null,null,null,null,null,null,null,null,null,null,null,null,null,null,null,null,null,null,null,null,null,null,null,null,null,null,null,null,null,0,0,0,0,0,0,0,0,0,0,0,0,0,0,0,0,0,0,0,0,0]
["Divination",{"$f":"VLOOKUP(A165,AllaSkills!$A$3:$BV$317,'Ny NPC'!$A$2+3,FALSE)","v":"2/4"},"2","4","Magical",null,null,null,null,null,null,null,null,null,null,null,null,null,null,null,null,null,null,null,null,null,null,null,0,-25,{"$f":"(IN+EM)/2","v":2.5},{"$f":"HLOOKUP(Yrke,Levelbonus!$B$1:$CR$20,12,FALSE)","v":3},9,{"$f":"IF(ISNUMBER(VLOOKUP($A165,Rasbonus!$A$61:$AJ$295,MATCH(Ras,Rasbonus!$A$1:$AJ$1,0),FALSE)),VLOOKUP($A165,Rasbonus!$A$61:$AJ$295,MATCH(Ras,Rasbonus!$A$1:$AJ$1,0),FALSE),\"0\")","v":"0"},null,null,{"$f":"ROUND(AD165+AE165+AG165+AH165+AI165+AJ165,0)","v":-14},0,0,0,0,0,0,0,0,0,0,0,0,0,0,0,0,0,0,0,0,0]
["Magical Rituals",{"$f":"VLOOKUP(A166,AllaSkills!$A$3:$BV$317,'Ny NPC'!$A$2+3,FALSE)","v":"1/4"},"1","4","Magical",null,null,null,null,null,null,null,null,null,null,null,null,null,null,null,null,null,null,null,null,null,null,null,0,-25,{"$f":"(IN+RE)/2","v":5},{"$f":"HLOOKUP(Yrke,Levelbonus!$B$1:$CR$20,12,FALSE)","v":3},9,{"$f":"IF(ISNUMBER(VLOOKUP($A166,Rasbonus!$A$61:$AJ$295,MATCH(Ras,Rasbonus!$A$1:$AJ$1,0),FALSE)),VLOOKUP($A166,Rasbonus!$A$61:$AJ$295,MATCH(Ras,Rasbonus!$A$1:$AJ$1,0),FALSE),\"0\")","v":"0"},null,null,-11,0,0,0,0,0,0,0,0,0,0,0,0,0,0,0,0,0,0,0,0,0]
["Magnitude",{"$f":"VLOOKUP(A167,AllaSkills!$A$3:$BV$317,'Ny NPC'!$A$2+3,FALSE)","v":"3/8"},"3",{"$f":"IF(RIGHT(B167,1)=\"*\",LEFT(B167,1),IF(LEN(B167)=3,RIGHT(B167,1),IF(LEN(B167)<3,B167,RIGHT(B167,2))))","v":"8"},"Magical",null,null,null,null,null,null,null,null,null,null,null,null,null,null,null,null,null,null,null,null,null,null,null,{"$f":"SUM(F167:AB167)","v":0},-25,{"$f":"(EM+IN)/2","v":2.5},{"$f":"HLOOKUP(Yrke,Levelbonus!$B$1:$CR$20,12,FALSE)","v":3},9,{"$f":"IF(ISNUMBER(VLOOKUP($A167,Rasbonus!$A$61:$AJ$295,MATCH(Ras,Rasbonus!$A$1:$AJ$1,0),FALSE)),VLOOKUP($A167,Rasbonus!$A$61:$AJ$295,MATCH(Ras,Rasbonus!$A$1:$AJ$1,0),FALSE),\"0\")","v":"0"},null,null,-14,0,0,0,0,0,0,0,0,0,0,0,0,0,0,0,0,0,0,0,0,0]
["Overcasting",{"$f":"VLOOKUP(A168,AllaSkills!$A$3:$BV$317,'Ny NPC'!$A$2+3,FALSE)","v":"2/5"},"2",{"$f":"IF(RIGHT(B168,1)=\"*\",LEFT(B168,1),IF(LEN(B168)=3,RIGHT(B168,1),IF(LEN(B168)<3,B168,RIGHT(B168,2))))","v":"5"},"Magical",null,null,null,null,null,null,null,null,null,null,null,null,null,null,null,null,null,null,null,null,null,null,null,{"$f":"SUM(F168:AB168)","v":0},-25,{"$f":"IF('Ny NPC'!U45=1,IN,IF('Ny NPC'!U45=2,EM,IF('Ny NPC'!U45=3,PR,IF('Ny NPC'!U45=4,(EM+IN)*0.5,IF('Ny NPC'!U45=5,(PR+IN)*0.5,IF('Ny NPC'!U45=6,(EM+PR)*0.5,(EM+IN+PR)*0.33))))))","v":5},{"$f":"HLOOKUP(Yrke,Levelbonus!$B$1:$CR$20,12,FALSE)","v":3},9,{"$f":"IF(ISNUMBER(VLOOKUP($A168,Rasbonus!$A$61:$AJ$295,MATCH(Ras,Rasbonus!$A$1:$AJ$1,0),FALSE)),VLOOKUP($A168,Rasbonus!$A$61:$AJ$295,MATCH(Ras,Rasbonus!$A$1:$AJ$1,0),FALSE),\"0\")","v":"0"},null,null,-11,0,0,0,0,0,0,0,0,0,0,0,0,0,0,0,0,0,0,0,0,0]
["Power Manipulation",{"$f":"VLOOKUP(A169,AllaSkills!$A$3:$BV$317,'Ny NPC'!$A$2+3,FALSE)","v":"3/6"},"3","6","Magical",null,null,null,null,null,null,null,null,null,null,null,null,null,null,null,null,null,null,null,null,null,null,null,0,null,null,null,null,null,null,null,null,{"$f":"IF(F169>2,\"99\",IF(F169<1,0,IF(F169=1,$C169+$C169-$C169,IF(F169=2,$C169+$D169))))","v":0},{"$f":"IF(I169>2,\"99\",IF(I169<1,0,IF(I169=1,$C169+$C169-$C169,IF(I169=2,$C169+$D169))))","v":0},{"$f":"IF(J169>2,\"99\",IF(J169<1,0,IF(J169=1,$C169+$C169-$C169,IF(J169=2,$C169+$D169))))","v":0},{"$f":"IF(K169>2,\"99\",IF(K169<1,0,IF(K169=1,$C169+$C169-$C169,IF(K169=2,$C169+$D169))))","v":0},{"$f":"IF(L169>2,\"99\",IF(L169<1,0,IF(L169=1,$C169+$C169-$C169,IF(L169=2,$C169+$D169))))","v":0},{"$f":"IF(M169>2,\"99\",IF(M169<1,0,IF(M169=1,$C169+$C169-$C169,IF(M169=2,$C169+$D169))))","v":0},{"$f":"IF(N169>2,\"99\",IF(N169<1,0,IF(N169=1,$C169+$C169-$C169,IF(N169=2,$C169+$D169))))","v":0},{"$f":"IF(O169>2,\"99\",IF(O169<1,0,IF(O169=1,$C169+$C169-$C169,IF(O169=2,$C169+$D169))))","v":0},{"$f":"IF(P169>2,\"99\",IF(P169<1,0,IF(P169=1,$C169+$C169-$C169,IF(P169=2,$C169+$D169))))","v":0},{"$f":"IF(Q169>2,\"99\",IF(Q169<1,0,IF(Q169=1,$C169+$C169-$C169,IF(Q169=2,$C169+$D169))))","v":0},{"$f":"IF(R169>2,\"99\",IF(R169<1,0,IF(R169=1,$C169+$C169-$C169,IF(R169=2,$C169+$D169))))","v":0},{"$f":"IF(S169>2,\"99\",IF(S169<1,0,IF(S169=1,$C169+$C169-$C169,IF(S169=2,$C169+$D169))))","v":0},{"$f":"IF(T169>2,\"99\",IF(T169<1,0,IF(T169=1,$C169+$C169-$C169,IF(T169=2,$C169+$D169))))","v":0},{"$f":"IF(U169>2,\"99\",IF(U169<1,0,IF(U169=1,$C169+$C169-$C169,IF(U169=2,$C169+$D169))))","v":0},{"$f":"IF(V169>2,\"99\",IF(V169<1,0,IF(V169=1,$C169+$C169-$C169,IF(V169=2,$C169+$D169))))","v":0},{"$f":"IF(W169>2,\"99\",IF(W169<1,0,IF(W169=1,$C169+$C169-$C169,IF(W169=2,$C169+$D169))))","v":0},{"$f":"IF(X169>2,\"99\",IF(X169<1,0,IF(X169=1,$C169+$C169-$C169,IF(X169=2,$C169+$D169))))","v":0},{"$f":"IF(Y169>2,\"99\",IF(Y169<1,0,IF(Y169=1,$C169+$C169-$C169,IF(Y169=2,$C169+$D169))))","v":0},{"$f":"IF(Z169>2,\"99\",IF(Z169<1,0,IF(Z169=1,$C169+$C169-$C169,IF(Z169=2,$C169+$D169))))","v":0},{"$f":"IF(AA169>2,\"99\",IF(AA169<1,0,IF(AA169=1,$C169+$C169-$C169,IF(AA169=2,$C169+$D169))))","v":0},{"$f":"IF(AB169>2,\"99\",IF(AB169<1,0,IF(AB169=1,$C169+$C169-$C169,IF(AB169=2,$C169+$D169))))","v":0}]
["Power Perception",{"$f":"VLOOKUP(A170,AllaSkills!$A$3:$BV$317,'Ny NPC'!$A$2+3,FALSE)","v":"1/3"},"1","3","Magical",null,null,null,null,null,null,null,null,null,null,null,null,null,null,null,null,null,null,null,null,null,null,null,0,-25,{"$f":"EM","v":0},{"$f":"HLOOKUP(Yrke,Levelbonus!$B$1:$CR$20,12,FALSE)","v":3},9,{"$f":"IF(ISNUMBER(VLOOKUP($A170,Rasbonus!$A$61:$AJ$295,MATCH(Ras,Rasbonus!$A$1:$AJ$1,0),FALSE)),VLOOKUP($A170,Rasbonus!$A$61:$AJ$295,MATCH(Ras,Rasbonus!$A$1:$AJ$1,0),FALSE),\"0\")","v":"0"},null,null,-16,0,0,0,0,0,0,0,0,0,0,0,0,0,0,0,0,0,0,0,0,0]
["PP Development",{"$f":"VLOOKUP(A171,AllaSkills!$A$3:$BV$317,'Ny NPC'!$A$2+3,FALSE)","v":"2/5"},"2","5","Magical",null,null,null,null,null,null,null,null,null,null,null,null,null,null,null,null,null,null,null,null,null,null,null,0,{"$f":"(AC171)*3","v":0},{"$f":"IF('Ny NPC'!U45=1,IN/2,IF('Ny NPC'!U45=2,EM/2,IF('Ny NPC'!U45=3,PR/2,IF('Ny NPC'!U45=4,(EM+IN)*0.25,IF('Ny NPC'!U45=5,(PR+IN)*0.25,IF('Ny NPC'!U45=6,(EM+PR)*0.25,(EM+IN+PR)/6))))))","v":2.5},{"$f":"HLOOKUP(Yrke,Levelbonus!$B$1:$CR$20,18,FALSE)","v":2},6,{"$f":"IF(ISNUMBER(VLOOKUP($A171,Rasbonus!$A$61:$AJ$295,MATCH(Ras,Rasbonus!$A$1:$AJ$1,0),FALSE)),VLOOKUP($A171,Rasbonus!$A$61:$AJ$295,MATCH(Ras,Rasbonus!$A$1:$AJ$1,0),FALSE),\"0\")","v":"0"},null,null,9,0,0,0,0,0,0,0,0,0,0,0,0,0,0,0,0,0,0,0,0,0]
["Power Projection",{"$f":"VLOOKUP(A172,AllaSkills!$A$3:$BV$317,'Ny NPC'!$A$2+3,FALSE)","v":"1/4"},"1","4","Magical",null,null,null,null,null,null,null,null,null,null,null,null,null,null,null,null,null,null,null,null,null,null,null,0,-25,{"$f":"EM","v":0},{"$f":"HLOOKUP(Yrke,Levelbonus!$B$1:$CR$20,12,FALSE)","v":3},9,{"$f":"IF(ISNUMBER(VLOOKUP($A172,Rasbonus!$A$61:$AJ$295,MATCH(Ras,Rasbonus!$A$1:$AJ$1,0),FALSE)),VLOOKUP($A172,Rasbonus!$A$61:$AJ$295,MATCH(Ras,Rasbonus!$A$1:$AJ$1,0),FALSE),\"0\")","v":"0"},null,null,-16,0,0,0,0,0,0,0,0,0,0,0,0,0,0,0,0,0,0,0,0,0]
["Rejuvenation",{"$f":"VLOOKUP(A173,AllaSkills!$A$3:$BV$317,'Ny NPC'!$A$2+3,FALSE)","v":"2/5"},"2",{"$f":"IF(RIGHT(B173,1)=\"*\",LEFT(B173,1),IF(LEN(B173)=3,RIGHT(B173,1),IF(LEN(B173)<3,B173,RIGHT(B173,2))))","v":"5"},"Magical",null,null,null,null,null,null,null,null,null,null,null,null,null,null,null,null,null,null,null,null,null,null,null,{"$f":"SUM(F173:AB173)","v":0},-25,{"$f":"SD","v":10},{"$f":"HLOOKUP(Yrke,Levelbonus!$B$1:$CR$20,12,FALSE)","v":3},9,{"$f":"IF(ISNUMBER(VLOOKUP($A173,Rasbonus!$A$61:$AJ$295,MATCH(Ras,Rasbonus!$A$1:$AJ$1,0),FALSE)),VLOOKUP($A173,Rasbonus!$A$61:$AJ$295,MATCH(Ras,Rasbonus!$A$1:$AJ$1,0),FALSE),\"0\")","v":"0"},null,null,-6,0,0,0,0,0,0,0,0,0,0,0,0,0,0,0,0,0,0,0,0,0]
["Scrying",{"$f":"VLOOKUP(A174,AllaSkills!$A$3:$BV$317,'Ny NPC'!$A$2+3,FALSE)","v":"2/4"},"2",{"$f":"IF(RIGHT(B174,1)=\"*\",LEFT(B174,1),IF(LEN(B174)=3,RIGHT(B174,1),IF(LEN(B174)<3,B174,RIGHT(B174,2))))","v":"4"},"Magical",null,null,null,null,null,null,null,null,null,null,null,null,null,null,null,null,null,null,null,null,null,null,null,{"$f":"SUM(F174:AB174)","v":0},-25,{"$f":"(IN+PR)/2","v":2.5},{"$f":"HLOOKUP(Yrke,Levelbonus!$B$1:$CR$20,12,FALSE)","v":3},9,{"$f":"IF(ISNUMBER(VLOOKUP($A174,Rasbonus!$A$61:$AJ$295,MATCH(Ras,Rasbonus!$A$1:$AJ$1,0),FALSE)),VLOOKUP($A174,Rasbonus!$A$61:$AJ$295,MATCH(Ras,Rasbonus!$A$1:$AJ$1,0),FALSE),\"0\")","v":"0"},null,null,-14,0,0,0,0,0,0,0,0,0,0,0,0,0,0,0,0,0,0,0,0,0]
["Spell Artistery",{"$f":"VLOOKUP(A175,AllaSkills!$A$3:$BV$317,'Ny NPC'!$A$2+3,FALSE)","v":"1/3"},"1","3","Magical",null,null,null,null,null,null,null,null,null,null,null,null,null,null,null,null,null,null,null,null,null,null,null,0,-25,{"$f":"(EM+IN)/2","v":2.5},{"$f":"HLOOKUP(Yrke,Levelbonus!$B$1:$CR$20,12,FALSE)","v":3},9,{"$f":"IF(ISNUMBER(VLOOKUP($A175,Rasbonus!$A$61:$AJ$295,MATCH(Ras,Rasbonus!$A$1:$AJ$1,0),FALSE)),VLOOKUP($A175,Rasbonus!$A$61:$AJ$295,MATCH(Ras,Rasbonus!$A$1:$AJ$1,0),FALSE),\"0\")","v":"0"},null,null,-14,0,0,0,0,0,0,0,0,0,0,0,0,0,0,0,0,0,0,0,0,0]
["Spell Mastery",{"$f":"VLOOKUP(A176,AllaSkills!$A$3:$BV$317,'Ny NPC'!$A$2+3,FALSE)","v":"2/7"},"2","7","Magical",null,null,null,null,null,null,null,null,null,null,null,null,null,null,null,null,null,null,null,null,null,null,null,0,-25,{"$f":"(EM+PR)/2","v":0},{"$f":"HLOOKUP(Yrke,Levelbonus!$B$1:$CR$20,12,FALSE)","v":3},{"$f":"AF176*Level","v":9},{"$f":"IF(ISNUMBER(VLOOKUP($A176,Rasbonus!$A$61:$AJ$295,MATCH(Ras,Rasbonus!$A$1:$AJ$1,0),FALSE)),VLOOKUP($A176,Rasbonus!$A$61:$AJ$295,MATCH(Ras,Rasbonus!$A$1:$AJ$1,0),FALSE),\"0\")","v":"0"},null,null,-16,0,0,0,0,0,0,0,0,0,0,0,0,0,0,0,0,0,0,0,0,0]
["Summoning",{"$f":"VLOOKUP(A177,AllaSkills!$A$3:$BV$317,'Ny NPC'!$A$2+3,FALSE)","v":"2/4"},{"$f":"IF(LEN(B177)=3,LEFT(B177,1),IF(LEN(B177)<3,B177,99))","v":"2"},{"$f":"IF(RIGHT(B177,1)=\"*\",LEFT(B177,1),IF(LEN(B177)=3,RIGHT(B177,1),IF(LEN(B177)<3,B177,RIGHT(B177,2))))","v":"4"},"Magical",null,null,null,null,null,null,null,null,null,null,null,null,null,null,null,null,null,null,null,null,null,null,null,{"$f":"SUM(F177:AB177)","v":0},{"$f":"IF(AC177<1,-25,IF(AC177>30,80+((AC177-30)*0.5),IF(AC177>20,70+(AC177-20),IF(AC177>10,50+((AC177-10)*2),AC177*5))))","v":-25},{"$f":"(EM+RE)/2","v":2.5},{"$f":"HLOOKUP(Yrke,Levelbonus!$B$1:$CR$20,12,FALSE)","v":3},9,{"$f":"IF(ISNUMBER(VLOOKUP($A177,Rasbonus!$A$61:$AJ$295,MATCH(Ras,Rasbonus!$A$1:$AJ$1,0),FALSE)),VLOOKUP($A177,Rasbonus!$A$61:$AJ$295,MATCH(Ras,Rasbonus!$A$1:$AJ$1,0),FALSE),\"0\")","v":"0"},null,null,-14,0,0,0,0,0,0,0,0,0,0,0,0,0,0,0,0,0,0,0,0,0]
["Symbol Lore",{"$f":"VLOOKUP(A178,AllaSkills!$A$3:$BV$317,'Ny NPC'!$A$2+3,FALSE)","v":"1/4"},"1","4","Magical",null,null,null,null,null,null,null,null,null,null,null,null,null,null,null,null,null,null,null,null,null,null,null,0,-25,{"$f":"RE","v":5},{"$f":"HLOOKUP(Yrke,Levelbonus!$B$1:$CR$20,12,FALSE)","v":3},9,{"$f":"IF(ISNUMBER(VLOOKUP($A178,Rasbonus!$A$61:$AJ$295,MATCH(Ras,Rasbonus!$A$1:$AJ$1,0),FALSE)),VLOOKUP($A178,Rasbonus!$A$61:$AJ$295,MATCH(Ras,Rasbonus!$A$1:$AJ$1,0),FALSE),\"0\")","v":"0"},null,null,-11,0,0,0,0,0,0,0,0,0,0,0,0,0,0,0,0,0,0,0,0,0]
["Targeting Skill",{"$f":"VLOOKUP(A179,AllaSkills!$A$3:$BV$317,'Ny NPC'!$A$2+3,FALSE)","v":"2/5"},"2","5","Magical",null,null,null,null,null,null,null,null,null,null,null,null,null,null,null,null,null,null,null,null,null,null,null,0,-25,{"$f":"IN","v":5},{"$f":"HLOOKUP(Yrke,Levelbonus!$B$1:$CR$20,12,FALSE)","v":3},9,{"$f":"IF(ISNUMBER(VLOOKUP($A179,Rasbonus!$A$61:$AJ$295,MATCH(Ras,Rasbonus!$A$1:$AJ$1,0),FALSE)),VLOOKUP($A179,Rasbonus!$A$61:$AJ$295,MATCH(Ras,Rasbonus!$A$1:$AJ$1,0),FALSE),\"0\")","v":"0"},null,null,-11,0,0,0,0,0,0,0,0,0,0,0,0,0,0,0,0,0,0,0,0,0]
["Transcend Armor",{"$f":"VLOOKUP(A180,AllaSkills!$A$3:$BV$317,'Ny NPC'!$A$2+3,FALSE)","v":"4"},"4","4","Magical",null,null,null,null,null,null,null,null,null,null,null,null,null,null,null,null,null,null,null,null,null,null,null,0,-25,{"$f":"IF('Ny NPC'!U45=1,IN,IF('Ny NPC'!U45=2,EM,IF('Ny NPC'!U45=3,PR,IF('Ny NPC'!U45=4,(EM+IN)*0.5,IF('Ny NPC'!U45=5,(PR+IN)*0.5,IF('Ny NPC'!U45=6,(EM+PR)*0.5,(EM+IN+PR)*0.33))))))","v":5},{"$f":"HLOOKUP(Yrke,Levelbonus!$B$1:$CR$20,12,FALSE)","v":3},9,{"$f":"IF(ISNUMBER(VLOOKUP($A180,Rasbonus!$A$61:$AJ$295,MATCH(Ras,Rasbonus!$A$1:$AJ$1,0),FALSE)),VLOOKUP($A180,Rasbonus!$A$61:$AJ$295,MATCH(Ras,Rasbonus!$A$1:$AJ$1,0),FALSE),\"0\")","v":"0"},null,null,-11,0,0,0,0,0,0,0,0,0,0,0,0,0,0,0,0,0,0,0,0,0]
["Warding Lore",{"$f":"VLOOKUP(A181,AllaSkills!$A$3:$BV$317,'Ny NPC'!$A$2+3,FALSE)","v":"1/4"},"1","4","Magical",null,null,null,null,null,null,null,null,null,null,null,null,null,null,null,null,null,null,null,null,null,null,null,0,-25,{"$f":"(RE+IN)/2","v":5},{"$f":"HLOOKUP(Yrke,Levelbonus!$B$1:$CR$20,12,FALSE)","v":3},9,{"$f":"IF(ISNUMBER(VLOOKUP($A181,Rasbonus!$A$61:$AJ$295,MATCH(Ras,Rasbonus!$A$1:$AJ$1,0),FALSE)),VLOOKUP($A181,Rasbonus!$A$61:$AJ$295,MATCH(Ras,Rasbonus!$A$1:$AJ$1,0),FALSE),\"0\")","v":"0"},null,null,-11,0,0,0,0,0,0,0,0,0,0,0,0,0,0,0,0,0,0,0,0,0]
["Medical",{"$f":"HLOOKUP(Diverse!$G$2,'2nd'!$B$1:$CR$18,13,FALSE)","v":0},null,null,null,{"$f":"SUM(AL183:AL192)","v":0},null,null,{"$f":"SUM(AM183:AM192)","v":0},{"$f":"SUM(AN183:AN192)","v":0},0,0,0,0,0,0,0,0,0,0,0,0,0,0,0,0,0,0,"Rank","Skill","Stat",null,"Lvl","Race","Armor","Item","Total"]
["Animal healing",{"$f":"VLOOKUP(A183,AllaSkills!$A$3:$BV$317,'Ny NPC'!$A$2+3,FALSE)","v":"2/5"},"2","5","Medical",null,null,null,null,null,null,null,null,null,null,null,null,null,null,null,null,null,null,null,null,null,null,null,0,-25,{"$f":"(EM+RE)/2","v":2.5},{"$f":"HLOOKUP(Yrke,Levelbonus!$B$1:$CR$20,13,FALSE)","v":0},0,{"$f":"IF(ISNUMBER(VLOOKUP($A183,Rasbonus!$A$61:$AJ$295,MATCH(Ras,Rasbonus!$A$1:$AJ$1,0),FALSE)),VLOOKUP($A183,Rasbonus!$A$61:$AJ$295,MATCH(Ras,Rasbonus!$A$1:$AJ$1,0),FALSE),\"0\")","v":"0"},null,null,-23,{"$f":"IF(F183>2,\"99\",IF(F183<1,0,IF(F183=1,$C183+$C183-$C183,IF(F183=2,$C183+$D183))))","v":0},{"$f":"IF(I183>2,\"99\",IF(I183<1,0,IF(I183=1,$C183+$C183-$C183,IF(I183=2,$C183+$D183))))","v":0},{"$f":"IF(J183>2,\"99\",IF(J183<1,0,IF(J183=1,$C183+$C183-$C183,IF(J183=2,$C183+$D183))))","v":0},{"$f":"IF(K183>2,\"99\",IF(K183<1,0,IF(K183=1,$C183+$C183-$C183,IF(K183=2,$C183+$D183))))","v":0},{"$f":"IF(L183>2,\"99\",IF(L183<1,0,IF(L183=1,$C183+$C183-$C183,IF(L183=2,$C183+$D183))))","v":0},{"$f":"IF(M183>2,\"99\",IF(M183<1,0,IF(M183=1,$C183+$C183-$C183,IF(M183=2,$C183+$D183))))","v":0},{"$f":"IF(N183>2,\"99\",IF(N183<1,0,IF(N183=1,$C183+$C183-$C183,IF(N183=2,$C183+$D183))))","v":0},{"$f":"IF(O183>2,\"99\",IF(O183<1,0,IF(O183=1,$C183+$C183-$C183,IF(O183=2,$C183+$D183))))","v":0},{"$f":"IF(P183>2,\"99\",IF(P183<1,0,IF(P183=1,$C183+$C183-$C183,IF(P183=2,$C183+$D183))))","v":0},{"$f":"IF(Q183>2,\"99\",IF(Q183<1,0,IF(Q183=1,$C183+$C183-$C183,IF(Q183=2,$C183+$D183))))","v":0},{"$f":"IF(R183>2,\"99\",IF(R183<1,0,IF(R183=1,$C183+$C183-$C183,IF(R183=2,$C183+$D183))))","v":0},{"$f":"IF(S183>2,\"99\",IF(S183<1,0,IF(S183=1,$C183+$C183-$C183,IF(S183=2,$C183+$D183))))","v":0},{"$f":"IF(T183>2,\"99\",IF(T183<1,0,IF(T183=1,$C183+$C183-$C183,IF(T183=2,$C183+$D183))))","v":0},{"$f":"IF(U183>2,\"99\",IF(U183<1,0,IF(U183=1,$C183+$C183-$C183,IF(U183=2,$C183+$D183))))","v":0},{"$f":"IF(V183>2,\"99\",IF(V183<1,0,IF(V183=1,$C183+$C183-$C183,IF(V183=2,$C183+$D183))))","v":0},{"$f":"IF(W183>2,\"99\",IF(W183<1,0,IF(W183=1,$C183+$C183-$C183,IF(W183=2,$C183+$D183))))","v":0},{"$f":"IF(X183>2,\"99\",IF(X183<1,0,IF(X183=1,$C183+$C183-$C183,IF(X183=2,$C183+$D183))))","v":0},{"$f":"IF(Y183>2,\"99\",IF(Y183<1,0,IF(Y183=1,$C183+$C183-$C183,IF(Y183=2,$C183+$D183))))","v":0},{"$f":"IF(Z183>2,\"99\",IF(Z183<1,0,IF(Z183=1,$C183+$C183-$C183,IF(Z183=2,$C183+$D183))))","v":0},{"$f":"IF(AA183>2,\"99\",IF(AA183<1,0,IF(AA183=1,$C183+$C183-$C183,IF(AA183=2,$C183+$D183))))","v":0},{"$f":"IF(AB183>2,\"99\",IF(AB183<1,0,IF(AB183=1,$C183+$C183-$C183,IF(AB183=2,$C183+$D183))))","v":0}]
["Dentistry",{"$f":"VLOOKUP(A184,AllaSkills!$A$3:$BV$317,'Ny NPC'!$A$2+3,FALSE)","v":"5"},"5","5","Medical",null,null,null,null,null,null,null,null,null,null,null,null,null,null,null,null,null,null,null,null,null,null,null,0,-25,{"$f":"(RE+AG)/2","v":2.5},{"$f":"HLOOKUP(Yrke,Levelbonus!$B$1:$CR$20,13,FALSE)","v":0},0,{"$f":"IF(ISNUMBER(VLOOKUP($A184,Rasbonus!$A$61:$AJ$295,MATCH(Ras,Rasbonus!$A$1:$AJ$1,0),FALSE)),VLOOKUP($A184,Rasbonus!$A$61:$AJ$295,MATCH(Ras,Rasbonus!$A$1:$AJ$1,0),FALSE),\"0\")","v":"0"},null,null,-23,0,0,0,0,0,0,0,0,0,0,0,0,0,0,0,0,0,0,0,0,0]
["Diagnostics",{"$f":"VLOOKUP(A185,AllaSkills!$A$3:$BV$317,'Ny NPC'!$A$2+3,FALSE)","v":"2"},"2","2","Medical",null,null,null,null,null,null,null,null,null,null,null,null,null,null,null,null,null,null,null,null,null,null,null,0,-25,{"$f":"(IN+RE)/2","v":5},{"$f":"HLOOKUP(Yrke,Levelbonus!$B$1:$CR$20,13,FALSE)","v":0},0,{"$f":"IF(ISNUMBER(VLOOKUP($A185,Rasbonus!$A$61:$AJ$295,MATCH(Ras,Rasbonus!$A$1:$AJ$1,0),FALSE)),VLOOKUP($A185,Rasbonus!$A$61:$AJ$295,MATCH(Ras,Rasbonus!$A$1:$AJ$1,0),FALSE),\"0\")","v":"0"},null,null,-20,0,0,0,0,0,0,0,0,0,0,0,0,0,0,0,0,0,0,0,0,0]
["Drug Tolerance",{"$f":"VLOOKUP(A186,AllaSkills!$A$3:$BV$317,'Ny NPC'!$A$2+3,FALSE)","v":"2/5"},"2","5","Medical",null,null,null,null,null,null,null,null,null,null,null,null,null,null,null,null,null,null,null,null,null,null,null,0,-25,{"$f":"(CO+SD)/2","v":15},{"$f":"HLOOKUP(Yrke,Levelbonus!$B$1:$CR$20,13,FALSE)","v":0},0,{"$f":"IF(ISNUMBER(VLOOKUP($A186,Rasbonus!$A$61:$AJ$295,MATCH(Ras,Rasbonus!$A$1:$AJ$1,0),FALSE)),VLOOKUP($A186,Rasbonus!$A$61:$AJ$295,MATCH(Ras,Rasbonus!$A$1:$AJ$1,0),FALSE),\"0\")","v":"0"},null,null,-10,0,0,0,0,0,0,0,0,0,0,0,0,0,0,0,0,0,0,0,0,0]
[null,null,null,null,null,null,null,null,null,null,null,null,null,null,null,null,null,null,null,null,null,null,null,null,null,null,null,null,null,null,null,null,null,null,null,null,null,0,0,0,0,0,0,0,0,0,0,0,0,0,0,0,0,0,0,0,0,0]
["First Aid",{"$f":"VLOOKUP(A188,AllaSkills!$A$3:$BV$317,'Ny NPC'!$A$2+3,FALSE)","v":"2/5"},"2","5","Medical",null,null,null,null,null,null,null,null,null,null,null,null,null,null,null,null,null,null,null,null,null,null,null,0,-25,{"$f":"(SD+EM)/2","v":5},{"$f":"HLOOKUP(Yrke,Levelbonus!$B$1:$CR$20,13,FALSE)","v":0},0,{"$f":"IF(ISNUMBER(VLOOKUP($A188,Rasbonus!$A$61:$AJ$295,MATCH(Ras,Rasbonus!$A$1:$AJ$1,0),FALSE)),VLOOKUP($A188,Rasbonus!$A$61:$AJ$295,MATCH(Ras,Rasbonus!$A$1:$AJ$1,0),FALSE),\"0\")","v":"0"},null,null,-20,0,0,0,0,0,0,0,0,0,0,0,0,0,0,0,0,0,0,0,0,0]
["Hypnosis",{"$f":"VLOOKUP(A189,AllaSkills!$A$3:$BV$317,'Ny NPC'!$A$2+3,FALSE)","v":"2/4"},"2","4","Medical",null,null,null,null,null,null,null,null,null,null,null,null,null,null,null,null,null,null,null,null,null,null,null,0,-25,{"$f":"(PR+SD)/2","v":5},{"$f":"HLOOKUP(Yrke,Levelbonus!$B$1:$CR$20,13,FALSE)","v":0},0,{"$f":"IF(ISNUMBER(VLOOKUP($A189,Rasbonus!$A$61:$AJ$295,MATCH(Ras,Rasbonus!$A$1:$AJ$1,0),FALSE)),VLOOKUP($A189,Rasbonus!$A$61:$AJ$295,MATCH(Ras,Rasbonus!$A$1:$AJ$1,0),FALSE),\"0\")","v":"0"},null,null,-20,0,0,0,0,0,0,0,0,0,0,0,0,0,0,0,0,0,0,0,0,0]
["Midwifery",{"$f":"VLOOKUP(A190,AllaSkills!$A$3:$BV$317,'Ny NPC'!$A$2+3,FALSE)","v":"4"},"4","4","Medical",null,null,null,null,null,null,null,null,null,null,null,null,null,null,null,null,null,null,null,null,null,null,null,0,-25,{"$f":"(EM+RE+IN)/3","v":3.3333333333333335},{"$f":"HLOOKUP(Yrke,Levelbonus!$B$1:$CR$20,13,FALSE)","v":0},0,{"$f":"IF(ISNUMBER(VLOOKUP($A190,Rasbonus!$A$61:$AJ$295,MATCH(Ras,Rasbonus!$A$1:$AJ$1,0),FALSE)),VLOOKUP($A190,Rasbonus!$A$61:$AJ$295,MATCH(Ras,Rasbonus!$A$1:$AJ$1,0),FALSE),\"0\")","v":"0"},null,null,-22,0,0,0,0,0,0,0,0,0,0,0,0,0,0,0,0,0,0,0,0,0]
["Second Aid",{"$f":"VLOOKUP(A191,AllaSkills!$A$3:$BV$317,'Ny NPC'!$A$2+3,FALSE)","v":"3/6"},"3","6","Medical",null,null,null,null,null,null,null,null,null,null,null,null,null,null,null,null,null,null,null,null,null,null,null,0,-25,{"$f":"(SD+EM+IN)/3","v":5},{"$f":"HLOOKUP(Yrke,Levelbonus!$B$1:$CR$20,13,FALSE)","v":0},0,{"$f":"IF(ISNUMBER(VLOOKUP($A191,Rasbonus!$A$61:$AJ$295,MATCH(Ras,Rasbonus!$A$1:$AJ$1,0),FALSE)),VLOOKUP($A191,Rasbonus!$A$61:$AJ$295,MATCH(Ras,Rasbonus!$A$1:$AJ$1,0),FALSE),\"0\")","v":"0"},null,null,-20,0,0,0,0,0,0,0,0,0,0,0,0,0,0,0,0,0,0,0,0,0]
["Surgery",{"$f":"VLOOKUP(A192,AllaSkills!$A$3:$BV$317,'Ny NPC'!$A$2+3,FALSE)","v":"5"},"5","5","Medical",null,null,null,null,null,null,null,null,null,null,null,null,null,null,null,null,null,null,null,null,null,null,null,0,-25,{"$f":"(SD+EM+IN)/3","v":5},{"$f":"HLOOKUP(Yrke,Levelbonus!$B$1:$CR$20,13,FALSE)","v":0},0,{"$f":"IF(ISNUMBER(VLOOKUP($A192,Rasbonus!$A$61:$AJ$295,MATCH(Ras,Rasbonus!$A$1:$AJ$1,0),FALSE)),VLOOKUP($A192,Rasbonus!$A$61:$AJ$295,MATCH(Ras,Rasbonus!$A$1:$AJ$1,0),FALSE),\"0\")","v":"0"},null,null,-20,0,0,0,0,0,0,0,0,0,0,0,0,0,0,0,0,0,0,0,0,0]
["Perception",{"$f":"HLOOKUP(Diverse!$G$2,'2nd'!$B$1:$CR$18,14,FALSE)","v":5},null,null,null,{"$f":"SUM(AL194:AL201)","v":0},null,null,{"$f":"SUM(AM194:AM201)","v":0},{"$f":"SUM(AN194:AN201)","v":0},0,0,0,0,0,0,0,0,0,0,0,0,0,0,0,0,0,0,"Rank","Skill","Stat",null,"Lvl","Race","Armor","Item","Total"]
["Awakening",{"$f":"VLOOKUP(A194,AllaSkills!$A$3:$BV$317,'Ny NPC'!$A$2+3,FALSE)","v":"18"},"18","18","Perception",null,null,null,null,null,null,null,null,null,null,null,null,null,null,null,null,null,null,null,null,null,null,null,0,-25,{"$f":"IN","v":5},{"$f":"HLOOKUP(Yrke,Levelbonus!$B$1:$CR$20,14,FALSE)","v":1},3,{"$f":"IF(ISNUMBER(VLOOKUP($A194,Rasbonus!$A$61:$AJ$295,MATCH(Ras,Rasbonus!$A$1:$AJ$1,0),FALSE)),VLOOKUP($A194,Rasbonus!$A$61:$AJ$295,MATCH(Ras,Rasbonus!$A$1:$AJ$1,0),FALSE),\"0\")","v":"0"},null,null,-17,{"$f":"IF(F194>2,\"99\",IF(F194<1,0,IF(F194=1,$C194+$C194-$C194,IF(F194=2,$C194+$D194))))","v":0},{"$f":"IF(I194>2,\"99\",IF(I194<1,0,IF(I194=1,$C194+$C194-$C194,IF(I194=2,$C194+$D194))))","v":0},0,0,0,0,0,0,0,0,0,0,0,0,0,0,0,0,0,0,0]
["Direction Sense",{"$f":"VLOOKUP(A195,AllaSkills!$A$3:$BV$317,'Ny NPC'!$A$2+3,FALSE)","v":"2/4"},"2","4","Perception",null,null,null,null,null,null,null,null,null,null,null,null,null,null,null,null,null,null,null,null,null,null,null,0,-25,{"$f":"(IN+RE)/2","v":5},{"$f":"HLOOKUP(Yrke,Levelbonus!$B$1:$CR$20,14,FALSE)","v":1},3,{"$f":"IF(ISNUMBER(VLOOKUP($A195,Rasbonus!$A$61:$AJ$295,MATCH(Ras,Rasbonus!$A$1:$AJ$1,0),FALSE)),VLOOKUP($A195,Rasbonus!$A$61:$AJ$295,MATCH(Ras,Rasbonus!$A$1:$AJ$1,0),FALSE),\"0\")","v":"0"},null,null,-17,0,0,0,0,0,0,0,0,0,0,0,0,0,0,0,0,0,0,0,0,0]
["Lie Perception",{"$f":"VLOOKUP(A196,AllaSkills!$A$3:$BV$317,'Ny NPC'!$A$2+3,FALSE)","v":"3/5"},"3","5","Perception",null,null,null,null,null,null,null,null,null,null,null,null,null,null,null,null,null,null,null,null,null,null,null,0,-25,{"$f":"(IN+RE)/2","v":5},{"$f":"HLOOKUP(Yrke,Levelbonus!$B$1:$CR$20,14,FALSE)","v":1},3,{"$f":"IF(ISNUMBER(VLOOKUP($A196,Rasbonus!$A$61:$AJ$295,MATCH(Ras,Rasbonus!$A$1:$AJ$1,0),FALSE)),VLOOKUP($A196,Rasbonus!$A$61:$AJ$295,MATCH(Ras,Rasbonus!$A$1:$AJ$1,0),FALSE),\"0\")","v":"0"},null,null,-17,0,0,0,0,0,0,0,0,0,0,0,0,0,0,0,0,0,0,0,0,0]
["Poison Perception",{"$f":"VLOOKUP(A197,AllaSkills!$A$3:$BV$317,'Ny NPC'!$A$2+3,FALSE)","v":"1/4"},"1","4","Perception",null,null,null,null,null,null,null,null,null,null,null,null,null,null,null,null,null,null,null,null,null,null,null,0,-25,{"$f":"(IN+RE)/2","v":5},{"$f":"HLOOKUP(Yrke,Levelbonus!$B$1:$CR$20,14,FALSE)","v":1},3,{"$f":"IF(ISNUMBER(VLOOKUP($A197,Rasbonus!$A$61:$AJ$295,MATCH(Ras,Rasbonus!$A$1:$AJ$1,0),FALSE)),VLOOKUP($A197,Rasbonus!$A$61:$AJ$295,MATCH(Ras,Rasbonus!$A$1:$AJ$1,0),FALSE),\"0\")","v":"0"},null,null,-17,0,0,0,0,0,0,0,0,0,0,0,0,0,0,0,0,0,0,0,0,0]
["Sense Ambush",{"$f":"VLOOKUP(A198,AllaSkills!$A$3:$BV$317,'Ny NPC'!$A$2+3,FALSE)","v":"3"},"3","3","Perception",null,null,null,null,null,null,null,null,null,null,null,null,null,null,null,null,null,null,null,null,null,null,null,0,-25,{"$f":"(IN+RE)/2","v":5},{"$f":"HLOOKUP(Yrke,Levelbonus!$B$1:$CR$20,14,FALSE)","v":1},3,{"$f":"IF(ISNUMBER(VLOOKUP($A198,Rasbonus!$A$61:$AJ$295,MATCH(Ras,Rasbonus!$A$1:$AJ$1,0),FALSE)),VLOOKUP($A198,Rasbonus!$A$61:$AJ$295,MATCH(Ras,Rasbonus!$A$1:$AJ$1,0),FALSE),\"0\")","v":"0"},null,null,-17,0,0,0,0,0,0,0,0,0,0,0,0,0,0,0,0,0,0,0,0,0]
["Surveillance",{"$f":"VLOOKUP(A199,AllaSkills!$A$3:$BV$317,'Ny NPC'!$A$2+3,FALSE)","v":"2/6"},"2","6","Perception",null,null,null,null,null,null,null,null,null,null,null,null,null,null,null,null,null,null,null,null,null,null,null,0,-25,{"$f":"(IN+SD)/2","v":7.5},{"$f":"HLOOKUP(Yrke,Levelbonus!$B$1:$CR$20,14,FALSE)","v":1},3,{"$f":"IF(ISNUMBER(VLOOKUP($A199,Rasbonus!$A$61:$AJ$295,MATCH(Ras,Rasbonus!$A$1:$AJ$1,0),FALSE)),VLOOKUP($A199,Rasbonus!$A$61:$AJ$295,MATCH(Ras,Rasbonus!$A$1:$AJ$1,0),FALSE),\"0\")","v":"0"},null,null,-15,0,0,0,0,0,0,0,0,0,0,0,0,0,0,0,0,0,0,0,0,0]
["Time Sense",{"$f":"VLOOKUP(A200,AllaSkills!$A$3:$BV$317,'Ny NPC'!$A$2+3,FALSE)","v":"1/3"},"1","3","Perception",null,null,null,null,null,null,null,null,null,null,null,null,null,null,null,null,null,null,null,null,null,null,null,0,-25,{"$f":"(IN+RE)/2","v":5},{"$f":"HLOOKUP(Yrke,Levelbonus!$B$1:$CR$20,14,FALSE)","v":1},3,{"$f":"IF(ISNUMBER(VLOOKUP($A200,Rasbonus!$A$61:$AJ$295,MATCH(Ras,Rasbonus!$A$1:$AJ$1,0),FALSE)),VLOOKUP($A200,Rasbonus!$A$61:$AJ$295,MATCH(Ras,Rasbonus!$A$1:$AJ$1,0),FALSE),\"0\")","v":"0"},null,null,-17,0,0,0,0,0,0,0,0,0,0,0,0,0,0,0,0,0,0,0,0,0]
["Tracking",{"$f":"VLOOKUP(A201,AllaSkills!$A$3:$BV$317,'Ny NPC'!$A$2+3,FALSE)","v":"3"},"3","3","Perception",null,null,null,null,null,null,null,null,null,null,null,null,null,null,null,null,null,null,null,null,null,null,null,0,-25,{"$f":"(IN+RE)/2","v":5},{"$f":"HLOOKUP(Yrke,Levelbonus!$B$1:$CR$20,14,FALSE)","v":1},3,{"$f":"IF(ISNUMBER(VLOOKUP($A201,Rasbonus!$A$61:$AJ$295,MATCH(Ras,Rasbonus!$A$1:$AJ$1,0),FALSE)),VLOOKUP($A201,Rasbonus!$A$61:$AJ$295,MATCH(Ras,Rasbonus!$A$1:$AJ$1,0),FALSE),\"0\")","v":"0"},null,null,-17,0,0,0,0,0,0,0,0,0,0,0,0,0,0,0,0,0,0,0,0,0]
["Social",{"$f":"HLOOKUP(Diverse!$G$2,'2nd'!$B$1:$CR$18,15,FALSE)","v":0},null,null,null,{"$f":"SUM(AL203:AL209)","v":0},null,null,{"$f":"SUM(AM203:AM209)","v":0},{"$f":"SUM(AN203:AN209)","v":0},0,0,0,0,0,0,0,0,0,0,0,0,0,0,0,0,0,0,"Rank","Skill","Stat",null,"Lvl","Race","Armor","Item","Total"]
["Diplomacy",{"$f":"VLOOKUP(A203,AllaSkills!$A$3:$BV$317,'Ny NPC'!$A$2+3,FALSE)","v":"2/5"},"2","5","Social",null,null,null,null,null,null,null,null,null,null,null,null,null,null,null,null,null,null,null,null,null,null,null,0,-25,{"$f":"(PR+IN)/2","v":2.5},{"$f":"HLOOKUP(Yrke,Levelbonus!$B$1:$CR$20,15,FALSE)","v":0},0,{"$f":"IF(ISNUMBER(VLOOKUP($A203,Rasbonus!$A$61:$AJ$295,MATCH(Ras,Rasbonus!$A$1:$AJ$1,0),FALSE)),VLOOKUP($A203,Rasbonus!$A$61:$AJ$295,MATCH(Ras,Rasbonus!$A$1:$AJ$1,0),FALSE),\"0\")","v":"0"},null,null,-23,0,{"$f":"IF(I203>2,\"99\",IF(I203<1,0,IF(I203=1,$C203+$C203-$C203,IF(I203=2,$C203+$D203))))","v":0},0,0,0,0,0,0,0,0,0,0,0,0,0,0,0,0,0,0,0]
["Duping",{"$f":"VLOOKUP(A204,AllaSkills!$A$3:$BV$317,'Ny NPC'!$A$2+3,FALSE)","v":"3/5"},"3","5","Social",null,null,null,null,null,null,null,null,null,null,null,null,null,null,null,null,null,null,null,null,null,null,null,0,-25,{"$f":"PR","v":0},{"$f":"HLOOKUP(Yrke,Levelbonus!$B$1:$CR$20,15,FALSE)","v":0},0,{"$f":"IF(ISNUMBER(VLOOKUP($A204,Rasbonus!$A$61:$AJ$295,MATCH(Ras,Rasbonus!$A$1:$AJ$1,0),FALSE)),VLOOKUP($A204,Rasbonus!$A$61:$AJ$295,MATCH(Ras,Rasbonus!$A$1:$AJ$1,0),FALSE),\"0\")","v":"0"},null,null,-25,0,0,0,0,0,0,0,0,0,0,0,0,0,0,0,0,0,0,0,0,0]
["Gambling",{"$f":"VLOOKUP(A205,AllaSkills!$A$3:$BV$317,'Ny NPC'!$A$2+3,FALSE)","v":"2/6"},"2","6","Social",null,null,null,null,null,null,null,null,null,null,null,null,null,null,null,null,null,null,null,null,null,null,null,0,-25,{"$f":"(RE+PR)/2","v":2.5},{"$f":"HLOOKUP(Yrke,Levelbonus!$B$1:$CR$20,15,FALSE)","v":0},0,{"$f":"IF(ISNUMBER(VLOOKUP($A205,Rasbonus!$A$61:$AJ$295,MATCH(Ras,Rasbonus!$A$1:$AJ$1,0),FALSE)),VLOOKUP($A205,Rasbonus!$A$61:$AJ$295,MATCH(Ras,Rasbonus!$A$1:$AJ$1,0),FALSE),\"0\")","v":"0"},null,null,-23,0,0,0,0,0,0,0,0,0,0,0,0,0,0,0,0,0,0,0,0,0]
["Interrogation",{"$f":"VLOOKUP(A206,AllaSkills!$A$3:$BV$317,'Ny NPC'!$A$2+3,FALSE)","v":"4"},"4","4","Social",null,null,null,null,null,null,null,null,null,null,null,null,null,null,null,null,null,null,null,null,null,null,null,0,-25,{"$f":"(AG+RE)/2","v":2.5},{"$f":"HLOOKUP(Yrke,Levelbonus!$B$1:$CR$20,15,FALSE)","v":0},0,{"$f":"IF(ISNUMBER(VLOOKUP($A206,Rasbonus!$A$61:$AJ$295,MATCH(Ras,Rasbonus!$A$1:$AJ$1,0),FALSE)),VLOOKUP($A206,Rasbonus!$A$61:$AJ$295,MATCH(Ras,Rasbonus!$A$1:$AJ$1,0),FALSE),\"0\")","v":"0"},null,null,-23,0,0,0,0,0,0,0,0,0,0,0,0,0,0,0,0,0,0,0,0,0]
["Intimidation",{"$f":"VLOOKUP(A207,AllaSkills!$A$3:$BV$317,'Ny NPC'!$A$2+3,FALSE)","v":"2/5"},"2","5","Social",null,null,null,null,null,null,null,null,null,null,null,null,null,null,null,null,null,null,null,null,null,null,null,0,-25,{"$f":"(PR+RE)/2","v":2.5},{"$f":"HLOOKUP(Yrke,Levelbonus!$B$1:$CR$20,15,FALSE)","v":0},0,{"$f":"IF(ISNUMBER(VLOOKUP($A207,Rasbonus!$A$61:$AJ$295,MATCH(Ras,Rasbonus!$A$1:$AJ$1,0),FALSE)),VLOOKUP($A207,Rasbonus!$A$61:$AJ$295,MATCH(Ras,Rasbonus!$A$1:$AJ$1,0),FALSE),\"0\")","v":"0"},null,null,-23,0,0,0,0,0,0,0,0,0,0,0,0,0,0,0,0,0,0,0,0,0]
["Leadership",{"$f":"VLOOKUP(A208,AllaSkills!$A$3:$BV$317,'Ny NPC'!$A$2+3,FALSE)","v":"2/4"},"2","4","Social",null,null,null,null,null,null,null,null,null,null,null,null,null,null,null,null,null,null,null,null,null,null,null,0,-25,{"$f":"(PR+RE)/2","v":2.5},{"$f":"HLOOKUP(Yrke,Levelbonus!$B$1:$CR$20,15,FALSE)","v":0},0,{"$f":"IF(ISNUMBER(VLOOKUP($A208,Rasbonus!$A$61:$AJ$295,MATCH(Ras,Rasbonus!$A$1:$AJ$1,0),FALSE)),VLOOKUP($A208,Rasbonus!$A$61:$AJ$295,MATCH(Ras,Rasbonus!$A$1:$AJ$1,0),FALSE),\"0\")","v":"0"},null,null,-23,0,0,0,0,0,0,0,0,0,0,0,0,0,0,0,0,0,0,0,0,0]
["Seduction",{"$f":"VLOOKUP(A209,AllaSkills!$A$3:$BV$317,'Ny NPC'!$A$2+3,FALSE)","v":"2/5"},"2","5","Social",null,null,null,null,null,null,null,null,null,null,null,null,null,null,null,null,null,null,null,null,null,null,null,0,-25,{"$f":"(EM+PR+AP)/3","v":1.6666666666666667},{"$f":"HLOOKUP(Yrke,Levelbonus!$B$1:$CR$20,15,FALSE)","v":0},0,{"$f":"IF(ISNUMBER(VLOOKUP($A209,Rasbonus!$A$61:$AJ$295,MATCH(Ras,Rasbonus!$A$1:$AJ$1,0),FALSE)),VLOOKUP($A209,Rasbonus!$A$61:$AJ$295,MATCH(Ras,Rasbonus!$A$1:$AJ$1,0),FALSE),\"0\")","v":"0"},null,null,-23,0,0,0,0,0,0,0,0,0,0,0,0,0,0,0,0,0,0,0,0,0]
["Subterfuge",{"$f":"HLOOKUP(Diverse!$G$2,'2nd'!$B$1:$CR$18,16,FALSE)","v":2},null,null,null,{"$f":"SUM(AL211:AL221)","v":0},null,null,{"$f":"SUM(AM211:AM221)","v":0},{"$f":"SUM(AN211:AN221)","v":0},0,0,0,0,0,0,0,0,0,0,0,0,0,0,0,0,0,0,"Rank","Skill","Stat",null,"Lvl","Race","Armor","Item","Total"]
["Acting",{"$f":"VLOOKUP(A211,AllaSkills!$A$3:$BV$317,'Ny NPC'!$A$2+3,FALSE)","v":"3/6"},"3","6","Subterfuge",null,null,null,null,null,null,null,null,null,null,null,null,null,null,null,null,null,null,null,null,null,null,null,0,-25,{"$f":"(EM+PR+AP)/3","v":1.6666666666666667},{"$f":"HLOOKUP(Yrke,Levelbonus!$B$1:$CR$20,16,FALSE)","v":0},0,{"$f":"IF(ISNUMBER(VLOOKUP($A211,Rasbonus!$A$61:$AJ$295,MATCH(Ras,Rasbonus!$A$1:$AJ$1,0),FALSE)),VLOOKUP($A211,Rasbonus!$A$61:$AJ$295,MATCH(Ras,Rasbonus!$A$1:$AJ$1,0),FALSE),\"0\")","v":"0"},null,null,-23,0,{"$f":"IF(I211>2,\"99\",IF(I211<1,0,IF(I211=1,$C211+$C211-$C211,IF(I211=2,$C211+$D211))))","v":0},0,0,0,0,0,0,0,0,0,0,0,0,0,0,0,0,0,0,0]
["Begging",{"$f":"VLOOKUP(A212,AllaSkills!$A$3:$BV$317,'Ny NPC'!$A$2+3,FALSE)","v":"2/6"},"2","6","Subterfuge",null,null,null,null,null,null,null,null,null,null,null,null,null,null,null,null,null,null,null,null,null,null,null,0,-25,{"$f":"(EM+PR+AP)/3","v":1.6666666666666667},{"$f":"HLOOKUP(Yrke,Levelbonus!$B$1:$CR$20,16,FALSE)","v":0},0,{"$f":"IF(ISNUMBER(VLOOKUP($A212,Rasbonus!$A$61:$AJ$295,MATCH(Ras,Rasbonus!$A$1:$AJ$1,0),FALSE)),VLOOKUP($A212,Rasbonus!$A$61:$AJ$295,MATCH(Ras,Rasbonus!$A$1:$AJ$1,0),FALSE),\"0\")","v":"0"},null,null,-23,0,0,0,0,0,0,0,0,0,0,0,0,0,0,0,0,0,0,0,0,0]
["Bribery",{"$f":"VLOOKUP(A213,AllaSkills!$A$3:$BV$317,'Ny NPC'!$A$2+3,FALSE)","v":"2/6"},"2","6","Subterfuge",null,null,null,null,null,null,null,null,null,null,null,null,null,null,null,null,null,null,null,null,null,null,null,0,-25,{"$f":"(PR+RE+AP)/3","v":3.3333333333333335},{"$f":"HLOOKUP(Yrke,Levelbonus!$B$1:$CR$20,16,FALSE)","v":0},0,{"$f":"IF(ISNUMBER(VLOOKUP($A213,Rasbonus!$A$61:$AJ$295,MATCH(Ras,Rasbonus!$A$1:$AJ$1,0),FALSE)),VLOOKUP($A213,Rasbonus!$A$61:$AJ$295,MATCH(Ras,Rasbonus!$A$1:$AJ$1,0),FALSE),\"0\")","v":"0"},null,null,-22,0,0,0,0,0,0,0,0,0,0,0,0,0,0,0,0,0,0,0,0,0]
["Camouflage",{"$f":"VLOOKUP(A214,AllaSkills!$A$3:$BV$317,'Ny NPC'!$A$2+3,FALSE)","v":"6"},"6","6","Subterfuge",null,null,null,null,null,null,null,null,null,null,null,null,null,null,null,null,null,null,null,null,null,null,null,0,-25,{"$f":"(RE+IN)/2","v":5},{"$f":"HLOOKUP(Yrke,Levelbonus!$B$1:$CR$20,16,FALSE)","v":0},0,{"$f":"IF(ISNUMBER(VLOOKUP($A214,Rasbonus!$A$61:$AJ$295,MATCH(Ras,Rasbonus!$A$1:$AJ$1,0),FALSE)),VLOOKUP($A214,Rasbonus!$A$61:$AJ$295,MATCH(Ras,Rasbonus!$A$1:$AJ$1,0),FALSE),\"0\")","v":"0"},null,null,-20,0,0,0,0,0,0,0,0,0,0,0,0,0,0,0,0,0,0,0,0,0]
["Disguise",{"$f":"VLOOKUP(A215,AllaSkills!$A$3:$BV$317,'Ny NPC'!$A$2+3,FALSE)","v":"3/6"},"3","6","Subterfuge",null,null,null,null,null,null,null,null,null,null,null,null,null,null,null,null,null,null,null,null,null,null,null,0,-25,{"$f":"(PR+SD)/2","v":5},{"$f":"HLOOKUP(Yrke,Levelbonus!$B$1:$CR$20,16,FALSE)","v":0},0,{"$f":"IF(ISNUMBER(VLOOKUP($A215,Rasbonus!$A$61:$AJ$295,MATCH(Ras,Rasbonus!$A$1:$AJ$1,0),FALSE)),VLOOKUP($A215,Rasbonus!$A$61:$AJ$295,MATCH(Ras,Rasbonus!$A$1:$AJ$1,0),FALSE),\"0\")","v":"0"},null,null,-20,0,0,0,0,0,0,0,0,0,0,0,0,0,0,0,0,0,0,0,0,0]
["Falsification",{"$f":"VLOOKUP(A216,AllaSkills!$A$3:$BV$317,'Ny NPC'!$A$2+3,FALSE)","v":"1/3"},"1","3","Subterfuge",null,null,null,null,null,null,null,null,null,null,null,null,null,null,null,null,null,null,null,null,null,null,null,0,-25,{"$f":"(SD+RE)/2","v":7.5},{"$f":"HLOOKUP(Yrke,Levelbonus!$B$1:$CR$20,16,FALSE)","v":0},0,{"$f":"IF(ISNUMBER(VLOOKUP($A216,Rasbonus!$A$61:$AJ$295,MATCH(Ras,Rasbonus!$A$1:$AJ$1,0),FALSE)),VLOOKUP($A216,Rasbonus!$A$61:$AJ$295,MATCH(Ras,Rasbonus!$A$1:$AJ$1,0),FALSE),\"0\")","v":"0"},null,null,-18,0,0,0,0,0,0,0,0,0,0,0,0,0,0,0,0,0,0,0,0,0]
["Hide Item",{"$f":"VLOOKUP(A217,AllaSkills!$A$3:$BV$317,'Ny NPC'!$A$2+3,FALSE)","v":"6"},"6","6","Subterfuge",null,null,null,null,null,null,null,null,null,null,null,null,null,null,null,null,null,null,null,null,null,null,null,0,-25,{"$f":"(RE+IN)/2","v":5},{"$f":"HLOOKUP(Yrke,Levelbonus!$B$1:$CR$20,16,FALSE)","v":0},0,{"$f":"IF(ISNUMBER(VLOOKUP($A217,Rasbonus!$A$61:$AJ$295,MATCH(Ras,Rasbonus!$A$1:$AJ$1,0),FALSE)),VLOOKUP($A217,Rasbonus!$A$61:$AJ$295,MATCH(Ras,Rasbonus!$A$1:$AJ$1,0),FALSE),\"0\")","v":"0"},null,null,-20,0,0,0,0,0,0,0,0,0,0,0,0,0,0,0,0,0,0,0,0,0]
["Mimery",{"$f":"VLOOKUP(A218,AllaSkills!$A$3:$BV$317,'Ny NPC'!$A$2+3,FALSE)","v":"3/6"},"3","6","Subterfuge",null,null,null,null,null,null,null,null,null,null,null,null,null,null,null,null,null,null,null,null,null,null,null,0,-25,{"$f":"(AG+SD)/2","v":5},{"$f":"HLOOKUP(Yrke,Levelbonus!$B$1:$CR$20,16,FALSE)","v":0},0,{"$f":"IF(ISNUMBER(VLOOKUP($A218,Rasbonus!$A$61:$AJ$295,MATCH(Ras,Rasbonus!$A$1:$AJ$1,0),FALSE)),VLOOKUP($A218,Rasbonus!$A$61:$AJ$295,MATCH(Ras,Rasbonus!$A$1:$AJ$1,0),FALSE),\"0\")","v":"0"},null,null,-20,0,0,0,0,0,0,0,0,0,0,0,0,0,0,0,0,0,0,0,0,0]
["Pick Pockets",{"$f":"VLOOKUP(A219,AllaSkills!$A$3:$BV$317,'Ny NPC'!$A$2+3,FALSE)","v":"3"},"3","3","Subterfuge",null,null,null,null,null,null,null,null,null,null,null,null,null,null,null,null,null,null,null,null,null,null,null,0,-25,{"$f":"(AG+IN)/2","v":2.5},{"$f":"HLOOKUP(Yrke,Levelbonus!$B$1:$CR$20,16,FALSE)","v":0},0,{"$f":"IF(ISNUMBER(VLOOKUP($A219,Rasbonus!$A$61:$AJ$295,MATCH(Ras,Rasbonus!$A$1:$AJ$1,0),FALSE)),VLOOKUP($A219,Rasbonus!$A$61:$AJ$295,MATCH(Ras,Rasbonus!$A$1:$AJ$1,0),FALSE),\"0\")","v":"0"},null,null,-23,0,0,0,0,0,0,0,0,0,0,0,0,0,0,0,0,0,0,0,0,0]
["Set Traps",{"$f":"VLOOKUP(A220,AllaSkills!$A$3:$BV$317,'Ny NPC'!$A$2+3,FALSE)","v":"4"},"4","4","Subterfuge",null,null,null,null,null,null,null,null,null,null,null,null,null,null,null,null,null,null,null,null,null,null,null,0,-25,{"$f":"(RE+AG)/2","v":2.5},{"$f":"HLOOKUP(Yrke,Levelbonus!$B$1:$CR$20,16,FALSE)","v":0},0,{"$f":"IF(ISNUMBER(VLOOKUP($A220,Rasbonus!$A$61:$AJ$295,MATCH(Ras,Rasbonus!$A$1:$AJ$1,0),FALSE)),VLOOKUP($A220,Rasbonus!$A$61:$AJ$295,MATCH(Ras,Rasbonus!$A$1:$AJ$1,0),FALSE),\"0\")","v":"0"},null,null,-23,0,0,0,0,0,0,0,0,0,0,0,0,0,0,0,0,0,0,0,0,0]
["Trickery",{"$f":"VLOOKUP(A221,AllaSkills!$A$3:$BV$317,'Ny NPC'!$A$2+3,FALSE)","v":"3"},"3","3","Subterfuge",null,null,null,null,null,null,null,null,null,null,null,null,null,null,null,null,null,null,null,null,null,null,null,0,-25,{"$f":"(PR+QU)/2","v":0},{"$f":"HLOOKUP(Yrke,Levelbonus!$B$1:$CR$20,16,FALSE)","v":0},0,{"$f":"IF(ISNUMBER(VLOOKUP($A221,Rasbonus!$A$61:$AJ$295,MATCH(Ras,Rasbonus!$A$1:$AJ$1,0),FALSE)),VLOOKUP($A221,Rasbonus!$A$61:$AJ$295,MATCH(Ras,Rasbonus!$A$1:$AJ$1,0),FALSE),\"0\")","v":"0"},null,null,-25,0,0,0,0,0,0,0,0,0,0,0,0,0,0,0,0,0,0,0,0,0]
["Survival",{"$f":"HLOOKUP(Diverse!$G$2,'2nd'!$B$1:$CR$18,17,FALSE)","v":2},null,null,null,{"$f":"SUM(AL223:AL228)","v":0},null,null,{"$f":"SUM(AM223:AM228)","v":0},{"$f":"SUM(AN223:AN228)","v":0},0,0,0,0,0,0,0,0,0,0,0,0,0,0,0,0,0,0,"Rank","Skill","Stat",null,"Lvl","Race","Armor","Item","Total"]
["Caving",{"$f":"VLOOKUP(A223,AllaSkills!$A$3:$BV$317,'Ny NPC'!$A$2+3,FALSE)","v":"3"},"3","3","Survivial",null,null,null,null,null,null,null,null,null,null,null,null,null,null,null,null,null,null,null,null,null,null,null,0,-25,{"$f":"(SD+RE)/2","v":7.5},{"$f":"HLOOKUP(Yrke,Levelbonus!$B$1:$CR$20,20,FALSE)","v":0},0,{"$f":"IF(ISNUMBER(VLOOKUP($A223,Rasbonus!$A$61:$AJ$295,MATCH(Ras,Rasbonus!$A$1:$AJ$1,0),FALSE)),VLOOKUP($A223,Rasbonus!$A$61:$AJ$295,MATCH(Ras,Rasbonus!$A$1:$AJ$1,0),FALSE),\"0\")","v":15},null,null,-3,0,{"$f":"IF(I223>2,\"99\",IF(I223<1,0,IF(I223=1,$C223+$C223-$C223,IF(I223=2,$C223+$D223))))","v":0},0,0,0,0,0,0,0,0,0,0,0,0,0,0,0,0,0,0,0]
["Fire Starting",{"$f":"VLOOKUP(A224,AllaSkills!$A$3:$BV$317,'Ny NPC'!$A$2+3,FALSE)","v":"2/5"},{"$f":"IF(LEN(B224)=3,LEFT(B224,1),IF(LEN(B224)<3,B224,99))","v":"2"},{"$f":"IF(RIGHT(B224,1)=\"*\",LEFT(B224,1),IF(LEN(B224)=3,RIGHT(B224,1),IF(LEN(B224)<3,B224,RIGHT(B224,2))))","v":"5"},"Survivial",null,null,null,null,null,null,null,null,null,null,null,null,null,null,null,null,null,null,null,null,null,null,null,{"$f":"SUM(F224:AB224)","v":0},{"$f":"IF(AC224<1,-25,IF(AC224>30,80+((AC224-30)*0.5),IF(AC224>20,70+(AC224-20),IF(AC224>10,50+((AC224-10)*2),AC224*5))))","v":-25},{"$f":"(RE+AG)/2","v":2.5},{"$f":"HLOOKUP(Yrke,Levelbonus!$B$1:$CR$20,20,FALSE)","v":0},{"$f":"AF224*Level","v":0},{"$f":"IF(ISNUMBER(VLOOKUP($A224,Rasbonus!$A$61:$AJ$295,MATCH(Ras,Rasbonus!$A$1:$AJ$1,0),FALSE)),VLOOKUP($A224,Rasbonus!$A$61:$AJ$295,MATCH(Ras,Rasbonus!$A$1:$AJ$1,0),FALSE),\"0\")","v":"0"},null,null,-23,0,0,0,0,0,0,0,0,0,0,0,0,0,0,0,0,0,0,0,0,0]
["Foraging",{"$f":"VLOOKUP(A225,AllaSkills!$A$3:$BV$317,'Ny NPC'!$A$2+3,FALSE)","v":"2/5"},"2","5","Survivial",null,null,null,null,null,null,null,null,null,null,null,null,null,null,null,null,null,null,null,null,null,null,null,0,-25,{"$f":"(IN+RE)/2","v":5},{"$f":"HLOOKUP(Yrke,Levelbonus!$B$1:$CR$20,20,FALSE)","v":0},0,{"$f":"IF(ISNUMBER(VLOOKUP($A225,Rasbonus!$A$61:$AJ$295,MATCH(Ras,Rasbonus!$A$1:$AJ$1,0),FALSE)),VLOOKUP($A225,Rasbonus!$A$61:$AJ$295,MATCH(Ras,Rasbonus!$A$1:$AJ$1,0),FALSE),\"0\")","v":"0"},null,null,-20,0,0,0,0,0,0,0,0,0,0,0,0,0,0,0,0,0,0,0,0,0]
["Hostile Environment",{"$f":"VLOOKUP(A226,AllaSkills!$A$3:$BV$317,'Ny NPC'!$A$2+3,FALSE)","v":"3"},"3","3","Survivial",null,null,null,null,null,null,null,null,null,null,null,null,null,null,null,null,null,null,null,null,null,null,null,0,-25,{"$f":"(AG+SD)/2","v":5},{"$f":"HLOOKUP(Yrke,Levelbonus!$B$1:$CR$20,20,FALSE)","v":0},0,{"$f":"IF(ISNUMBER(VLOOKUP($A226,Rasbonus!$A$61:$AJ$295,MATCH(Ras,Rasbonus!$A$1:$AJ$1,0),FALSE)),VLOOKUP($A226,Rasbonus!$A$61:$AJ$295,MATCH(Ras,Rasbonus!$A$1:$AJ$1,0),FALSE),\"0\")","v":"0"},null,null,-20,0,0,0,0,0,0,0,0,0,0,0,0,0,0,0,0,0,0,0,0,0]
["Region Lore",{"$f":"VLOOKUP(A227,AllaSkills!$A$3:$BV$317,'Ny NPC'!$A$2+3,FALSE)","v":"2/5"},"2","5","Survivial",null,null,null,null,null,null,null,null,null,null,null,null,null,null,null,null,null,null,null,null,null,null,null,0,-25,{"$f":"(RE)","v":5},{"$f":"HLOOKUP(Yrke,Levelbonus!$B$1:$CR$20,20,FALSE)","v":0},0,{"$f":"IF(ISNUMBER(VLOOKUP($A227,Rasbonus!$A$61:$AJ$295,MATCH(Ras,Rasbonus!$A$1:$AJ$1,0),FALSE)),VLOOKUP($A227,Rasbonus!$A$61:$AJ$295,MATCH(Ras,Rasbonus!$A$1:$AJ$1,0),FALSE),\"0\")","v":"0"},null,null,-20,0,0,0,0,0,0,0,0,0,0,0,0,0,0,0,0,0,0,0,0,0]
["Streetwise",{"$f":"VLOOKUP(A228,AllaSkills!$A$3:$BV$317,'Ny NPC'!$A$2+3,FALSE)","v":"2/7"},"2","7","Survivial",null,null,null,null,null,null,null,null,null,null,null,null,null,null,null,null,null,null,null,null,null,null,null,0,-25,{"$f":"(PR+IN)/2","v":2.5},{"$f":"HLOOKUP(Yrke,Levelbonus!$B$1:$CR$20,20,FALSE)","v":0},0,{"$f":"IF(ISNUMBER(VLOOKUP($A228,Rasbonus!$A$61:$AJ$295,MATCH(Ras,Rasbonus!$A$1:$AJ$1,0),FALSE)),VLOOKUP($A228,Rasbonus!$A$61:$AJ$295,MATCH(Ras,Rasbonus!$A$1:$AJ$1,0),FALSE),\"0\")","v":"0"},null,null,-23,0,0,0,0,0,0,0,0,0,0,0,0,0,0,0,0,0,0,0,0,0]
["Indexnr för att kunna leta upp kolumn"]

{"sheet":"Bonuses","index":3,"n_rows":31,"n_cols":16,"rows_kept":31,"cut":false,"hidden":false,"merged":[]}
[]
["Combat (Attacks)",null,null,null,"Statistics",null,null,null,"Most used skills",null,null,null,null,"Abilities & Drawbacks"]
["Attack","With what?","OB",null,"Statistic","Total","Current",null,"Skill","Bonus","Skill","Bonus",null,"Cost","Ability","Description"]
["Primary Attack","My magical mace",{"$f":"'Ny NPC'!$P30","v":21.666666666666664},null,"Hit Points",{"$f":"'Ny NPC'!$U43","v":25},null,null,"AM Speed",{"$f":"'Ny NPC'!$P6","v":-20},"General Perception",{"$f":"'Ny NPC'!$P17","v":13}]
["Secondary Attack","My extraordinary warhammer",{"$f":"'Ny NPC'!$P31","v":-16.25},null,"PP (incl. adder/multiplier)",{"$f":"'Ny NPC'!$P42","v":9},null,null,"AM Strength",{"$f":"'Ny NPC'!$P7","v":23}]
["Tert. Attack","My horrible crossbow",{"$f":"'Ny NPC'!$P32","v":12.5},null,"Initiative",{"$f":"'Ny NPC'!$B72","v":0}]
["Weapon Brawling",null,{"$f":"Secondary!$AK86","v":-20}]
["Shield Bash",null,{"$f":"Secondary!$AK80","v":-15}]
[]
[]
[]
[]
[]
[]
[null,"Please feel free to change the"]
[null,"above attacks to those favored"]
[]
[]
["Combat (Defenses)"]
["Defense",null,"Bonus"]
["Shield skill (incl. Shield expertise)",null,{"$f":"'Ny NPC'!$P36","v":21}]
["Total DB (incl. Inherent)",null,{"$f":"'Ny NPC'!B53","v":21}]
["Inherent DB",null,{"$f":"'Ny NPC'!$B51","v":0}]
["Stunned Maneuver",null,{"$f":"Secondary!$AK82","v":-15}]
[]
[]
[]
[]
[null,"Please feel free to change the"]
[null,"above defensive skills to those "]
[null,"favored"]

{"sheet":"Items","index":4,"n_rows":353,"n_cols":15,"rows_kept":353,"cut":false,"hidden":false,"merged":[]}
[]
["#","Item","lbs","#","Item","lbs","#","Item","lbs","#","Item (not carried)",null,"#","Herbs & Potions"]
[0,"Example Dagger",null,1,"Delicious Cookie",null,0,"Example gold coins",null,0,"Horse",null,null,"Hit Point Recovery"]
[2,"Example Waterskin",null,10,"Example Torches",null,null,null,null,null,null,null,null,"Abaas","Leaf/Ingest"]
[null,null,null,null,null,null,null,null,null,null,null,null,null,"Akbutege","Leaf/Ingest"]
[null,null,null,null,null,null,null,null,null,null,null,null,null,"Arkasu","Sap/Apply"]
[null,null,null,null,null,null,null,null,null,null,null,null,null,"Arlan","Leaf/Apply"]
[null,null,null,null,null,null,null,null,null,null,null,null,null,"Caranan","Leaves/Ingest"]
[null,null,null,null,null,null,null,null,null,null,null,null,null,"Carefree Mustard","Leaves/Brew"]
[null,null,null,null,null,null,null,null,null,null,null,null,null,"Carneyar","Flower/Brew"]
[null,null,null,null,null,null,null,null,null,null,null,null,null,"Cusamar","Flower/Ingest"]
[null,null,null,null,null,null,null,null,null,null,null,null,null,"Darsurion","Leaf/Apply"]
[null,null,null,null,null,null,null,null,null,null,null,null,null,"Draaf","Leaf/Ingest"]
[null,null,null,null,null,null,null,null,null,null,null,null,null,"Dugmuthur","Berry/Ingest"]
[null,null,null,null,null,null,null,null,null,null,null,null,null,"Fiis","Resin/Apply"]
[null,null,null,null,null,null,null,null,null,null,null,null,null,"Gariig","Cactus/Ingest"]
["#","Magical Items","lbs",null,"Location","Notes & Abilities",null,null,null,null,null,null,null,"Gefnul","Lichen/Ingest"]
[1,"Example Broadsword",4,null,"Side scabbard","Magical +10",null,null,null,null,null,null,null,"Harwite","Moss/Ingest"]
[null,null,null,null,null,null,null,null,null,null,null,null,null,"Kargijak","Berry/Paste"]
[null,null,null,null,null,null,null,null,null,null,null,null,null,"Madarch","Mushroom/Brew"]
[null,null,null,null,null,null,null,null,null,null,null,null,null,"Mirenna","Berry/Ingest"]
[null,null,null,null,null,null,null,null,null,null,null,null,null,"Reglen","Moss/Brew"]
[null,null,null,null,null,null,null,null,null,null,null,null,null,"Reglen","Moss/Brew"]
[null,null,null,null,null,null,null,null,null,null,null,null,null,"Rewk","Nodule/Brew"]
[null,null,null,null,null,null,null,null,null,null,null,null,null,"Telperion","Leaf/Ingest"]
[null,null,null,null,null,null,null,null,null,null,null,null,null,"Thurl","Clove/Brew"]
[null,null,null,null,null,null,null,null,null,null,null,null,null,"Winclamit","Fruit/Ingest"]
[null,null,null,null,null,null,null,null,null,null,null,null,null,"Yavethalion","Fruit/Ingest"]
[]
[]
[null,null,null,null,null,null,null,null,null,null,null,null,null,"Herb","Form/Prep"]
[null,null,null,null,null,null,null,null,null,null,null,null,null,"Circulatory Repair"]
[null,null,null,null,null,null,null,null,null,null,null,null,null,"Anserke","Root/Apply"]
[null,null,null,null,null,null,null,null,null,null,null,null,null,"Belan","Nut/Ingest"]
[null,null,null,null,null,null,null,null,null,null,null,null,null,"Fek","Nut/Brew"]
[null,null,null,null,null,null,null,null,null,null,null,null,null,"Golden Cress","Fern/Apply"]
[null,null,null,null,null,null,null,null,null,null,null,null,null,"Harfy","Resin/Apply"]
[null,null,null,null,null,null,null,null,null,null,null,null,null,"Hugburtun","Fruit/Brew"]
[null,null,null,null,null,null,null,null,null,null,null,null,null,"Miretars Crown","Flower/Apply"]
[null,null,null,null,null,null,null,null,null,null,null,null,null,"Rumareth","Leaves/Brew"]
[null,null,null,null,null,null,null,null,null,null,null,null,null,"Sindoluin","Flower/Apply"]
[null,null,null,null,null,null,null,null,null,null,null,null,null,"Tulaxar","Leaves/Brew"]
[]
[]
[null,null,null,null,null,null,null,null,null,null,null,null,null,"Herb","Form/Prep"]
[null,null,null,null,null,null,null,null,null,null,null,null,null,"Antidotes"]
[null,null,null,null,null,null,null,null,null,null,null,null,null,"Arduvaar","Plant/Brew"]
[null,null,null,null,null,null,null,null,null,null,null,null,null,"Argsbargie","Flower/Ingest"]
[null,null,null,null,null,null,null,null,null,null,null,null,null,"Baranie","Leaves/Brew"]
[null,null,null,null,null,null,null,null,null,null,null,null,null,"Carnerem","Leaf/Apply"]
[null,null,null,null,null,null,null,null,null,null,null,null,null,"Cashdir","Flower/Ingest"]
[null,null,null,null,null,null,null,null,null,null,null,null,null,"Culan","Leaf/Brew"]
[null,null,null,null,null,null,null,null,null,null,null,null,null,"Eldaana","Leaf/Brew"]
[null,null,null,null,null,null,null,null,null,null,null,null,null,"Elendils Basket","Root/Brew"]
[null,null,null,null,null,null,null,null,null,null,null,null,null,"Flur-rort","Flower/Liquid"]
[null,null,null,null,null,null,null,null,null,null,null,null,null,"Maiana","Leaf/Brew"]
[null,null,null,null,null,null,null,null,null,null,null,null,null,"Menelar","Cone/Brew"]
[null,null,null,null,null,null,null,null,null,null,null,null,null,"Mir-Melellen","Nectar/Apply"]
[null,null,null,null,null,null,null,null,null,null,null,null,null,"Mook","Berry/Ingest"]
[null,null,null,null,null,null,null,null,null,null,null,null,null,"Naza","Leaf/Ingest"]
[null,null,null,null,null,null,null,null,null,null,null,null,null,"Quilmufur","Root/Brew"]
[null,null,null,null,null,null,null,null,null,null,null,null,null,"Shen","Leaf/Ingest"]
[null,null,null,null,null,null,null,null,null,null,null,null,null,"Sorel nut","Nut/Ingest"]
[null,null,null,null,null,null,null,null,null,null,null,null,null,"Sweet Sorrel","Leaves/Inhale"]
[null,null,null,null,null,null,null,null,null,null,null,null,null,"Taynaga","Bark/Powder"]
[null,null,null,null,null,null,null,null,null,null,null,null,null,"Ul-Naza","Leaf/Ingest"]
[null,null,null,null,null,null,null,null,null,null,null,null,null,"Valanar","Leaf/Ingest"]
[null,null,null,null,null,null,null,null,null,null,null,null,null,"Vipersweed","Root/Brew"]
[null,null,null,null,null,null,null,null,null,null,null,null,null,"Yuth","Flower/Ingest"]
[]
[]
[null,null,null,null,null,null,null,null,null,null,null,null,null,"Herb","Form/Prep"]
[null,null,null,null,null,null,null,null,null,null,null,null,null,"Bone, Nerve, Muscle and Organ Repair"]
[null,null,null,null,null,null,null,null,null,null,null,null,null,"Arfandas","Stem/Apply"]
[null,null,null,null,null,null,null,null,null,null,null,null,null,"Arnuminas","Leaf/Apply"]
[null,null,null,null,null,null,null,null,null,null,null,null,null,"Arpsusar","Stalk/Brew"]
[null,null,null,null,null,null,null,null,null,null,null,null,null,"Baalak","Reed/Brew"]
[null,null,null,null,null,null,null,null,null,null,null,null,null,"Baldakur","Root/Brew"]
[null,null,null,null,null,null,null,null,null,null,null,null,null,"Belramba","Lichen/Brew"]
[null,null,null,null,null,null,null,null,null,null,null,null,null,"Boneset","Root/Ingest"]
[null,null,null,null,null,null,null,null,null,null,null,null,null,"Bursthelas","Stalk/Brew"]
[null,null,null,null,null,null,null,null,null,null,null,null,null,"Curfalka","Fruit/Ingest"]
[null,null,null,null,null,null,null,null,null,null,null,null,null,"Dagmather","Spine/Brew"]
[null,null,null,null,null,null,null,null,null,null,null,null,null,"Ebur","Flower/Ingest"]
[null,null,null,null,null,null,null,null,null,null,null,null,null,"Edram","Moss/Ingest"]
[null,null,null,null,null,null,null,null,null,null,null,null,null,"Febfendu ","Root/Brew"]
[null,null,null,null,null,null,null,null,null,null,null,null,null,"Gildarion","Leaf/Paste"]
[null,null,null,null,null,null,null,null,null,null,null,null,null,"Gorfon","Fruit/Ingest"]
[null,null,null,null,null,null,null,null,null,null,null,null,null,"Gursamel","Stalk/Apply"]
[null,null,null,null,null,null,null,null,null,null,null,null,null,"Hegheg","Root/Paste"]
[null,null,null,null,null,null,null,null,null,null,null,null,null,"Hoak-Foer","Flower/Ingest"]
[null,null,null,null,null,null,null,null,null,null,null,null,null,"Kakduram","Fruit/Ingest"]
[null,null,null,null,null,null,null,null,null,null,null,null,null,"Klandun","Fern/Ingest"]
[null,null,null,null,null,null,null,null,null,null,null,null,null,"Kolandor","Leaves/Apply"]
[null,null,null,null,null,null,null,null,null,null,null,null,null,"Laurre","Flower/Ingest"]
[null,null,null,null,null,null,null,null,null,null,null,null,null,"Numenelos","Moss/Powder"]
[null,null,null,null,null,null,null,null,null,null,null,null,null,"Siran","Clove/Ingest"]
[null,null,null,null,null,null,null,null,null,null,null,null,null,"Tarnas","Nodule/Brew"]
[null,null,null,null,null,null,null,null,null,null,null,null,null,"Tatharsul","Bread/Ingest"]
[null,null,null,null,null,null,null,null,null,null,null,null,null,"Terbas","Leaf/Apply"]
[null,null,null,null,null,null,null,null,null,null,null,null,null,"Ucason","Grass/Smoke"]
[null,null,null,null,null,null,null,null,null,null,null,null,null,"Ul-Ucason","Grass/Smoke"]
[null,null,null,null,null,null,null,null,null,null,null,null,null,"Wek-wek","Nodule/Brew"]
[null,null,null,null,null,null,null,null,null,null,null,null,null,"Wifurwif","Lichen/Ingest"]
[]
[]
[null,null,null,null,null,null,null,null,null,null,null,null,null,"Herb","Form/Prep"]
[null,null,null,null,null,null,null,null,null,null,null,null,null,"Nutrition"]
[null,null,null,null,null,null,null,null,null,null,null,null,null,"Chap Beech Nut","Nut/Ingest"]
[null,null,null,null,null,null,null,null,null,null,null,null,null,"Cram","Bread/Ingest"]
[null,null,null,null,null,null,null,null,null,null,null,null,null,"Furry Oak Acorn","Nut/Ingest"]
[null,null,null,null,null,null,null,null,null,null,null,null,null,"Grapeleaf","Nectar/Ingest"]
[null,null,null,null,null,null,null,null,null,null,null,null,null,"Hiam","Moss/Ingest"]
[null,null,null,null,null,null,null,null,null,null,null,null,null,"Kujanikapurd","Mushroom/Ingest"]
[null,null,null,null,null,null,null,null,null,null,null,null,null,"Lembas","Bread/Ingest"]
[null,null,null,null,null,null,null,null,null,null,null,null,null,"Lemsang","Mushroom/Ingest"]
[null,null,null,null,null,null,null,null,null,null,null,null,null,"Nelisse","Leaf/Brew"]
[null,null,null,null,null,null,null,null,null,null,null,null,null,"Ukur","Nut/Ingest"]
[null,null,null,null,null,null,null,null,null,null,null,null,null,"Ulginor","Bread/Ingest"]
[]
[]
[null,null,null,null,null,null,null,null,null,null,null,null,null,"Herb","Form/Prep"]
[null,null,null,null,null,null,null,null,null,null,null,null,null,"General Purpose Herbs"]
[null,null,null,null,null,null,null,null,null,null,null,null,null,"Ajkara","Incense/Smoke"]
[null,null,null,null,null,null,null,null,null,null,null,null,null,"Ankii","Berry/Ingest"]
[null,null,null,null,null,null,null,null,null,null,null,null,null,"Arlan","Root/Ingest"]
[null,null,null,null,null,null,null,null,null,null,null,null,null,"Arunya","Root/Brew"]
[null,null,null,null,null,null,null,null,null,null,null,null,null,"Athelas","Leaf/Brew"]
[null,null,null,null,null,null,null,null,null,null,null,null,null,"Attanar","Moss/Apply"]
[null,null,null,null,null,null,null,null,null,null,null,null,null,"Awn","Bark/Brew"]
[null,null,null,null,null,null,null,null,null,null,null,null,null,"Brorkwilb","Flower/Ingest"]
[null,null,null,null,null,null,null,null,null,null,null,null,null,"Cicino","Leaf/Brew"]
[null,null,null,null,null,null,null,null,null,null,null,null,null,"Delrean","Bark/Apply"]
[null,null,null,null,null,null,null,null,null,null,null,null,null,"Faghiu","Flower/Brew"]
[null,null,null,null,null,null,null,null,null,null,null,null,null,"Felmather","Leaf/Ingest"]
[null,null,null,null,null,null,null,null,null,null,null,null,null,"Fleabane","Leaves/Apply"]
[null,null,null,null,null,null,null,null,null,null,null,null,null,"Fukavar","Flower/Smoke"]
[null,null,null,null,null,null,null,null,null,null,null,null,null,"Harlindar","Plant/Brew"]
[null,null,null,null,null,null,null,null,null,null,null,null,null,"Hevik","Leaves/Ingest"]
[null,null,null,null,null,null,null,null,null,null,null,null,null,"Hugar","Root/Ingest"]
[null,null,null,null,null,null,null,null,null,null,null,null,null,"Joef","Plant/Ingest"]
[null,null,null,null,null,null,null,null,null,null,null,null,null,"Klynyk","Oyster/Apply"]
[null,null,null,null,null,null,null,null,null,null,null,null,null,"Latha","Stem/Brew"]
[null,null,null,null,null,null,null,null,null,null,null,null,null,"Lestagii","Crystal/Ingest"]
[null,null,null,null,null,null,null,null,null,null,null,null,null,"Lichen Gloriosa","Lichen/Apply"]
[null,null,null,null,null,null,null,null,null,null,null,null,null,"Lu-jy-Mirenna","Berry/Ingest"]
[null,null,null,null,null,null,null,null,null,null,null,null,null,"Nelthandon","Plant/Ingest"]
[null,null,null,null,null,null,null,null,null,null,null,null,null,"Red Willow","Leaf/Brew"]
[null,null,null,null,null,null,null,null,null,null,null,null,null,"Silraen","Plant/Brew"]
[null,null,null,null,null,null,null,null,null,null,null,null,null,"Sulimquelote","Flower/Brew"]
[null,null,null,null,null,null,null,null,null,null,null,null,null,"Tharm","Kelp/Apply"]
[null,null,null,null,null,null,null,null,null,null,null,null,null,"Tukamur","Grass/Brew"]
[null,null,null,null,null,null,null,null,null,null,null,null,null,"Waters of Fire","Acid/Liquid"]
[]
[]
[null,null,null,null,null,null,null,null,null,null,null,null,null,"Herb","Form/Prep"]
[null,null,null,null,null,null,null,null,null,null,null,null,null,"Physical Enhancement"]
[null,null,null,null,null,null,null,null,null,null,null,null,null,"Agaath","Berry/Ingest"]
[null,null,null,null,null,null,null,null,null,null,null,null,null,"Alshana","Bread/Ingest"]
[null,null,null,null,null,null,null,null,null,null,null,null,null,"Atigax","Root/Brew"]
[null,null,null,null,null,null,null,null,null,null,null,null,null,"Blue Eyes","Flower/Brew"]
[null,null,null,null,null,null,null,null,null,null,null,null,null,"Boskone","Powder/Inhale"]
[null,null,null,null,null,null,null,null,null,null,null,null,null,"Breldiar","Flower/Ingest"]
[null,null,null,null,null,null,null,null,null,null,null,null,null,"Chrume","Mushroom/Ingest"]
[null,null,null,null,null,null,null,null,null,null,null,null,null,"Dragul","Root/Brew"]
[null,null,null,null,null,null,null,null,null,null,null,null,null,"Ecsasse","Clove/Brew"]
[null,null,null,null,null,null,null,null,null,null,null,null,null,"Elbens Basket","Root/Brew"]
[null,null,null,null,null,null,null,null,null,null,null,null,null,"Eledena","Bud/Ingest"]
[null,null,null,null,null,null,null,null,null,null,null,null,null,"Feduilas","Flower/Smoke"]
[null,null,null,null,null,null,null,null,null,null,null,null,null,"Galenas","Leaf/Smoke"]
[null,null,null,null,null,null,null,null,null,null,null,null,null,"Gort","Leaf/Ingest"]
[null,null,null,null,null,null,null,null,null,null,null,null,null,"Gylvir","Algae/Ingest"]
[null,null,null,null,null,null,null,null,null,null,null,null,null,"Hesguratu","Bread/Ingest"]
[null,null,null,null,null,null,null,null,null,null,null,null,null,"Kaskamak","Leaves/Ingest"]
[null,null,null,null,null,null,null,null,null,null,null,null,null,"Kathkusa","Leaf/Ingest"]
[null,null,null,null,null,null,null,null,null,null,null,null,null,"Kilmakur","Root/Brew"]
[null,null,null,null,null,null,null,null,null,null,null,null,null,"Kirsemal","Bark/Brew"]
[null,null,null,null,null,null,null,null,null,null,null,null,null,"Kirtir","Buds/Inhale"]
[null,null,null,null,null,null,null,null,null,null,null,null,null,"Klagul","Bud/Brew"]
[null,null,null,null,null,null,null,null,null,null,null,null,null,"Kykykyl","Bread/Ingest"]
[null,null,null,null,null,null,null,null,null,null,null,null,null,"Lothnimgil","Flower/Ingest"]
[null,null,null,null,null,null,null,null,null,null,null,null,null,"Marku","Nut/Ingest"]
[null,null,null,null,null,null,null,null,null,null,null,null,null,"Megillos","Leaf/Ingest"]
[null,null,null,null,null,null,null,null,null,null,null,null,null,"Merrig","Thorn/Brew"]
[null,null,null,null,null,null,null,null,null,null,null,null,null,"Phacalus","Root/Ingest"]
[null,null,null,null,null,null,null,null,null,null,null,null,null,"Rud-tekma","Fruit/Ingest"]
[null,null,null,null,null,null,null,null,null,null,null,null,null,"Sailchas","Flower/Wear"]
[null,null,null,null,null,null,null,null,null,null,null,null,null,"Sha","Flower/Brew"]
[null,null,null,null,null,null,null,null,null,null,null,null,null,"Splayfoot","Seeds/Brew"]
[null,null,null,null,null,null,null,null,null,null,null,null,null,"Sweet Galenas","Leaf/Smoke"]
[null,null,null,null,null,null,null,null,null,null,null,null,null,"Swigmakril","Flower/Brew"]
[null,null,null,null,null,null,null,null,null,null,null,null,null,"Tartiella","Leaf/Smoke"]
[null,null,null,null,null,null,null,null,null,null,null,null,null,"Thembitul","Flower/Ingest"]
[null,null,null,null,null,null,null,null,null,null,null,null,null,"Trudurs","Moss/Brew"]
[null,null,null,null,null,null,null,null,null,null,null,null,null,"Yaran","Pollen/Ingest"]
[null,null,null,null,null,null,null,null,null,null,null,null,null,"Zulsendura","Mushroom"]
[null,null,null,null,null,null,null,null,null,null,null,null,null,"Zur","Fungus/Brew"]
[]
[]
[null,null,null,null,null,null,null,null,null,null,null,null,null,"Herb","Form/Prep"]
[null,null,null,null,null,null,null,null,null,null,null,null,null,"Burn and Exposure Relief"]
[null,null,null,null,null,null,null,null,null,null,null,null,null,"Alambas","Grass/Apply"]
[null,null,null,null,null,null,null,null,null,null,null,null,null,"Aloe","Leaf/Apply"]
[null,null,null,null,null,null,null,null,null,null,null,null,null,"Culkas","Leaf/Apply"]
[null,null,null,null,null,null,null,null,null,null,null,null,null,"Himros","Leaves/Apply"]
[null,null,null,null,null,null,null,null,null,null,null,null,null,"Jojojopo","Leaf/Apply"]
[null,null,null,null,null,null,null,null,null,null,null,null,null,"Kelventari","Berry/Rub"]
[null,null,null,null,null,null,null,null,null,null,null,null,null,"Telek","Berry/Apply"]
[null,null,null,null,null,null,null,null,null,null,null,null,null,"Veldurak","Kelp/Apply"]
[null,null,null,null,null,null,null,null,null,null,null,null,null,"Vessin","Clams/Apply"]
[]
[]
[null,null,null,null,null,null,null,null,null,null,null,null,null,"Herb","Form/Prep"]
[null,null,null,null,null,null,null,null,null,null,null,null,null,"Poisons and Rotten things"]
[null,null,null,null,null,null,null,null,null,null,null,null,null,"Acaana","Flower/Paste"]
[null,null,null,null,null,null,null,null,null,null,null,null,null,"Adder Venom","Venom/Paste"]
[null,null,null,null,null,null,null,null,null,null,null,null,null,"Ancalthur","Grass/Liquid"]
[null,null,null,null,null,null,null,null,null,null,null,null,null,"Angurth","Bacteria/Paste"]
[null,null,null,null,null,null,null,null,null,null,null,null,null,"Asgurash","Snake/Paste"]
[null,null,null,null,null,null,null,null,null,null,null,null,null,"Asp Venom","Venom/Paste"]
[null,null,null,null,null,null,null,null,null,null,null,null,null,"Athanar","Snake/Liquid"]
[null,null,null,null,null,null,null,null,null,null,null,null,null,"Black Vines","Leaf/Liquid"]
[null,null,null,null,null,null,null,null,null,null,null,null,null,"Blade Hemlock","Plant/Paste"]
[null,null,null,null,null,null,null,null,null,null,null,null,null,"Bragolith","Juice/Ingest"]
[null,null,null,null,null,null,null,null,null,null,null,null,null,"Brithagurth","Roots/Paste"]
[null,null,null,null,null,null,null,null,null,null,null,null,null,"Bukandas Bulch","Wolves/Juice"]
[null,null,null,null,null,null,null,null,null,null,null,null,null,"Carcalen","Moss/Brew"]
[null,null,null,null,null,null,null,null,null,null,null,null,null,"Carnegurth","Flower/Liquid"]
[null,null,null,null,null,null,null,null,null,null,null,null,null,"Cathaana","Nut/Ingest"]
[null,null,null,null,null,null,null,null,null,null,null,null,null,"Craeg-Curfluin","Plant/Liquid"]
[null,null,null,null,null,null,null,null,null,null,null,null,null,"Cyclic Fever","Ticks/Paste"]
[null,null,null,null,null,null,null,null,null,null,null,null,null,"Daxamas","Leaves/Ingest"]
[null,null,null,null,null,null,null,null,null,null,null,null,null,"Deadly Milkwhite Trumpet","Flower/contact/ inhalation"]
[null,null,null,null,null,null,null,null,null,null,null,null,null,"Deadly Milkwhite Trumpet","Seed/Ingest"]
[null,null,null,null,null,null,null,null,null,null,null,null,null,"Dinfuin","Moss oil/Ingest"]
[null,null,null,null,null,null,null,null,null,null,null,null,null,"Dolimor","Fungus/Ingest"]
[null,null,null,null,null,null,null,null,null,null,null,null,null,"Dynallca","Leaf/Paste"]
[null,null,null,null,null,null,null,null,null,null,null,null,null,"Etarka","Fish/Liquid"]
[null,null,null,null,null,null,null,null,null,null,null,null,null,"Falsereg","Blood/Paste"]
[null,null,null,null,null,null,null,null,null,null,null,null,null,"Galenaana","Leaf/Powder"]
[null,null,null,null,null,null,null,null,null,null,null,null,null,"Gartaan","Waters/Ingest"]
[null,null,null,null,null,null,null,null,null,null,null,null,null,"Gorfang","Moss/Liquid"]
[null,null,null,null,null,null,null,null,null,null,null,null,null,"Grelnixar","Leaves/Apply"]
[null,null,null,null,null,null,null,null,null,null,null,null,null,"Greneldar","Flower/Apply"]
[null,null,null,null,null,null,null,null,null,null,null,null,null,"Gurth-nu-fuin","Virus/Anaerobic"]
[null,null,null,null,null,null,null,null,null,null,null,null,null,"Gwin-win-Rynd","Bat/Liquid"]
[null,null,null,null,null,null,null,null,null,null,null,null,null,"Heen","Seeds/Ingest"]
[null,null,null,null,null,null,null,null,null,null,null,null,null,"Henuial","Liquid/Inject"]
[null,null,null,null,null,null,null,null,null,null,null,null,null,"Hith-i-girith","Leaf/Liquid"]
[null,null,null,null,null,null,null,null,null,null,null,null,null,"Hulmiikak","Ants/Paste"]
[null,null,null,null,null,null,null,null,null,null,null,null,null,"Igturfas","Snakes/Liquid"]
[null,null,null,null,null,null,null,null,null,null,null,null,null,"Jadaras","Grass/Brew"]
[null,null,null,null,null,null,null,null,null,null,null,null,null,"Jegga","Bats/Paste"]
[null,null,null,null,null,null,null,null,null,null,null,null,null,"Jeggarukh","Bats/Powder"]
[null,null,null,null,null,null,null,null,null,null,null,null,null,"Jitsu","Clams/Ingest"]
[null,null,null,null,null,null,null,null,null,null,null,null,null,"Jitsutyr","Clams/Paste"]
[null,null,null,null,null,null,null,null,null,null,null,null,null,"Juth","Scorpion/Liquid"]
[null,null,null,null,null,null,null,null,null,null,null,null,null,"Kaktu","Flower/Liquid"]
[null,null,null,null,null,null,null,null,null,null,null,null,null,"Kalmogs Spoor","Leaves/Paste"]
[null,null,null,null,null,null,null,null,null,null,null,null,null,"Karfar","Leaf/Paste"]
[null,null,null,null,null,null,null,null,null,null,null,null,null,"Klabas","Buds/Ingest"]
[null,null,null,null,null,null,null,null,null,null,null,null,null,"Kly","Berry/Paste"]
[null,null,null,null,null,null,null,null,null,null,null,null,null,"Klytun","Root/Paste"]
[null,null,null,null,null,null,null,null,null,null,null,null,null,"Kuwurn Yorf","Mold/Ingest"]
[null,null,null,null,null,null,null,null,null,null,null,null,null,"Lawrim","Lichen/Paste"]
[null,null,null,null,null,null,null,null,null,null,null,null,null,"Lhugruth","Dragon/Liquid"]
[null,null,null,null,null,null,null,null,null,null,null,null,null,"Lothfelag","Resin/Ingest"]
[null,null,null,null,null,null,null,null,null,null,null,null,null,"Lus","Flower/Paste"]
[null,null,null,null,null,null,null,null,null,null,null,null,null,"Madwort","Leaves/Paste"]
[null,null,null,null,null,null,null,null,null,null,null,null,null,"Moourark","Venom/Paste"]
[null,null,null,null,null,null,null,null,null,null,null,null,null,"Morgurth","Blood/Ingest"]
[null,null,null,null,null,null,null,null,null,null,null,null,null,"Muilfana","Sap/Liquid"]
[null,null,null,null,null,null,null,null,null,null,null,null,null,"Murnan","Sap/Apply"]
[null,null,null,null,null,null,null,null,null,null,null,null,null,"Nen Calgalen","Root/Paste"]
[null,null,null,null,null,null,null,null,null,null,null,null,null,"Nimnaur","Spider/Liquid"]
[null,null,null,null,null,null,null,null,null,null,null,null,null,"Ondohithui","Lichen/Paste"]
[null,null,null,null,null,null,null,null,null,null,null,null,null,"Ondokamba","Bat/Liquid"]
[null,null,null,null,null,null,null,null,null,null,null,null,null,"Orn","Sap/Apply"]
[null,null,null,null,null,null,null,null,null,null,null,null,null,"Pangwood","Tree/Contact"]
[null,null,null,null,null,null,null,null,null,null,null,null,null,"Pawlun","Sap/Ingest"]
[null,null,null,null,null,null,null,null,null,null,null,null,null,"Rorkandiis","Saliva/Paste"]
[null,null,null,null,null,null,null,null,null,null,null,null,null,"Ruth-i-Iaur","Drakes/Liquid"]
[null,null,null,null,null,null,null,null,null,null,null,null,null,"Ruthin","Crystal/Liquid"]
[null,null,null,null,null,null,null,null,null,null,null,null,null,"Sarnumen","Eel/Liquid"]
[null,null,null,null,null,null,null,null,null,null,null,null,null,"Seregmor","Flower/Paste"]
[null,null,null,null,null,null,null,null,null,null,null,null,null,"Sharduvaak","Berry/Liquid"]
[null,null,null,null,null,null,null,null,null,null,null,null,null,"Sharkasar","Root/Paste"]
[null,null,null,null,null,null,null,null,null,null,null,null,null,"Shirilos","Seeds/Brew"]
[null,null,null,null,null,null,null,null,null,null,null,null,null,"Shutinis","Hultif Bug/Paste"]
[null,null,null,null,null,null,null,null,null,null,null,null,null,"Silmaana","Stalk/Powder"]
[null,null,null,null,null,null,null,null,null,null,null,null,null,"Slird","Fruit/Paste"]
[null,null,null,null,null,null,null,null,null,null,null,null,null,"Slota","Spider/Paste"]
[null,null,null,null,null,null,null,null,null,null,null,null,null,"Spider Venom","Venom/Paste"]
[null,null,null,null,null,null,null,null,null,null,null,null,null,"Surlok","Fish Spines/Inject"]
[null,null,null,null,null,null,null,null,null,null,null,null,null,"Thrang","Panther/Glands"]
[null,null,null,null,null,null,null,null,null,null,null,null,null,"Thrayniis","Liquid/Ingest"]
[null,null,null,null,null,null,null,null,null,null,null,null,null,"Thurviik","Gas/Gas"]
[null,null,null,null,null,null,null,null,null,null,null,null,null,"Trusa","Frog/Paste"]
[null,null,null,null,null,null,null,null,null,null,null,null,null,"Ul-acaana","Flower/Paste"]
[null,null,null,null,null,null,null,null,null,null,null,null,null,"Uraana","Leaf/Paste"]
[null,null,null,null,null,null,null,null,null,null,null,null,null,"Water Hemlock","Plant/Liquid"]
[null,null,null,null,null,null,null,null,null,null,null,null,null,"Vaxvarna","Disease/Contact"]
[null,null,null,null,null,null,null,null,null,null,null,null,null,"Wek-baas","Fish/Liquid"]
[null,null,null,null,null,null,null,null,null,null,null,null,null,"Vemaak","Hornets/Paste"]
[null,null,null,null,null,null,null,null,null,null,null,null,null,"Wolfstooth","Root/Paste"]
[null,null,null,null,null,null,null,null,null,null,null,null,null,"Worlclivur","Lichen/Paste"]
[null,null,null,null,null,null,null,null,null,null,null,null,null,"Wt Berried Yew","Berry/Ingest"]
[null,null,null,null,null,null,null,null,null,null,null,null,null,"Vuraana","Flower/Paste"]
[null,null,null,null,null,null,null,null,null,null,null,null,null,"Yake Ferns","Sap/Ingest"]
[null,null,null,null,null,null,null,null,null,null,null,null,null,"Zaganzar","Root/Liquid"]
[]
[]
[null,null,null,null,null,null,null,null,null,null,null,null,null,"Herb","Form/Prep"]
[null,null,null,null,null,null,null,null,null,null,null,null,null,"Life Preservation"]
[null,null,null,null,null,null,null,null,null,null,null,null,null,"Berterin","Moss/Brew"]
[null,null,null,null,null,null,null,null,null,null,null,null,null,"Pathur","Nodule/Brew"]
[null,null,null,null,null,null,null,null,null,null,null,null,null,"Pargen","Berries/ingest"]
[null,null,null,null,null,null,null,null,null,null,null,null,null,"Carcatu","Grass/Apply"]
[null,null,null,null,null,null,null,null,null,null,null,null,null,"Siriena","Grass/Brew"]
[null,null,null,null,null,null,null,null,null,null,null,null,null,"Olvar","Flower/Ingest"]
[null,null,null,null,null,null,null,null,null,null,null,null,null,"Degiik","Leaf/Ingest"]
[null,null,null,null,null,null,null,null,null,null,null,null,null,"Eddij","Berry/Juice"]
[null,null,null,null,null,null,null,null,null,null,null,null,null,"Chebkuile","Moss/Ingest"]
[null,null,null,null,null,null,null,null,null,null,null,null,null,"Nur-Oiolosse","Clove/Ingest"]
[null,null,null,null,null,null,null,null,null,null,null,null,null,"Mur","Resin/Apply"]
[null,null,null,null,null,null,null,null,null,null,null,null,null,"Oiolosse","Clove/Ingest"]
[null,null,null,null,null,null,null,null,null,null,null,null,null,"Tyr-fira","Leaf/Apply"]
[null,null,null,null,null,null,null,null,null,null,null,null,null,"Lothfelag","Flower/Ingest"]
[null,null,null,null,null,null,null,null,null,null,null,null,null,"Laurelin","Leaf/Ingest"]
[null,null,null,null,null,null,null,null,null,null,null,null,null,"Vulcurax","Berry/Apply"]
[]
[]
[null,null,null,null,null,null,null,null,null,null,null,null,null,"Herb","Form/Prep"]
[null,null,null,null,null,null,null,null,null,null,null,null,null,"Pain Reduction"]
[null,null,null,null,null,null,null,null,null,null,null,null,null,"Camomile","Flower/Brew"]
[null,null,null,null,null,null,null,null,null,null,null,null,null,"Corfura","Root/Brew"]
[null,null,null,null,null,null,null,null,null,null,null,null,null,"Margath","Leaf/Paste"]
[null,null,null,null,null,null,null,null,null,null,null,null,null,"Tarfeg","Flower/Ingest"]
[null,null,null,null,null,null,null,null,null,null,null,null,null,"Teldalion","Bark/Apply"]
[null,null,null,null,null,null,null,null,null,null,null,null,null,"Witch-Hazel","Flower/Brew"]
[null,null,null,null,null,null,null,null,null,null,null,null,null,"Ylvort","Flower/Brew"]
[]
[]
[null,null,null,null,null,null,null,null,null,null,null,null,null,"Herb","Form/Prep"]
[null,null,null,null,null,null,null,null,null,null,null,null,null,"Stun Relief"]
[null,null,null,null,null,null,null,null,null,null,null,null,null,"Bergamot","Flower/Brew"]
[null,null,null,null,null,null,null,null,null,null,null,null,null,"Gramursh","Moss/Powder"]
[null,null,null,null,null,null,null,null,null,null,null,null,null,"Januk-ty","Root/Brew"]
[null,null,null,null,null,null,null,null,null,null,null,null,null,"Laurus","Tobacco/Insert"]
[null,null,null,null,null,null,null,null,null,null,null,null,null,"Suranie","Berry/Ingest"]
[null,null,null,null,null,null,null,null,null,null,null,null,null,"Welwal","Leaf/Ingest"]
[null,null,null,null,null,null,null,null,null,null,null,null,null,"Vinuk","Root/Brew"]
[null,null,null,null,null,null,null,null,null,null,null,null,null,"Witav","Leaf/Ingest"]

{"sheet":"Spells","index":5,"n_rows":19,"n_cols":15,"rows_kept":19,"cut":false,"hidden":false,"merged":[]}
[]
["Known Spell Lists",null,null,null,"Favourite Spells or entire spell lists",null,null,null,null,null,"Favourite Spells"]
["Lvl","Spell list","Book",null,"Lvl","Spell","Book","A","Duration",null,"Lvl","Spell list","Book","A","Duration"]
[20,"Weapon enchantments","Öberg",null,13,"Hammerstrike II, x2 damage","Öberg",null,{"$f":"CONCATENATE(Level*2,\" rnd\")","v":"6 rnd"},null,1,"Sly ears","RMCII","x",{"$f":"CONCATENATE(Level*10*2,\" min\")","v":"60 min"}]
[10,"Earth law","SpLaw",null,16,"Eldritch weapon II","Öberg",null,{"$f":"CONCATENATE(Level,\" rnd\")","v":"3 rnd"},null,2,"Nightvision","RMCII",null,{"$f":"CONCATENATE(Level*10*2,\" min\")","v":"60 min"}]
[10,"Sense enhanchement","RMCII",null,3,"Stoneskin I, AT12","RMCVII",null,{"$f":"CONCATENATE(Level*2,\" rnd\")","v":"6 rnd"},null,3,"Smelling","RMCII","x","60 min"]
[10,"Movement enhancement","RMCII",null,5,"Earthmight II, +20 ST","RMCVII",null,{"$f":"CONCATENATE(Level*2,\" rnd\")","v":"6 rnd"},null,4,"Sidevision","RMCII","x","60 min"]
[5,"Invisible ways","SpLaw",null,3,"Stun relief I*","SpLaw",null,null,null,5,"Tasting","RMCII",null,"60 min"]
[10,"Earth forms","RMCVII",null,9,"Stun relief III*","SpLaw",null,null,null,6,"Sharp eyes","RMCII","x","60 min"]
[20,"Body renewal","SpLaw",null,1,"Blur*","Ess.C",null,{"$f":"CONCATENATE(Level*2,\" min\")","v":"6 min"},null,7,"Fine touch","RMCII","x","60 min"]
[10,"Highriding","RMCII",null,7,"Mirror image I","Ess.C","x",{"$f":"CONCATENATE(Level*2,\" min\")","v":"6 min"},null,9,"Watervision","RMCII","x","60 min"]
[10,"Minds touch","RMCII",null,9,"Displacement III*, 30%","Ess.C","x",{"$f":"CONCATENATE(Level*2,\" min\")","v":"6 min"},null,10,"Darkvision","RMCII","x","60 min"]
[null,"Rapid ways","SpLaw",null,10,"Parry illusion*","Ess.C",null,{"$f":"CONCATENATE(Level*2,\" rnd\")","v":"6 rnd"},null,4,"Silent movement*","RMCII",null,{"$f":"CONCATENATE(Level*10*2,\" min\")","v":"60 min"}]
[null,"Unbarring ways","SpLaw",null,null,null,null,null,null,null,5,"Suggestion","RMCII"]
[20,"Familiar mastery","Ess.C",null,null,null,null,null,null,null,9,"Master of kind","RMCII",null,{"$f":"CONCATENATE(Level*10*2,\" min\")","v":"60 min"}]
[5,"Sustain body","Ess.C",null,null,null,null,null,null,null,4,"Leaving I","RMCII"]
[10,"Combat illusions","Ess.C",null,null,null,null,null,null,null,7,"Leaving II, 200'","RMCII"]
[null,null,null,null,null,null,null,null,null,null,10,"Long door I","RMCII"]
[null,null,null,null,null,null,null,null,null,null,2,"Shadow","Ess.C","x",{"$f":"CONCATENATE(Level*10*2,\" min\")","v":"60 min"}]

{"sheet":"Rasbonus","index":6,"n_rows":295,"n_cols":36,"rows_kept":295,"cut":false,"hidden":false,"merged":[]}
[null,"Dwarf","Noldo (Academic)","Noldo (Martial)","Sinda","Silvan","Half-elf","Hobbit","Northman","Eothraim","Lesser Dunadan","Common (rural)","Common (city-folk)","Corsair","Dorwinadan","Wose","Woodman","Beorning","Greater Dunadan","Dunlending","Black Numenorean","Easterling","Sagath/Logath","Gathmarim","Variag","Orc","Uruk-Hai","Half-orc","Half-troll","Forest Troll","Stone Troll","Hill Troll","Snow Troll","Mountain Troll","Cave Troll","Olog-Hai"]
["Constitution",15,10,10,5,0,5,15,5,5,5,5,5,5,5,5,5,15,10,10,10,5,5,5,5,10,15,10,15,20,35,25,30,30,40,35]
["Agility",-5,15,15,10,10,5,15,0,0,0,0,0,0,0,0,5,0,0,0,0,5,0,0,0,0,0,0,0,0,-10,-10,-10,-10,-10,-5]
["Self Discipline",5,0,0,0,0,0,0,5,5,5,0,0,0,5,0,0,0,5,0,5,-5,0,-5,-5,-5,0,0,0,-5,-10,-10,-10,-10,-10,-5]
["Reasoning",0,5,5,0,0,0,0,0,0,0,0,0,0,0,0,0,0,0,0,0,0,0,0,0,-5,0,0,-5,-10,-15,-15,-15,-15,-15,-5]
["Eloquence",0,0,0,0,0,0,0,0,0,0,0,0,0,0,0,0,0,0,0,0,0,0,0,0,0,0,0,0,0,-5,0,0,0,-5,0]
["Strength",10,0,0,0,0,5,-15,10,10,5,5,5,5,5,5,5,15,10,10,10,5,5,5,5,5,10,5,15,15,30,20,25,25,35,30]
["Quickness",-5,5,5,10,10,5,15,0,0,0,0,0,5,0,0,0,-5,0,0,0,5,5,10,5,0,0,0,-5,-5,-10,-10,-15,-15,-15,-10]
["Presence",-5,15,15,10,5,5,-5,0,0,5,0,0,0,0,-5,0,5,10,0,10,0,0,0,0,-10,0,-5,-5,-10,-10,-10,-10,-10,-10,-10]
["Intuition",0,5,5,5,5,0,-5,0,0,0,0,0,0,0,5,0,0,0,0,0,0,0,0,0,-10,0,-5,-5,-10,-10,-10,-10,-10,-10,-10]
["Empathy",-5,5,5,0,0,0,0,0,0,0,0,0,0,0,0,0,0,5,0,0,-5,0,-5,-5,-10,-5,-5,-5,-10,-10,-10,-10,-10,-10,-10]
["Appearance",null,null,null,null,null,null,null,null,null,null,null,null,null,null,null,null,null,null,null,null,null,null,null,null,null,null,null,null,null,null,null,null,null,null,1]
["Hit D type","D10","D10","D10","D8","D8","D10","D8","D10","D10","D8","D8","D8","D8","D8","D8","D8","D10","D10","D10","D10","D8","D8","D8","D8","D8","D10","D8","D10","D10","D12","D12","D12","D12","D12","D12"]
["Soul Departure",18,1,1,2,3,5,18,12,12,12,12,12,12,12,12,12,12,10,12,10,12,12,12,12,2,2,6,8,3,3,3,3,3,3,6]
["Rec. Mult",0.5,3,3,2,1.5,1.5,0.5,1,1,null,1,1,1,1,1,1,0.75,0.75,1,0.75,1,1,1,1,0.8,0.8,1,0.8,0.5,0.5,0.5,0.5,0.5,0.5,0.5]
["Max Hits",120,120,120,110,100,130,60,130,130,120,120,120,120,120,120,120,150,140,120,140,120,120,110,120,120,140,120,160,150,170,180,200,180,240,200]
["RR Fear",0,0,0,0,0,0,0,0,0,0,0,0,0,0,0,0,0,0,0,0,0,0,0,0,0,0,0,0,0,0,0,0,0,0,0]
["RR Disease",10,100,100,100,100,50,30,0,0,0,0,0,0,0,0,0,0,5,0,5,0,0,0,0,0,0,0,0,0,10,0,20,0,0,0]
["RR Poison",10,10,10,10,10,5,15,0,0,0,0,0,0,30,0,0,0,5,0,5,0,0,0,0,0,0,0,0,0,10,0,20,0,0,0]
["RR Essence",40,0,0,0,0,0,50,0,0,0,0,0,0,0,20,0,0,0,0,0,0,0,0,0,0,0,0,0,0,0,0,0,0,0,0]
["RR Channeling",0,0,0,0,0,0,20,0,0,0,0,0,0,0,10,0,0,0,0,0,0,0,0,0,0,0,0,0,0,0,0,0,0,0,0]
["RR Mentalism",40,0,0,0,0,0,40,0,0,0,0,0,0,0,0,0,0,0,0,0,0,0,0,0,0,0,0,0,0,0,0,0,0,0,0]
["B. opt",350,275,275,300,325,300,450,375,350,350,425,425,400,400,400,400,300,275,375,300,400,375,375,400,200,300,300,250,200,200,200,200,200,200,300]
["vs Cold",30,20,20,15,10,5,0,0,0,0,0,0,0,0,0,0,0,0,0,0,0,0,0,0,0,0,0,0,0,10,0,30,0,20,20]
["vs Heat",30,0,0,0,0,0,0,0,0,0,0,0,0,0,0,0,0,0,0,0,0,0,0,0,30,0,0,15,0,10,0,0,0,10,20]
["Spell list",0.03,0.5,0.3,0.3,0.2,0.1,"N/A",0,0,0.1,0.03,0.15,0.05,0.1,0.05,0.03,0.03,0.25,0.02,0.25,0.02,0.02,0.02,0.02,0,0,0,0,0,0,0,0,0,0,0]
[]
["Adolescent skills"]
["1H Crush",4,null,null,null,null,null,null,null,null,null,null,null,null,1,2,null,null,null,2,null,null,null,null,null,3,1,3,2,2,null,3,2,3,3,3]
["1H Slash",null,null,2,2,2,2,null,2,2,2,1,1,2,1,null,1,null,2,null,3,1,2,2,2,null,4,null,null,null,null,null,null,null,null,3]
["1H Thrust",null,null,null,1,null,null,null,null,null,null,null,null,1,null,null,null,null,1,null,2,null,null,null,null,null,1]
["2 Handed",2,null,2,null,null,null,null,2,null,1,null,null,null,null,null,null,2,2,null,3,null,null,null,null,null,1,null,4,3,3,3,3,3,4,5]
["AM Balance",null,null,null,null,1,null,null,null,null,null,null,null,2,null,null,1,null,null,null,null,1,1,2]
["AM Speed",null,null,null,null,null,null,1,null,null,null,null,null,1,null,null,null,null,null,null,null,1,null,2]
["AM Strength",2,null,null,null,null,null,null,null,null,null,null,null,null,null,null,null,2,null,null,null,null,null,null,null,null,null,null,1,1,1,2,2,2,2,2]
["Ambush",null,null,null,null,null,null,null,null,null,null,null,null,null,null,2,null,null,null,null,null,null,null,null,null,1,1,1]
["Body Development",3,1,2,1,1,1,2,2,2,2,2,1,2,1,3,2,3,3,3,3,2,2,1,2,2,3,2,4,4,5,5,5,5,5,5]
["Bow",1,null,1,2,3,2,2,1,1,1,1,1,1,1,null,2,null,1,1,1,2,2,1,1,null,1,1]
["Climbing",1,null,null,1,2,1,2,1,null,null,1,null,2,null,3,3,2,null,5,null,null,null,1,null,1,1,1,1,1,1,1,1,2,1,1]
["Disarm traps",1,null,null,null,null,null,1]
["General perception",1,3,3,3,3,1,4,1,1,1,1,1,1,1,2,1,1,1,1,1,1,2,1,1,1,1,1,1,1,null,1,1,1,1,1]
["MA Strikes",2,null,null,null,null,null,null,null,null,null,null,null,null,null,null,null,2,null,null,null,null,null,2,null,null,null,null,2,2,4,3,3,3,4,4]
["MA Sweeps",null,null,null,null,null,null,null,null,null,null,null,null,null,null,null,null,null,null,null,null,null,null,2]
["Man. Chain",3,null,null,null,null,1,null,2,2,2,1,null,null,null,null,null,null,2,null,3,null,null,null,2,2,3,1,3,null,null,null,null,null,null,2]
["Man. Plate",1,null,null,null,null,1,null,null,null,null,null,null,null,null,null,null,null,1,null,2,null,null,null,null,null,2,null,3,null,null,null,null,null,null,2]
["Man. Rigid L",1,null,null,null,null,1,null,1,1,1,1,null,2,1,null,null,null,1,1,1,1,1,null,1,3,2,3,2]
["Man. Soft L",1,null,null,1,1,null,null,1,1,1,1,1,1,1,3,2,1,null,1,null,1,1,1,1,2,1,1,1]
["Pick locks",2,null,null,null,null,null,1]
["Polearm",null,null,null,1,1,null,null,null,2,1,1,null,null,1,1,1,2,1,2,null,2,null,null,2,1,1,1,null,null,null,null,2,null,null,2]
["Riding",null,1,1,1,1,1,null,1,8,1,1,1,null,2,null,null,null,1,null,1,5,5,null,1]
["Runes",null,2,1,1,null,1,null,null,null,1,null,null,null,null,null,null,null,1,null,2]
["Shield",2,null,2,1,1,1,null,1,1,1,1,null,1,null,null,null,null,1,1,2,1,1,1,1,1,2,1,null,null,null,null,null,null,null,2]
["Stalk & Hide",null,1,2,3,4,2,5,1,1,null,1,1,null,null,4,4,4,null,2,null,1,null,2,null,1,null,null,null,1]
["Staves & wands",2,2,2,1,1,1,null,null,null,1,null,1,null,null,null,null,null,1,null,2]
["Swimming",null,1,2,2,3,1,null,null,null,1,1,1,2,null,2,1,2,1,1,1,null,null,1]
["Thrown",1,null,null,null,null,null,2,null,null,null,1,null,1,1,4,1,1,null,2,null,1,2,null,2,1,1,1,2,2,1,2,1,2,2,2]
[]
["Total",{"$f":"SUM(B29:B56)","v":30},{"$f":"SUM(C29:C56)","v":11},20,21,24,17,20,16,22,17,15,9,19,11,26,19,22,20,22,{"$f":"SUM(U29:U56)","v":27},20,19,19,16,19,26,17,26,17,15,20,20,21,22,34]
[]
["Racial bonuses"]
["AM Balance",null,null,null,null,10,null,null,null,null,null,null,null,10,null,null,20,null,null,20,null,null,5,10]
["AM Landing",null,null,null,null,null,null,null,null,null,null,null,null,null,null,null,null,null,null,null,null,null,null,10]
["AM Leaping",null,null,null,null,null,null,null,null,null,null,null,null,null,null,null,null,null,null,null,null,null,null,10]
["AM Speed",null,null,null,null,null,null,null,null,null,null,null,null,null,null,null,null,null,null,null,null,null,null,10]
["AM Strength",null,null,null,null,null,null,null,null,null,null,null,null,null,null,null,null,null,null,null,null,null,null,null,null,null,null,null,10,10,20,10,15,20,20,20]
["Adrenal Defense"]
["Armored AD"]
["Ambush",null,null,null,null,null,null,null,null,null,null,null,null,null,null,10]
["Sniping",null,null,null,null,null,null,null,null,null,null,null,null,null,null,10]
["Body Development",null,null,null,null,null,null,null,null,null,null,null,null,null,null,null,null,null,null,null,null,null,null,null,null,null,null,null,10,15,20,20,20,20,20,20]
["Channeling",null,null,null,null,null,null,null,null,null,null,null,null,null,null,10]
["Climbing",null,null,null,null,null,null,null,null,null,null,null,null,null,null,null,20,null,null,20,null,null,null,10]
["Directed Spells"]
["Disarm Traps"]
["General Perception",null,20,20,20,20]
["MA Strikes"]
["MA Sweeps"]
["Man. Soft L"]
["Man. Rigid L"]
["Man. Chain"]
["Man. Plate"]
["Pick locks"]
["Riding",null,null,null,null,null,null,null,null,20,null,null,null,null,null,null,null,null,null,null,null,10]
["Runes",null,20]
["Staves & Wands",null,20,20]
["Stalk & Hide",null,null,null,null,10]
["Swimming"]
["Administration",null,10,null,null,null,null,null,null,null,null,null,null,null,null,null,null,null,10,null,10]
["Alchemy",null,10]
["Architecture",null,10,null,null,null,null,null,null,null,null,null,null,null,null,null,null,null,10,null,10]
["Basic Mathematics",null,10,null,null,null,null,null,null,null,null,null,null,null,null,null,null,null,10,null,10]
["Biochemistry",null,10]
["Boat Pilot",null,10,null,10,null,null,null,null,null,null,null,null,10,10]
["Cryptography",null,10]
["Demon/Devil Lore",null,10]
["Drafting",null,10]
["Dragon Lore",null,10]
["Engineering",null,10]
["Faerie Lore",null,10]
["Fauna Lore",null,10,null,null,10,null,null,null,null,null,null,null,null,null,null,10,20]
["Flora Lore",null,10,null,null,10,null,null,null,null,null,null,null,null,null,10,10]
["Heraldry",null,10,null,null,null,null,null,null,null,null,null,null,null,5,null,null,null,10,null,10]
["Herb Lore",null,10,null,null,10,null,null,null,null,null,null,null,null,5,10]
["Lock Lore",10,10]
["Mapping",null,10]
["Mechanition",null,10]
["Metal Lore",10,10]
["Military Organization",null,10,null,null,null,null,null,null,null,null,null,null,10,null,null,null,null,10,null,10,null,null,null,null,null,5]
["Mining",10,10]
["Navigation",null,10,null,10,null,null,null,null,null,null,null,null,15,10]
["Phil/Relig. Doctrine",null,10]
["Poison Lore",null,10,null,null,null,null,null,null,null,null,null,null,null,10,10]
["Racial History",null,10,null,null,null,null,null,null,null,null,null,null,null,null,null,null,null,10,null,10]
[null,null,10]
["Sanity Healing Lore",null,10]
["Siege Engineer",null,10]
["Spec. know. Lore",null,10]
[null,null,10]
["Star-gazing",null,10,null,null,null,null,null,null,null,null,null,null,10,5]
["Stone Lore",10,10]
["Tactics",null,10,null,null,null,null,null,null,null,null,null,null,null,null,null,null,null,10,null,10,null,null,null,null,null,5]
["Trading lore",null,10,null,null,null,null,null,null,null,null,null,null,null,10]
["Weather Watching",null,10,null,10,null,null,null,null,null,null,null,null,25,5,10,null,10]
["Animal handling",null,null,null,null,10,null,null,null,10,null,null,null,null,null,null,5,15,null,null,null,10,20]
["Animal training",null,null,null,null,10,null,null,null,10,null,null,null,null,null,null,5,15,null,null,null,10,20]
["Beast Master",null,null,null,null,10,null,null,null,null,null,null,null,null,null,5,null,25,null,null,null,null,null,null,null,null,null,null,null,10]
["Driving",null,null,null,null,null,null,null,null,null,null,null,null,null,5,null,null,null,null,10,null,10,10]
["Herding",null,null,null,null,null,null,null,null,null,null,null,null,null,null,null,null,10]
["Loading"]
["Athletic Games",null,null,null,null,null,null,null,null,null,null,null,null,null,null,null,15]
["Dancing"]
["Distance Running",null,null,null,null,null,null,null,null,null,null,null,null,null,null,null,null,15,null,null,null,null,null,null,null,10,10]
["Diving"]
["Flying/Gliding"]
["Holding Breath"]
["Portaging",10,null,null,null,null,null,null,null,null,null,null,null,null,null,null,null,10,null,null,null,null,null,null,null,null,null,null,10,20,30,25,null,25,25,25]
["Rappelling",null,null,null,null,null,null,null,null,null,null,null,null,15,null,null,10]
["Rowing",null,null,null,null,null,null,null,null,null,null,null,null,10,10]
["Sailing",null,null,null,20,null,null,null,null,null,null,null,null,20,10]
["Skating"]
["Skiing"]
["Sprinting"]
["Brawling",20,null,null,null,null,null,null,null,null,null,null,null,null,null,null,null,20,null,null,null,null,null,null,null,null,null,null,10,20,30,25,30,25,30,30]
["Defensive Technique"]
["Defensive Weaving"]
["Disarm, Armed"]
["Disarm, Unarmed"]
["Donning/Doffing Chain"]
["Donning/Doffing Plate"]
["Donning/Doffing RL"]
["Donning/Doffing SL"]
["Expertise"]
["Feinting",null,null,null,null,null,null,null,null,null,null,null,null,10]
["Grappling Hook",null,null,null,null,null,null,null,null,null,null,null,null,25]
["Honing",null,null,null,null,null,null,null,null,null,null,null,null,null,null,10]
["Iai"]
["Instinctive Maneuver"]
["Lancing"]
["Melee Scuffle",10,null,null,null,null,null,null,null,null,null,null,null,null,null,null,null,20,null,null,null,null,null,null,null,null,null,null,15,25,30,25,30,25,30,30]
["Missile Artillery",null,null,null,null,null,null,null,null,null,null,null,null,10]
["SeaBorn Combat",null,null,null,15,null,null,null,null,null,null,null,null,25,5]
["Shield Bash",null,null,null,null,null,null,null,null,null,null,null,null,null,null,null,null,null,null,null,null,null,null,null,null,null,null,null,null,25,null,25,15,25,null,30]
["Shield Expertise"]
["Stunned Maneuver",null,null,null,null,null,null,null,null,null,null,null,null,null,null,null,null,null,null,null,null,null,null,null,null,null,null,null,15,25,30,25,30,30,30,30]
["Subduing"]
["Tackling",10,null,null,null,null,null,null,null,null,null,null,null,null,null,null,null,20,null,null,null,null,null,null,null,null,null,null,15,25,30,25,30,30,30,30]
["Unarmed Expertise"]
["Weapon Brawling"]
["Weapon Kata"]
["Yado"]
["AM Quickdraw"]
["Blind Fighting",null,null,40,20]
["Body Damage Stabilization",null,null,null,null,null,null,null,null,null,null,null,null,null,null,null,null,null,null,null,null,null,null,null,null,null,20,null,null,20]
["Control Lycantrophy"]
["Dowsing"]
["Frenzy",null,null,null,null,null,null,null,null,null,null,null,null,null,null,null,null,15,null,10,null,null,null,null,null,null,5,null,null,15,null,15,15,15,20,15]
["Meditation Cleansing",null,null,null,null,null,null,null,null,null,null,null,null,null,null,10]
["Meditation Death",null,null,null,null,null,null,null,null,null,null,null,null,null,null,10]
["Meditation Healing",null,null,null,null,null,null,null,null,null,null,null,null,null,null,10]
["Meditation Ki",null,null,null,null,null,null,null,null,null,null,null,null,null,null,10]
["Meditation Sleep",null,null,null,null,null,null,null,null,null,null,null,null,null,null,10]
["Meditation Trance",null,25,25,20,20]
["Mnemonics"]
["Prepared Shot",null,null,null,null,null,null,null,null,null,null,null,null,null,null,10]
["WOW Fatigue",10,null,null,null,null,null,null,null,null,null,null,null,null,null,10,null,10,null,5,null,null,null,null,null,null,15,null,null,20,30,20,30,30,30,30]
["WOW Pain",10,null,null,null,null,null,null,null,null,null,null,null,null,null,null,null,10,null,5,null,null,null,null,null,null,15,null,null,20,30,20,30,30,30,30]
["WOW Unconsciousness",10,null,null,null,null,null,null,null,null,null,null,null,null,null,null,null,10,null,5,null,null,null,null,null,null,15,null,null,20,30,20,30,30,30,30]
["WOW Will",10,null,null,null,null,null,null,null,null,null,null,null,null,null,10,null,null,null,null,null,null,null,null,null,null,5]
["Silent Kill",null,null,null,null,null,null,null,null,null,null,null,null,null,null,10]
["Use/Remove Poison",null,null,null,null,null,null,null,null,null,null,null,null,null,10,10,null,null,null,null,null,null,null,null,null,null,5]
["Appraisal",5,10,null,null,null,null,null,null,null,null,null,null,null,5]
["Armor Evaluation",5,10,10,null,null,null,null,null,null,null,null,null,null,5,null,null,null,null,null,null,null,null,null,null,null,5]
["Metal Evaluation",5,10,null,null,null,null,null,null,null,null,null,null,null,5,null,null,null,null,null,null,null,null,null,null,null,5]
["Stone Evaluation",5,10,null,null,null,null,null,null,null,null,null,null,null,5]
["Weapon Evaluation",5,10,10,null,null,null,null,null,null,null,null,null,null,5]
["Advertising"]
["Cookery",null,null,null,null,null,null,10,null,null,null,null,null,null,null,5]
["Crafting"]
["Fletching",null,null,null,null,10,null,null,null,null,null,null,null,null,null,null,5]
["Gimmickry"]
["Horticulture"]
["Hygien"]
["Leatherworking",null,null,null,null,null,null,null,null,null,null,null,null,null,null,5,5]
["Painting"]
["Play instrument #1",null,20,20,null,10]
["Play instrument #2",null,20,20,null,10]
["Play instrument #3",null,20,20,null,10]
["Rope Mastery",null,null,null,null,null,null,null,null,null,null,null,null,10]
["Sculpting",null,null,null,null,null,null,null,null,null,null,null,null,null,null,10]
["Skinning",null,null,null,null,null,null,null,null,null,null,null,null,null,null,5]
["Smithing",null,null,10]
["Stonecrafts",10,null,10,null,null,null,null,null,null,null,null,null,null,null,15]
["Tactical Games"]
["WA Maintenance"]
["Woodcrafts",null,null,null,null,null,null,null,null,null,null,null,null,null,null,null,5]
["Acrobatics",null,null,null,null,null,null,15,null,null,null,null,null,null,null,null,10,null,null,10]
["Calisthenics"]
["Contortions"]
["Juggling"]
["Jumping",null,null,null,null,null,null,null,null,null,null,null,null,10]
["Pole Vaulting"]
["Stilt Walking"]
["Tightrope Walking",null,null,null,null,null,null,null,null,null,null,null,null,10,null,null,10]
["Tumbling",null,null,null,null,null,null,15,null,null,null,null,null,10,null,null,5,null,null,10,null,null,null,10]
["Language"]
["Lip Reading"]
["Mimicry",null,null,null,null,null,null,null,null,null,null,null,null,null,null,10]
["Music",null,20,20,5,10]
["Poetic Improvisation",null,20,20,5,null,null,null,null,null,null,null,null,null,null,null,null,null,null,10]
["Propaganda",null,null,null,null,null,null,null,null,null,null,null,null,null,15]
["Public Speaking",null,10,10,10,null,10,null,null,null,null,null,null,null,15,null,null,null,10,10,10]
["Signaling",null,null,null,null,null,null,null,null,null,null,null,null,10]
["Singing",null,10,10,5,10]
["Tale Telling",null,null,null,null,null,null,null,null,null,null,null,null,null,15,null,null,null,null,10]
["Trading",null,null,null,null,null,null,null,null,null,null,null,null,null,15]
["Ventriloquism"]
["Circle Lore",null,10]
["Divination",null,10]
["Magical Rituals",null,10]
["Magnitude",null,10]
["Overcasting",null,10]
["Power Manipulation",null,10]
["Power Perception",null,10]
["PP Development",null,10]
["Power Projection",null,10]
["Rejuvenation",null,10]
["Scrying",null,10]
["Spell Artistery",null,10]
["Spell Mastery",null,10]
["Summoning",null,10]
["Symbol Lore",null,10]
["Targeting Skill",null,10]
["Transcend Armor",null,10]
["Warding Lore",null,10]
["Animal healing",null,null,null,null,10]
["Dentistry"]
["Diagnostics"]
["Drug Tolerance",null,null,null,null,null,null,null,null,null,null,null,null,null,null,null,null,null,null,null,null,null,null,null,null,null,null,null,null,25]
["First Aid"]
["Hypnosis"]
["Midwifery"]
["Second Aid"]
["Surgery"]
["Awakening"]
["Direction Sense"]
["Lie Perception"]
["Poison Perception",null,null,null,null,null,null,null,null,null,null,null,null,null,10,10]
["Sense Ambush",null,20,20,20,20,null,null,null,null,null,null,null,null,null,5,null,null,null,null,null,null,null,null,null,null,null,null,null,10]
["Surveillance",null,null,null,null,null,null,null,null,null,null,null,null,null,null,10]
["Time Sense"]
["Tracking",null,null,null,null,10,null,null,null,null,null,null,null,null,null,25,5,10,null,null,null,null,null,null,null,null,null,null,null,10]
["Diplomacy",null,null,null,null,null,10,null,null,null,null,null,null,null,15,null,null,null,10]
["Duping",null,null,null,null,null,null,null,null,null,null,null,null,null,null,null,null,null,null,null,10]
["Gambling"]
["Interrogation"]
["Intimidation",null,null,null,null,null,null,null,null,null,null,null,null,null,null,null,null,10,null,null,10]
["Leadership",null,15,15,null,null,10,null,null,null,null,null,null,null,null,null,null,null,10]
["Seduction"]
["Acting",null,null,null,null,null,null,null,null,null,null,null,null,null,15,null,null,null,null,10]
["Begging",null,null,null,null,null,null,null,null,null,null,null,null,null,10,null,null,null,null,10]
["Bribery"]
["Camouflage",null,null,null,null,10,null,null,null,null,null,null,null,null,null,null,10]
["Disguise"]
["Falsification"]
["Hide Item",null,null,null,null,10]
["Mimery"]
["Pick Pockets"]
["Set Traps"]
["Trickery",null,null,null,null,10]
["Caving",15]
["Fire Starting",null,null,null,null,null,null,null,null,null,null,null,null,null,null,5]
["Foraging",null,null,null,null,null,null,null,null,null,null,null,null,null,null,15,10,null,null,null,null,null,null,null,null,null,null,null,null,15]
["Hostile Environment",null,null,null,null,null,null,null,null,null,null,null,null,null,null,null,null,null,null,null,null,null,null,null,null,null,null,null,null,15]
["Region Lore"]
["Streetwise",null,null,null,null,null,null,null,null,null,null,null,null,null,5]

{"sheet":"Diverse","index":7,"n_rows":186,"n_cols":14,"rows_kept":186,"cut":false,"hidden":false,"merged":[]}
["Stat value","Bonus","Dev.pts","Baserate","Alchemist","Dwarf","Valt yrke","Nada",null,"Frågor, din dumma djävulsdyrkande och löjliga rollspelsfåne!","Svar på tal, din jävla tattare… du med så sparsam intellektuell begåvning ska passa dig noga!",1]
[1,-25,1,25,"Archer","Noldo (Academic)",{"$f":"INDEX(Diverse!E1:E84,'Ny NPC'!A2)","v":"Alchemist"},"Ett varannan level",null,"Hur kan man sätta tre kryss på två levlar?","Du sätter ett nu och två nästa level…"]
[2,-23,1.3,30,"Archmage","Noldo (Martial)",null,"Ett varje level",null,"Vad kostar det för varje level att sätta tre kryss varannan level?","Det kostar hälften av vad det gör totalt."]
[3,-21,1.6,35,"Assassin","Sinda","Vald ras","Tre på två levlar",null,"Kan jag redigera en gubbe som jag trodde att jag var klar med?","Nä, är du klar så är du klar. Du kan gå in på bladet Master NPC table och ändra själv om du vill."]
[4,-19,1.8,35,"Astrologer","Silvan",{"$f":"INDEX(Diverse!F1:F94,'Ny NPC'!C2)","v":"Dwarf"},"Två varje level",null,"Jag kan välja att slå högre på hits än vad jag borde kunna med den ras jag valt…","Ja, jag vet… men eftersom du har märkt det så antar jag att du inte vill fuska så mycket. Att du alls är i närheten av max-slaget är orimligt!"]
[5,-17,2,40,"Barbarian","Half-elf",null,null,null,"Kan jag fortfarande göra gubben trots att jag gjort av med mer dev.pts än jag har?","Ja, det finns ingen sån spärr. Du är SL, du får bända på reglerna lite grann."]
[6,-15,2.2000000000000002,40,"Bard","Hobbit","Karaktärens level","Dev.pts primary",null,"Varför är kalkylen så onödigt stor? Den är ju på över en MB…","Bra fråga, svaret är att det är ganska mycket text som har skrivits in och att Excelkalkyler kan både svälla och bli långsamma efter ett tag."]
[7,-14,2.4,40,"Bashkar","Northman",3,{"$f":"SUM('Ny NPC'!V3:V12)/2","v":35},null,"Måste man verkligen skriva så här mycket själv och räkna hela tiden?","Du har nog valt att spelleda i fel rollspel, du kan nog ta att köra systemlöst och utan papper… latmask!"]
[8,-13,2.6,40,"Beastmaster","Eothraim",null,"Dev.pts secondary",null,"Jag kan ju välja samma vapentyp på olika kategorier!","…och vad har du tjänat på det då? Du har istället förlorat dev.pts och respekt!"]
[9,-12,2.7,40,"Bounty Hunter","Lesser Dunadan","Medelhits-slag",{"$f":"70+H8","v":105},null,"Varför är vissa kalkylblad låsta och/eller dolda?","Risken är att om du skulle få gå in i dem så gör du större skada än nytta…"]
[10,-11,2.8,45,"Burglar","Common (rural)",35,null,null,"Jag vill lägga in egna raser, egna yrken och egna skills… går det bra?","Visst, ta dig in i rätt blad och ändra det du vill (gärna i alfabetisk ordning) men du har ju lika lite support från mig vilket som…"]
[11,-10,2.9,45,"Cavalier","Common (city-folk)",{"$f":"G11/10+1","v":4.5},null,null,"Jag vill ha några secondary skills också, har inte alla Stunned Maneuver nuförtiden?","Jo, men det är lite trångt redan nu med 33 skills. Tror du inte att något av vapen-skillsen är lika höga som Stunned… borde vara?"]
[12,-10,2.9,45,"Channeler","Corsair",null,null,null,"Såhär kan man väl inte göra en NPC, det är ju sterilt, fånigt och utan känsla!","Jodå, det kan man. Jag kan göra mina riktiga karaktärer här ända tills jag kommer till skills med bara ett rank eller de över 30 då det inte är värt de poäng det kostar."]
[13,-9,3,45,"Conjuror","Dorwinadan","Vapengrupp/stats",null,null,"Det saknas skillranks för level noll på trollen, orcherna och jättarna!","Ja, antingen hade de ingen barndom eller så har ingen orkat göra level noll för dem. Har du nåt förslag så hör av dig!"]
[14,-9,3,45,"Craftsman","Wose","1H Crush",{"$f":"(ST+ST+EQ)/3","v":11.666666666666666},null,"Fan va smått det är med alla knappar, text osv…","Ja, antingen det eller sprida ut sig mer på bredden. Det är inte perfekt, men alla har varken 21\"-skärmar eller upplösning som matchar. Använd Excels zoom-funktion eller låt bli…"]
[15,-9,3,45,"Crystal mage","Woodman","1H Slash",{"$f":"(ST+ST+AG+EQ)/4","v":8.75}]
[16,-8,3.3,45,"Cultist","Beorning","1H Thrust",{"$f":"(AG+QU+ST+EQ)/4","v":5}]
[17,-8,3.3,45,"Dancer","Greater Dunadan","2 Handed",{"$f":"(ST+ST+EQ)/3","v":11.666666666666666}]
[18,-8,3.3,45,"Dervish","Dunlending","Polearm",{"$f":"(ST+ST+AG+EQ)/4","v":8.75}]
[19,-7,3.6,45,"Druid","Black Numenorean","Staff",{"$f":"(ST+ST+AG+EQ)/4","v":8.75}]
[20,-7,3.6,45,"Duelist","Easterling","Bow",{"$f":"(AG+AG+ST)/3","v":5}]
[21,-7,3.6,45,"Enchanter","Sagath/Logath","Crossbow",{"$f":"AG","v":0}]
[22,-6,3.8,45,"Farmer","Gathmarim","Blowgun",{"$f":"(CO+AG)/2","v":10}]
[23,-6,3.8,45,"Feldsher","Variag","Thrown",{"$f":"(AG+ST)/2","v":7.5},null,"Är du så jävla bra själv då?","Nä, men är du så jävla bra själv då?  (jag har också hört på Riskradion)"]
[24,-6,3.8,45,"Fighter","Orc"]
[25,-5,4,45,"Forcemage","Uruk-Hai","Primärt vapen",4,null,null,null,"Channeling","Essence","Mentalism"]
[26,-5,4,50,"Healer","Half-orc","Sekundärt vapen",5,null,"None",1,0,0,0]
[27,-5,4,50,"High War monk","Half-troll","Tertiärt vapen",10,null,"Leather",2,0,16,20]
[28,-4,4.3,50,"Horseman","Forest Troll","Fjärde vapen",2,null,"Leather and metal",3,6,22,30]
[29,-4,4.3,50,"Houri","Stone Troll","Femte vapen",3,null,"Metal",4,12,32,50]
[30,-3,4.5999999999999996,50,"Hunter","Hill Troll","Sjätte vapen",7]
[31,-3,4.5999999999999996,50,"Illusionist","Snow Troll"]
[32,-3,4.5999999999999996,50,"Indurate","Mountain Troll","Armor Type","MMP","Maximum Penalty","Missile Attack Penalty","Quickness Penalty","Reverse","Channeling","Essence"]
[33,-2,4.8,50,"Lancer","Cave Troll",1,0,0,0,0,0,0,0]
[34,-2,4.8,50,"Leader","Olog-Hai",2,0,0,0,0,0,0,0]
[35,-2,4.8,50,"Macabre",null,3,0,0,0,0,0,0,0]
[36,-2,4.8,50,"Magician",null,4,0,0,0,0,0,0,0]
[37,-1,5,50,"Mentalist",null,5,0,0,0,0,0,0,8]
[38,-1,5,50,"Monk",null,6,0,-20,-5,0,0,0,12]
[39,-1,5,50,"Montebanc",null,7,-5,-40,-5,-5,5,0,16]
[40,-1,5,50,"Moon Mage",null,8,-10,-50,-10,-5,10,0,20]
[41,0,5.5,50,"Mystic",null,9,-5,-50,0,0,5,0,12]
[42,0,5.5,50,"Necromancer",null,10,-10,-70,-10,-5,10,0,24]
[43,0,5.5,50,"Nightblade",null,11,-15,-90,-20,-15,15,0,32]
[44,0,5.5,50,"No Profession",null,12,-15,-110,-30,-15,15,0,40]
[45,0,5.5,50,"Outrider",null,13,-10,-70,0,-5,10,15,28]
[46,0,5.5,50,"Paladin",null,14,-15,-90,-10,-10,15,22,36]
[47,0,5.5,50,"Ranger",null,15,-25,-120,-20,-20,25,36,56]
[48,0,5.5,50,"Rogue",null,16,-25,-130,-20,-20,25,36,56]
[49,0,5.5,50,"Romantic",null,17,-15,-90,0,-10,15,20,32]
[50,0,5.5,50,"Sage",null,18,-20,-110,-10,-20,20,32,40]
[51,0,5.5,50,"Sailor",null,19,-35,-150,-30,-30,35,38,60]
[52,0,5.5,50,"Scholar",null,20,-45,-165,-40,-40,45,45,72]
[53,0,5.5,50,"Seer"]
[54,0,5.5,50,"Shadow Mage",null,"Length","Baserate"]
[55,0,5.5,50,"Shaikan",null,1,-10]
[56,0,5.5,50,"Shaman",null,100,-5]
[57,0,5.5,50,"Sleuth",null,163,0]
[58,0,5.5,50,"Sorceror",null,194,5]
[59,0,5.5,50,"Swordsman",null,208,10]
[60,1,6,50,"Templar",null,223,15]
[61,1,6,50,"Thief",null,238,20]
[62,1,6,50,"Trader"]
[63,1,6,50,"Trench Fighter",null,"Weapon Type"]
[64,2,6.3,50,"War Monk",null,"Unencumbered",null,90]
[65,2,6.3,50,"Warlock",null,"1H weapon (no shield)",null,60]
[66,2,6.3,50,"Warrior",null,"1H thrust & shield",null,40]
[67,2,6.3,50,"Warrior Mage",null,"1H weapon & shield",null,30]
[68,3,6.6,50,"Witch",null,"2w Combo (small weapons)",null,45]
[69,3,6.6,50,"Witch Hunter",null,"2w Combo (large weapons)",null,30]
[70,3,6.6,50,"Wizard",null,"Twohanded weapon",null,30]
[71,3,6.6,50]
[72,4,6.8,50,null,null,"Channeling"]
[73,4,6.8,50,null,null,"Essence"]
[74,4,6.8,50,null,null,"Mentalism"]
[75,5,7,50,null,null,"Hybrid: Channeling/Essence"]
[76,5,7,50,null,null,"Hybrid: Channeling/Mentalism"]
[77,5,7,50,null,null,"Hybrid: Mentalism/Essence"]
[78,6,7.4,50,null,null,"Arcane"]
[79,6,7.4,50]
[80,6,7.4,50,null,null,"Stat value","PP Recovery"]
[81,7,7.7,50,null,null,1,0]
[82,7,7.7,50,null,null,2,0]
[83,7,7.7,50,null,null,3,0]
[84,8,8,50,null,null,4,0]
[85,8,8,50,null,null,5,0]
[86,8,8,50,null,null,6,0]
[87,9,8.1999999999999993,50,null,null,7,0]
[88,9,8.1999999999999993,50,null,null,8,0]
[89,9,8.1999999999999993,50,null,null,9,0]
[90,10,8.4,50,null,null,10,0]
[91,11,8.6,51,null,null,11,0]
[92,12,8.6999999999999993,52,null,null,12,0]
[93,13,8.8000000000000007,53,null,null,13,0]
[94,14,8.9,54,null,null,14,0]
[95,15,9,55,null,null,15,0]
[96,17,9.1999999999999993,56,null,null,16,0]
[97,19,9.4,57,null,null,17,0]
[98,21,9.6,58,null,null,18,0]
[99,23,9.8000000000000007,59,null,null,19,0]
[100,25,10,60,null,null,20,0]
[101,30,10.5,62,null,null,21,0]
[102,35,11,64,null,null,22,0]
[103,40,11.5,66,null,null,23,0]
[104,45,12,68,null,null,24,0]
[105,50,12.5,70,null,null,25,1]
[106,55,13,72,null,null,26,1]
[107,60,13.5,74,null,null,27,1]
[108,65,14,76,null,null,28,1]
[109,70,14.5,78,null,null,29,1]
[110,75,15,80,null,null,30,1]
[111,80,15.5,82,null,null,31,1]
[112,85,16,84,null,null,32,1]
[113,90,16.5,86,null,null,33,1]
[114,95,17,88,null,null,34,1]
[115,100,17.5,90,null,null,35,1]
[116,105,18,92,null,null,36,1]
[117,110,18.5,94,null,null,37,1]
[118,115,19,96,null,null,38,1]
[119,120,19.5,98,null,null,39,1]
[120,125,20,100,null,null,40,1]
[121,130,20.5,102,null,null,41,1]
[122,135,21,104,null,null,42,1]
[123,140,21.5,106,null,null,43,1]
[124,145,22,108,null,null,44,1]
[125,150,22.5,110,null,null,45,1]
[126,155,23,112,null,null,46,1]
[127,160,23.5,114,null,null,47,1]
[128,165,24,116,null,null,48,1]
[129,170,24.5,118,null,null,49,1]
[130,175,25,120,null,null,50,1]
[null,null,null,null,null,null,51,1]
[null,null,null,null,null,null,52,1]
[null,null,null,null,null,null,53,1]
[null,null,null,null,null,null,54,1]
[null,null,null,null,null,null,55,1]
[null,null,null,null,null,null,56,1]
[null,null,null,null,null,null,57,1]
[null,null,null,null,null,null,58,1]
[null,null,null,null,null,null,59,1]
[null,null,null,null,null,null,60,1.5]
[null,null,null,null,null,null,61,1.5]
[null,null,null,null,null,null,62,1.5]
[null,null,null,null,null,null,63,1.5]
[null,null,null,null,null,null,64,1.5]
[null,null,null,null,null,null,65,1.5]
[null,null,null,null,null,null,66,1.5]
[null,null,null,null,null,null,67,1.5]
[null,null,null,null,null,null,68,1.5]
[null,null,null,null,null,null,69,1.5]
[null,null,null,null,null,null,70,1.5]
[null,null,null,null,null,null,71,1.5]
[null,null,null,null,null,null,72,1.5]
[null,null,null,null,null,null,73,1.5]
[null,null,null,null,null,null,74,1.5]
[null,null,null,null,null,null,75,2]
[null,null,null,null,null,null,76,2]
[null,null,null,null,null,null,77,2]
[null,null,null,null,null,null,78,2]
[null,null,null,null,null,null,79,2]
[null,null,null,null,null,null,80,2]
[null,null,null,null,null,null,81,2]
[null,null,null,null,null,null,82,2]
[null,null,null,null,null,null,83,2]
[null,null,null,null,null,null,84,2]
[null,null,null,null,null,null,85,2]
[null,null,null,null,null,null,86,2]
[null,null,null,null,null,null,87,2]
[null,null,null,null,null,null,88,2]
[null,null,null,null,null,null,89,2]
[null,null,null,null,null,null,90,3]
[null,null,null,null,null,null,91,3]
[null,null,null,null,null,null,92,3]
[null,null,null,null,null,null,93,3]
[null,null,null,null,null,null,94,3]
[null,null,null,null,null,null,95,3]
[null,null,null,null,null,null,96,3.5]
[null,null,null,null,null,null,97,3.5]
[null,null,null,null,null,null,98,3.5]
[null,null,null,null,null,null,99,3.5]
[null,null,null,null,null,null,100,4]
[null,null,null,null,null,null,101,4.5]
[null,null,null,null,null,null,102,5]
[null,null,null,null,null,null,103,5.5]
[null,null,null,null,null,null,104,6]
[null,null,null,null,null,null,105,6.5]

{"sheet":"Levelbonus","index":8,"n_rows":22,"n_cols":96,"rows_kept":22,"cut":false,"hidden":false,"merged":[]}
["Profession","Alchemist","Animist","Archer","Archmage","Arcist","Arms Master","Assassin","Astral Traveller","Astrologer","Barbarian","Bard","Bashkar","Beastmaster","Bounty Hunter","Burglar","Cavalier","Chaotic Lord","Channeler","Conjuror","Crafter","Craftsman","Creator","Crystal mage","Cultist","Dancer","Delver","Dervish","Doppelgänger","Dream Lord Illusionist","Dream Lord Shaman","Druid","Duelist","Elementalist","Enchanter","Farmer","Feldsher","Fighter","Forcemage","Free Thinker","Gypsy","Healer","High War monk","Horseman","Houri","Hunter","Illusionist","Indurate","Lancer","Lay Healer","Leader","Macabre","Magician","Magus Chan","Magus Chan/Ess","Magus Ess","Maleficant","Mentalist","Monk","Montebanc","Moon Mage","Mystic","Necromancer","Nightblade","No Profession","Noble Warrior","Outrider","Paladin","Ranger (old)","Ranger","Rogue","Romantic","Runemaster","Sage","Sailor","Scholar","Seeker","Seer","Shadow Mage","Shaikan","Shaman","Sleuth","Sorceror","Swordsman","Tarotmage","Templar","Thief","Trader","Trench Fighter","War Monk","Warlock","Warrior","Warrior Mage","Witch","Witch Hunter","Wizard"]
["Academic skills",3,1,0,3,3,0,0,3,2,0,2,0,0,0,0,0,0,2,3,3,1,2,2,1,0,2,0,0,1,1,1,0,2,1,0,1,0,3,3,0,2,0,0,0,0,3,0,0,1,1,1,3,2,2,2,2,2,1,0,0,2,2,0,1,0,0,0,0,0,0,0,3,1,0,3,3,2,2,0,1,0,2,0,1,1,0,0,0,0,2,0,0,2,0,2]
["Animal",0,3,0,0,0,1,0,0,1,2,0,0,2,2,0,1,0,0,0,0,1,0,1,0,0,0,0,0,0,3,3,0,0,0,3,0,1,0,0,1,0,0,3,0,2,0,0,1,0,0,0,0,0,0,0,1,0,0,0,0,0,0,0,1,1,2,0,3,2,1,0,0,0,0,0,0,0,0,0,3,0,0,0,0,2,1,1,1,2,0,0,0,1,2,0]
["Athletic",0,0,1,0,0,2,1,0,0,2,0,2,1,1,3,2,1,0,0,0,1,0,0,0,3,0,1,0,0,0,0,2,1,1,0,0,2,0,0,0,0,2,1,0,0,0,2,2,0,2,0,0,0,0,0,0,0,2,0,1,0,0,2,1,2,0,1,1,1,2,1,0,0,2,0,0,0,0,1,0,0,0,2,0,1,2,0,1,2,0,3,1,0,0,0]
["Combat",0,0,3,0,0,3,2,0,0,3,0,3,2,2,1,3,2,1,0,0,1,0,0,2,1,2,2,0,0,0,0,3,2,0,0,2,3,0,0,0,0,3,3,0,2,0,3,3,0,3,1,0,0,0,0,0,0,1,1,1,0,0,2,1,3,2,3,1,2,3,3,0,0,3,0,0,0,0,3,0,1,0,3,1,3,2,1,3,2,0,3,2,0,2,0]
["Concentration",0,1,1,2,2,0,0,2,1,0,1,2,0,0,1,0,0,0,0,0,1,0,1,0,0,0,0,0,2,2,0,2,0,0,0,1,0,0,2,0,2,2,0,0,0,0,1,1,1,0,0,1,0,0,0,0,2,1,0,1,3,0,1,1,0,0,0,0,0,0,0,1,3,0,2,0,2,0,2,1,0,1,1,1,0,0,0,2,2,0,0,0,0,0,1]
["Deadly",0,0,0,0,0,0,3,0,0,0,0,0,1,1,0,0,1,0,0,0,0,1,0,1,0,0,2,0,0,0,0,0,0,0,0,1,1,0,0,0,1,0,0,1,2,0,0,0,0,0,0,0,0,0,0,0,0,0,0,0,0,0,3,0,0,0,0,1,0,0,0,0,0,0,0,0,0,0,0,0,0,0,0,0,0,1,0,0,1,1,1,1,0,0,0]
["Evaluation",2,0,1,0,0,1,0,0,0,0,3,0,1,0,2,0,0,2,0,3,1,0,0,0,0,2,0,1,2,2,0,0,1,0,2,0,0,0,0,2,0,0,0,0,0,0,0,0,1,0,0,0,0,0,0,0,0,0,1,0,0,0,0,1,1,0,0,2,2,1,0,0,0,2,1,0,0,0,1,1,0,0,1,1,1,0,2,0,0,0,0,0,1,0,0]
["General",2,1,1,0,0,1,0,0,0,0,3,0,2,0,0,0,0,2,0,3,1,0,0,0,0,2,0,1,2,2,0,0,1,0,2,0,0,0,0,2,0,0,1,0,2,0,0,0,1,0,0,0,0,0,0,0,0,0,0,0,0,0,0,1,1,0,0,2,2,1,0,0,0,2,1,0,0,0,1,1,0,0,1,1,1,0,2,0,0,0,0,0,1,0,0]
["Gymnastic",0,0,1,0,0,2,1,0,0,2,0,2,1,1,3,3,2,0,0,0,1,0,0,0,3,0,1,0,0,0,0,2,1,0,0,0,2,0,0,0,0,3,1,0,0,0,2,2,0,2,0,0,0,0,0,0,0,2,0,1,0,0,2,1,2,0,1,1,1,2,1,0,0,2,0,0,0,0,3,0,0,0,1,0,1,2,0,1,2,0,3,1,0,0,0]
["Linguistic",0,1,0,0,0,0,0,0,0,0,3,0,0,0,0,0,0,0,2,0,1,0,0,0,0,0,0,1,0,0,0,0,0,2,0,0,0,0,3,2,0,0,0,2,0,0,0,0,0,1,0,0,2,2,2,0,1,0,1,1,1,0,0,1,0,0,0,0,0,0,1,2,3,0,3,0,0,0,0,1,0,0,0,0,0,0,2,0,0,0,0,0,1,0,0]
["Magical",3,1,0,2,2,0,0,1,2,0,0,0,0,0,0,0,1,2,3,0,1,2,2,2,0,1,1,2,2,2,2,0,1,2,0,0,0,3,0,1,2,0,0,1,0,3,0,0,1,0,2,3,3,3,3,3,2,0,0,2,2,2,0,1,0,0,0,0,0,0,0,3,1,0,0,3,2,3,0,1,0,3,0,3,0,0,0,0,0,3,0,2,1,1,3]
["Medical",0,1,1,0,0,0,0,0,0,0,0,0,0,0,0,0,0,1,0,0,0,3,0,0,0,0,0,0,1,1,2,0,0,0,0,3,0,0,2,1,3,0,0,0,0,0,0,1,3,0,0,0,0,0,0,2,0,1,0,0,0,3,0,0,0,1,0,0,0,0,0,0,0,0,1,0,0,3,0,1,0,0,0,0,0,0,0,0,0,0,0,0,1,0,0]
["Perception",1,2,2,0,0,0,1,0,1,1,0,0,1,3,2,0,0,2,1,0,1,0,2,1,0,1,0,0,0,0,1,0,1,0,0,2,0,2,0,1,2,0,1,1,2,2,0,1,1,1,0,0,1,1,1,0,1,1,2,0,1,0,1,1,0,2,1,1,1,1,0,1,0,1,0,3,3,0,1,0,3,1,1,0,0,1,1,0,1,2,0,1,1,3,1]
["Social",0,0,0,0,0,1,0,1,0,0,0,0,0,0,0,1,1,0,0,0,1,0,0,0,2,0,2,3,0,0,0,0,0,2,0,0,0,0,0,1,1,0,0,3,0,0,0,0,0,2,0,0,0,0,0,0,0,0,2,1,0,0,0,1,1,2,1,0,0,0,3,0,0,0,0,0,0,0,0,1,3,0,0,0,1,0,1,0,0,1,0,0,0,0,0]
["Subterfuge",0,0,0,0,0,0,2,0,0,0,0,0,1,1,3,0,0,0,0,1,1,0,0,1,2,0,0,3,0,0,2,0,0,1,0,0,0,0,0,1,0,0,1,1,2,1,0,0,0,0,1,0,0,0,0,0,0,1,3,0,0,0,1,1,0,2,0,1,1,2,0,0,0,2,0,0,0,0,1,0,2,0,0,0,0,3,1,0,0,0,0,0,1,1,0]
["Directed Spells",0,0,0,0,0,0,0,1,1,0,0,0,0,0,0,0,1,0,0,0,0,0,0,0,0,0,0,0,1,1,0,0,0,0,0,0,0,1,0,0,0,0,0,0,0,1,0,0,0,0,1,3,1,1,1,0,1,0,0,1,0,1,0,0,0,0,0,0,0,0,0,0,0,0,0,0,0,0,0,0,0,2,0,1,0,0,0,0,0,0,0,0,0,0,2]
["Base Spell Casting",2,2,0,3,3,1,0,2,2,0,1,0,1,0,0,0,1,2,2,1,0,2,2,1,0,1,1,2,2,2,2,0,1,2,0,1,0,2,0,0,2,0,0,1,0,2,0,0,2,0,2,2,2,2,2,2,2,1,1,1,2,2,1,0,1,0,1,0,1,0,0,2,2,0,0,2,2,2,0,2,1,2,0,2,0,0,0,0,0,2,0,1,2,1,2]
["Body Development",0,0,0,0,0,2,1,0,0,3,0,3,1,1,0,3,2,0,0,0,0,0,0,1,2,1,1,0,0,0,0,3,2,0,2,2,3,0,0,0,1,3,2,0,1,0,3,2,0,2,1,0,0,0,0,0,0,2,1,1,0,0,1,0,3,1,3,0,1,1,2,0,0,1,0,0,0,0,1,0,0,0,3,0,2,0,0,3,2,0,3,2,0,1,0]
["Survival",0,3,1,0,0,1,0,0,1,2,0,0,2,3,1,0,0,0,0,0,1,0,1,0,0,0,0,0,0,3,3,0,0,0,3,0,1,0,0,1,0,0,3,0,3,0,0,1,0,0,0,0,0,0,0,1,0,1,0,0,0,0,0,1,1,2,0,3,2,1,0,0,0,0,0,0,0,0,0,3,0,0,0,0,1,1,1,1,2,0,0,0,1,2,0]
[null,{"$f":"SUM(B2:B20)","v":13},{"$f":"SUM(C2:C20)","v":16},12,10,10,15,11,10,11,15,13,12,16,15,16,13,12,14,11,11,14,10,11,10,13,12,11,13,13,19,16,12,13,11,12,{"$f":"SUM(AK2:AK20)","v":13},13,11,10,13,16,13,16,10,16,12,11,14,11,14,9,12,11,11,11,11,11,14,12,11,11,10,14,14,16,14,{"$f":"SUM(BP2:BP20)","v":11},16,16,15,11,12,10,15,11,11,11,10,14,16,10,11,13,11,14,13,12,12,16,11,13,11,13,13,11]
["Class",null,null,null,null,null,"S","N",null,null,"N","S","N","S","N","N","N","S","P",null,"S","N","H",null,"S","N","S","S","P","H","H","P","N","S","H","N","S","N","P",null,"N",null,"N","N","S","N","P","N","N","P","N","S","P","P","H","P","H","P","S","S","S","H",null,"S","N","S","N","S","S","S","N","N",null,null,"N","N",null,null,"H","N","P","S","H","N",null,"N","N","N","N","N",null,"N","S","H","S","P"]

{"sheet":"AllaSkills","index":9,"n_rows":317,"n_cols":75,"rows_kept":317,"cut":false,"hidden":false,"merged":[]}
["Skill","Grupp","Stats","Alchemist","Archer","Archmage","Assassin","Astrologer","Barbarian","Bard","Bashkar","Beastmaster","Bounty Hunter","Burglar","Cavalier","Channeler","Conjuror","Craftsman","Crystal mage","Cultist","Dancer","Dervish","Druid","Duelist","Enchanter","Farmer","Feldsher","Fighter","Forcemage","Healer","High War monk","Horseman","Houri","Hunter","Illusionist","Indurate","Lancer","Leader","Macabre","Magician","Mentalist","Monk","Montebanc","Moon Mage","Mystic","Necromancer","Nightblade","No Profession","Outrider","Paladin","Ranger","Rogue","Romantic","Sage","Sailor","Scholar","Seer","Shadow Mage","Shaikan","Shaman","Sleuth","Sorceror","Swordsman","Templar","Thief","Trader","Trench Fighter","War Monk","Warlock","Warrior","Warrior Mage","Witch","Witch Hunter","Wizard","Wizard"]
["Administration","Academic","Re/Pr","2/5","2/6","2/5","2/6","2/5",7,"1/5","6","7","5","2/6","2/6","2/4","2/5","2/6","2/4","2/4","2/5","2/5","6","2/6","2/5","2/6","1/4","2/6","2/5","2/5","6","2/6","2/5","2/6","2/5","4/9","2/6","1/3","2/5","2/5","2/5","3/7","2/6","2/5","2/5","2/5","2/5","2/6","1/3","2/5","5","2/6","2/6","1/2","2/6","1/3","2/5","2/5","2/6","6","1/5","2/5","2/6","2/6","2/5","1/3","3/7","3/7","2/4","6","2/5","5","5","2/5","2/5"]
["Advanced math","Academic","Re","2/5","4/8","3/7","4/7","2/3",7,"3/6","7","7","3/7","3/7","4/8","3/6","3/7","3/7","3/7","3/6","5","3/7","3/7","4/8","3/6","3/7","3/7","4/8","2/5","3/6","7","4/7","3/6","4/7","3/5","4/8","4/8","4/8","3/7","3/7","3/6","3/6","4/7","3/7","3/6","3/7","3/8","3/7","4/7","3/7","3/7","4/7","4/8","1/3","4/7","1/4","3/6","3/7","4/8","3/7","3/6","3/6","4/8","4/8","3/8","2/4","4/7","4/7","3/7","6","3/7","3/7","3/7","3/7","3/7"]
["Alchemy","Academic","Re","1/3","3/7","2/4","3/5","2/4","3/9","2/4","3/6","3/5","3/7","2/6","3/7","2/4","2/5","2/6","3/5","2/4","3/7","3/7","3/6","3/7","2/4","2/6","3/7","3/7","2/4","3/6","3/6","3/5","2/5","3/5","2/7","3/7","3/7","3/7","2/6","2/4","2/6","2/5","3/5","3/7","2/4","2/6","2/6","2/6","3/5","2/7","3/7","3/5","3/7","1/3","3/5","1/4","2/6","2/6","3/7","3/6","2/4","2/5","3/7","3/7","2/6","2/5","3/9","3/9","2/6","6","3/5","1/4","3/7","2/4","2/4"]
["Anthopology","Academic","In/Em","2/5","3","2/5","3","2/5","7","1/4","3/7","6","2/6","3","3","2/5","2/5","2/6","2/7","2/5","3","3","2/5","3","1/4","2/6","2/6","3","2/5","2/5","3/7","3","2/5","3","2/5","3","3","3","2/5","2/5","2/5","2/6","3","3","2/5","2/5","3/6","2/6","3","2/6","2/6","3","3","1/3","3","1/4","2/5","2/5","3","2/5","1/4","2/5","3","3","3","3","2/6","2/6","1/5","6","2/6","2/5","2/6","2/5","2/5"]
["Architecture","Academic","Re/Em","2/5","3/6","2/5","2/5","2/5","5","2/5","4","5","3/6","2/5","3/6","2/4","2/5","2/6","4","2/4","3","4","3/6","3/6","2/5","2/6","3/5","3/6","2/5","2/5","4","2/5","2/5","2/5","2/5","3/6","3/6","2/5","2/5","2/5","2/5","3/6","2/5","4","2/5","2/5","2/4","2/6","2/5","2/5","3/6","2/5","3/6","1/3","2/5","1/3","2/5","2/5","3/6","3/6","2/5","2/5","3/6","3/6","2/4","2/5","3/6","3/6","4","6","3/5","2/5","3/6","2/5","2/5"]
["Astronomy","Academic","Re/Em","3/7","3/7","3/7","3/7","2/3","3/7","3/6","7","3/7","3/5","3/7","3/7","2/4","2/5","3/7","6","2/4","3/7","3/7","2/5","3/7","2/5","3/7","2/8","3/7","3/7","2/5","7","3/7","3/6","3/7","3/7","3/7","3/7","3/7","3/6","3/7","3/7","3/5","3/7","3/7","2/5","3/6","3/7","3/7","3/7","3/6","3/5","3/7","3/7","1/3","3/7","1/4","2/4","3/6","3/7","2/4","3/6","2/5","3/7","3/7","3/7","2/5","3/7","3/7","1/5","6","2/8","2/4","3/5","3/7","3/7"]
["Basic Mathematics","Academic","Re","1/4","3/7","2/6","3/6","1/2","3/7","2/5","6","3/6","2/6","2/6","3/7","2/5","2/6","2/6","2/6","2/5","3/9","2/6","2/6","3/7","2/5","2/6","2/6","3/7","1/4","2/6","6","3/6","2/5","3/6","2/4","3/7","3/7","3/7","2/6","2/6","2/5","2/5","3/6","2/6","2/5","2/6","2/7","2/6","3/6","2/6","2/6","3/6","3/7","1/2","3/6","1/4","2/5","2/6","3/7","2/6","2/5","1/5","3/7","3/7","2/7","1/3","3/6","3/6","2/6","6","2/6","2/5","2/6","2/6","2/6"]
["Biochemistry","Academic","In/Re","5","5","5","5","5","4","5","5","4","5","5","5","5","5","4","3/7","5","4","4","2/5","5","5","4","3/5","5","5","2/4","5","5","5","5","5","5","5","5","6","5","5","5","5","4","5","6","5","4","5","5","5","5","5","1/3","5","1/4","5","6","5","2/7","5","7","5","5","5","5","5","5","2/6","6","3/5","2/6","5","5","5"]
["Boat pilot","Academic","Re/Ag","2/6","2/6","2/6","2/6","2/4","1/3","2/6","3/6","2/4","1/4","2/6","2/6","2/5","2/6","2/6","3/7","2/5","3/7","3/7","1/5","2/6","2/6","2/6","2/5","2/6","2/6","3/6","3/6","2/6","2/6","2/6","2/6","2/6","2/6","2/6","2/6","2/6","2/6","2/6","2/6","3/7","2/6","2/6","2/6","2/6","2/6","2/6","1/4","2/6","2/6","1/3","1/4","1/4","1/4","2/6","2/6","2/5","2/6","2/6","2/6","2/6","2/6","2/3","2/6","2/6","3/7","6","2/5","2/5","1/4","2/6","2/6"]
["Cryptography","Academic","In/Re","2/6","6","2/6","2/5","2/4","2/6","1/2","3","2/6","2/6","2/5","6","2/5","1/5","2/6","2/5","2/6","1/4","1/4","2/5","6","2/5","2/6","2/6","6","2/6","2/6","3","2/5","1/5","2/5","2/5","6","6","6","2/6","2/6","2/5","2/6","2/5","1/4","2/5","2/6","2/5","2/6","4/10","2/6","2/6","2/5","6","1/2","2/5","1/3","2/4","2/6","6","1/5","2/6","2/6","6","6","2/5","1/4","2/6","2/6","1/5","6","2/6","1/4","2/6","2/6","2/6"]
["Demon/Devil Lore","Academic","Re","1/3","5","1/2","4","2/5","5","2/5","4","5","2/5","3","5","1/3","1/3","2/6","2/4","1/3","3","2/4","1/4","5","2/5","2/6","2/6","5","1/2","2/5","4","4","2/5","4","1/2","5","5","5","1/3","1/2","1/4","1/3","4","2/4","1/3","1/3","3","2/6","4","2/4","2/5","4","5","1/3","4","1/4","1/4","1/3","5","1/3","2/5","1/2","5","5","3","4","4","4","1/3","6","2/6","1/2","1/3","1/2","1/2"]
["Drafting","Academic","Re","1/3","3/6","2/4","2/5","2/4","3/6","2/4","2/4","2/5","3/7","2/5","3/6","1/4","2/5","2/6","3/7","1/4","2/5","3","1/3","3/6","2/4","2/6","2/5","3/6","2/4","2/5","2/4","2/5","2/5","2/5","2/5","3/6","3/6","2/5","2/5","2/4","2/4","1/3","2/5","3","2/4","2/5","2/4","2/6","2/5","3/7","3/7","2/5","3/6","1/3","2/5","1/4","2/4","2/5","3/6","1/5","2/4","2/5","3/6","3/6","2/4","2/4","2/4","2/4","3/7","6","2/5","3/6","3/7","2/4","2/4"]
["Dragon Lore","Academic","Re","1/3","2","1/3","2","1/4","2","2/5","5","4","3","4","2","1/4","1/3","2/6","2/5","1/4","5","2/5","1/3","2","1/4","2/6","2/7","2","1/3","2/5","5","2","2/5","2","1/3","2","2","2","2/4","1/3","2/4","2/5","2","2/5","1/4","2/4","2","2/6","2","1/4","1/3","2","2","1/3","2","1/4","3/4","2/4","2","1/5","2/5","1/3","2","1","4","4","3","3","2/4","6","2/7","1/4","1/3","1/3","1/3"]
["Engineering","Academic","In/Re","1/2","3/6","2/6","2/5","2/5","3/6","2/4","2","2/5","3/7","1/4","3/6","2/6","2/6","2/6","4","2/6","3","4","4","3/6","2/6","2/6","3/5","3/6","2/6","3/7","2","2/5","2/5","2/5","2/6","3/6","3/6","2/4","2/6","2/6","2/6","2/5","2/5","4","2/6","2/6","1/4","2/6","2/5","3/5","3/7","2/5","3/6","1/2","2/5","1/3","2/6","2/6","3/6","4","2/4","2/6","3/6","3/6","1/4","2/5","2","2","4","6","3/5","4","3/7","2/6","2/6"]
["Faerie Lore","Academic","Re","1/3","6","1/2","4","1/3","3","1/4","4","6","1/4","4","1/5","1/4","1/4","2/6","2/4","1/4","5","2/5","1/4","6","1/2","2/6","3/7","6","1/2","2/5","4","4","2/5","4","1/3","6","6","6","2/4","1/2","1/4","2/4","4","2/5","1/2","2/4","3","2/6","4","2/5","1/4","4","6","1/3","4","1/4","1/4","2/4","6","1/4","1/4","1/3","6","6","3","4","3","3","1/4","6","3/5","1/4","1/4","1/2","1/2"]
["Fauna Lore","Academic","Re","1/4","3","2/5","2","2/6","2/4","1/4","3","2","1/4","5","1/5","1/4","2/5","2/6","2/4","1/4","4","2/5","1/5","3","1/4","1/4","2/6","3","2/5","1/3","3","2","2/5","1/4","2/5","3","3","3","2/6","2/5","2/6","2/4","2","2/5","1/4","2/6","3","2/6","2","2/5","1/4","2","3","1/3","2","1/4","2/5","2/6","3","1/2","1/4","2/6","3","3","2","1/4","2/6","2/6","1/5","6","2/6","1/4","1/4","2/5","2/5"]
["Flora Lore","Academic","Re","1/4","3","2/5","2","2/6","2/4","2/4","3","2","1/2","5","1/5","1/4","2/5","2/6","2/5","1/4","4","2/5","1/5","3","1/5","1/4","2/6","3","2/5","1/3","3","2","2/5","2","2/5","3","3","3","2/6","2/5","2/5","2/5","2","2/5","1/5","2/6","3","2/6","2","2/4","1/2","2","3","1/3","2","1/4","2/5","2/6","3","1/2","2/4","2/6","3","3","2","1/4","4/12","2/6","1/5","6","2/6","1/4","1/2","2/5","2/5"]
["Heraldry","Academic","Re","3/5","1/5","3/5","2/5","2/4","3/5","1/2","2/4","2/5","1/4","2/6","1/3","2/4","3/5","2/6","2/6","2/4","3/5","2/5","3/5","1/5","2/4","2/6","2/4","1/5","3/5","2/4","2/4","2/5","2/5","2/5","2/5","1/5","1/5","1/4","3/5","3/5","2/5","2/6","2/5","2/5","2/4","3/5","2/5","2/6","1/3","1/3","1/4","2/5","1/5","1/3","2/5","1/3","1/4","3/5","1/5","3/7","2/5","3/5","1/5","1/5","2/5","2/6","3/6","3/6","2/4","3/7","2/4","3/6","1/4","3/5","3/5"]
["Herb Lore","Academic","Re","1/3","2/6","2/6","2/6","2/4","2/6","1/4","2/4","2/6","1/3","2/6","1/5","2/4","1/4","2/6","1/4","2/4","3/6","2/4","1/2","2/6","1/4","1/5","1/4","2/6","2/6","1/2","2/4","2/6","2/5","2/6","2/6","4/9","2/6","2/6","2/6","2/6","2/5","2/4","2/6","2/4","1/4","2/6","2/6","2/6","2/6","1/4","1/3","2/6","2/6","1/3","2/6","1/4","2/4","2/6","2/6","1/2","1/4","2/6","2/6","2/6","2/6","2/5","4/8","2/4","1/4","6","2/5","1/2","1/3","2/6","2/6"]
["Lock Lore","Academic","Re","1/3","2/6","2/4","2/4","2/6","3/7","1/3","2/6","2/6","3/7","1/2","1/5","2/6","2/5","2/6","3/6","2/6","1/4","4","2/7","2/6","2/5","2/6","2/6","2/6","2/4","3/7","2/6","1/3","2/5","1/3","2/5","2/6","2/6","2/6","2/6","2/4","3/6","1/4","1/3","4","2/5","2/6","1/2","2/6","1/3","3/7","1/4","1/3","2/6","1/4","1/3","1/5","2/5","2/6","2/6","3/7","1/3","2/6","2/6","2/6","1/2","2/4","2/5","2/5","2/5","6","2/6","3/7","1/4","2/5","2/5"]
["Mapping","Academic","Re","2","7","3","6","2/5","7","3","5","6","2/6","5","7","4","5","2/6","1/4","4","4","3","2/6","7","3","2/6","3/7","7","3","5","5","6","3","6","4","7","7","2/4","4","3","4","3","6","3","3","4","5","2/6","6","3","2/6","6","7","2","6","1/4","2/6","4","7","4","3","4","7","7","5","2/4","5","5","4","6","2/6","4","2/6","3","3"]
["Mechanition","Academic","Ag/Re","1/2","3/6","2/6","2/5","2/4","3/7","2/4","2","2/5","3/7","1/4","3/6","2/6","2/6","2/6","3/8","2/6","3/9","4","3/8","3/6","2/6","2/6","3/7","3/6","2/6","3/7","2","2/5","2/5","2/5","2/6","3/6","3/6","3/6","2/6","2/6","2/6","2/5","2/5","4","2/6","2/6","1/4","2/6","2/5","3/5","3/7","2/5","3/6","2/5","2/5","2/4","2/6","2/6","3/6","3/8","2/4","2/6","3/6","3/6","1/4","2/5","2","2","3/9","6","2/6","3/8","3/7","2/6","2/6"]
["Metal Lore","Academic","Re","1/2","2/6","1/4","2/5","1/4","3/6","2/4","3","2/6","2/5","2/4","1/5","2/6","2/4","2/6","1/4","2/6","2/5","3","2/6","2/6","2/5","2/6","2/5","2/6","1/4","3/7","3","2/5","2/5","2/5","2/4","2/6","2/6","2/6","2/4","1/4","3/6","2/6","2/5","3","2/5","2/4","2/4","2/6","2/5","2/4","2/5","2/5","2/6","1/3","2/5","1/4","3/6","2/4","2/6","3/7","2/4","2/4","2/6","2/6","2/4","2/4","2","2","2/6","6","2/5","2/6","2/5","2/4","2/4"]
["Military Organization","Academic","Pr/Re","3/6","1/3","3/6","1/4","3/6","2/4","2/5","2/5","2/5","2/5","1/4","1/3","3/6","3/6","3/6","2/4","3/6","3/6","3/6","3","1/5","3/6","3/6","1/4","1/3","3/6","4","1/5","1/4","2/5","2/5","3/6","1/3","1/3","1/2","3/6","3/6","3/6","2/5","1/4","3/6","3/6","3/6","2/5","3/6","1/2","1/4","2/5","1/4","1/3","1/3","1/4","1/4","3/6","3/6","1/3","2/6","2/5","3/6","1/3","1/3","1/4","3/6","2/5","1/5","2/4","2/5","1/5","4","2/5","3/6","3/6"]
["Mining","Academic","Re/In","3","2/6","3","2/4","3","2/6","2/6","6","2/6","2/6","1/4","2/6","3/7","3","2/6","1/4","3/7","4","5","2/7","2/6","3","2/6","3/6","2/6","3","2/7","6","2/4","2/6","2/4","3","2/6","2/6","2/5","2/5","3","3","2/6","2/4","5","3","2/5","3/6","2/6","2/4","3/6","2/6","2/4","2/6","2/4","2/4","2/4","1/2","2/5","2/6","2/7","2/6","3","2/6","2/6","1/4","2/6","2/5","2/5","4","6","3/6","2/7","2/6","3","3"]
["Navigation","Academic","Re/In","2/6","2/6","2/6","2/5","1/3","2/6","2/6","6","2/5","1/4","2/6","2/6","2/4","2/6","2/6","3/7","2/4","2/6","2/4","1/4","2/6","2/6","2/6","2/6","2/6","2/6","2/4","6","2/5","2/6","2/5","2/6","2/6","2/6","2/5","2/6","2/6","2/6","2/6","2/5","2/4","2/6","2/6","2/6","2/6","1/3","2/5","1/4","2/5","2/6","1/4","2/4","2/5","1/2","2/6","2/6","1/4","2/6","2/6","2/6","2/6","2/6","1/4","2/6","2/6","2/5","6","2/6","2/5","1/4","2/6","2/6"]
["Phil/Relig. Doctrine","Academic","In/Re","1/2","2","1/2","2","1/2","7","1/3","3","2","1/3","2","2","1/2","1/2","2/6","1/2","1/2","3","1/2","1/2","2","1/2","2/6","1/4","2","1/2","1/2","1/3","2","2/5","2","1/2","4","2","1/5","1/2","1/2","1/2","1/3","2","1/2","1/2","1/2","2","2/6","2","1/2","1/3","2","2","1/2","2","1/3","1/2","1/2","2","1/2","2/6","1/2","2","1/2/2","2","2","1/4","1/4","1/2","6","1/4","1/2","1/3","1/2","1/2"]
["Physics","Academic","Re","2/5","4/8","3/7","4/7","2/3","7","3/6","7","7","3/7","3/7","4/8","3/6","3/7","3/7","3/7","3/6","5","5","5","4/8","3/6","3/7","3/7","4/8","1/3","3/6","7","4/7","3/6","4/7","3/5","4/8","4/8","4/8","3/7","3/7","3/6","3/6","4/7","5","3/6","3/7","3/8","3/7","4/7","3/7","3/7","4/7","4/8","1/3","4/7","1/4","3/6","3/7","4/8","4/7","3/6","3/6","4/8","4/8","3/8","2/4","4/7","4/7","3/7","6","3/7","4/7","3/7","3/7","3/7"]
["Planetology","Academic","Re/Em","4","6","4","6","3","5","5","6","5","5","6","6","4","4","4","4","4","6","6","2/7","6","4","4","3/7","6","4","4","6","6","5","6","4","6","6","6","4","4","4","5","6","6","4","4","5","4","6","5","5","6","6","1/4","6","1/4","4","4","6","4","5","4","6","6","6","6","6","6","5","6","3/7","4","5","4","4"]
["Poison Lore","Academic","Re","1/3","1/4","2/6","1/2","2/6","2/4","1/4","3/6","1/4","1/3","1/4","1/5","2/5","2/6","2/6","1/4","2/5","1/4","1/4","1/3","1/4","1/3","2/6","2/5","1/4","2/6","1/2","3/6","1/4","2/5","1/4","2/6","1/4","1/4","1/4","1/3","2/6","2/6","2/4","1/4","1/4","1/4","1/3","1/3","2/6","1/4","2/4","1/3","1/4","1/4","1/3","1/4","1/4","2/5","1/3","1/4","1/2","1/4","1/3","1/4","1/4","1/4","1/4","2/5","2/5","1/3","6","2/5","1/2","1/3","2/6","2/6"]
["Racial History","Academic","Re","1/4","3","1/4","3","1/4","7","1/2","2/6","3","2/4","3","3","1/4","1/4","2/6","2/5","1/4","4","2/5","1/4","3","1/4","2/6","2/6","3","1/4","1/4","2/6","3","2/5","3","1/4","3","3","1/5","1/4","1/4","1/4","2/4","3","2/5","1/4","1/4","3","2/6","3","2/4","2/4","3","3","1/2","3","1/3","1/4","1/4","3","1/4","2/6","1/4","3","3","3","3","2/6","2/6","1/4","6","2/6","1/4","2/4","1/4","1/4"]
["Research","Academic","Re/In","1/2","2","1/2","2","1/2","7","1/3","3","2","1/3","2","2","1/2","1/2","2/6","1/2","1/2","3","1/2","1/2","2","1/2","2/6","1/4","2","1/2","1/2","1/3","2","2/5","2","1/2","4","2","1/5","1/2","1/2","1/2","1/3","2","1/2","1/2","1/2","2","2/6","2","1/2","1/3","2","2","1/2","2","1/3","1/2","1/2","2","1/2","2/6","1/2","2","1/2/2","2","2","1/4","1/4","1/2","6","1/4","1/2","1/3","1/2","1/2"]
["Sanity Healing Lore","Academic","Re/Em","2","8","2","6","2/5","10","3/6","3","8","2/5","7","8","2/5","2","2/6","3/5","2/5","7","2","1/4","8","1/3","2/6","2/5","8","2","1/2","3","6","3/6","6","2/5","8","8","6","2/5","2","1/3","2/5","6","2","1/3","2/5","7","2/6","6","1/5","2/5","6","8","1/3","6","2/5","1/4","2/5","8","1/3","3/6","2","8","8","7","7","3","3","1/3","8","4","1/5","2/5","2","2"]
["Siege Engineer","Academic","Re/In","2/4","1/2","2/4","1/4","2/5","3/6","2/4","3/6","1/3","1/4","2/6","1/2","2/5","1/4","2/6","2/4","2/5","2/6","2/6","2/5","1/2","2/4","2/6","1/4","1/2","2/4","2/5","3/6","1/4","2/5","1/4","1/4","1/2","1/2","1/2/2","1/4","2/4","2/4","2/4","1/4","2/6","2/4","1/4","1/3","2/6","1/4","1/3","1/4","1/4","1/2","1/3","1/4","1/4","2/5","1/4","1/2","1/6","2/4","2/4","1/2","1/2","2/6","2/5","2/6","2/6","1/3","4","1/4","2/6","1/4","2/4","2/4"]
["Spec. Know. Lore","Academic","Re","1/3","1/3","1/3","1/3","1/3","1/3","1/3","1/3","1/3","1/3","1/3","1/3","1/3","1/3","1/3","1/3","1/3","1/3","1/3","1/3","1/3","1/3","1/3","1/3","1/3","1/3","1/3","1/3","1/3","1/3","1/3","1/3","1/3","1/3","1/3","1/3","1/3","1/3","1/3","1/3","1/3","1/3","1/3","1/3","1/3","1/3","1/3","1/3","1/3","1/3","1/3","1/3","1/3","1/3","1/3","1/3","1/3","1/3","1/3","1/3","1/3","1/3","1/3","1/3","1/3","1/3","1/3","1/3","1/3","1/3","1/3","1/3"]
["Star-gazing","Academic","In/Re","2/6","2/6","2/6","2/6","1/2","2/6","2/5","6","2/6","2/4","2/6","2/6","1/3","1/4","2/6","2/6","1/3","3/9","2/5","1/2","2/6","1/4","2/6","2/6","2/6","2/6","1/4","6","2/6","2/5","2/6","2/6","2/6","2/6","2/6","2/5","2/6","2/6","2/5","2/6","2/5","1/4","2/5","2/6","2/6","2/6","2/5","2/4","2/6","2/6","1/3","1/4","1/4","1/3","2/5","4/12","1/2","2/5","1/3","2/6","2/6","2/6","1/4","2/5","2/5","1/4","6","2/6","1/2","2/4","2/6","2/6"]
["Stone Lore","Academic","Re","1/2","2/6","1/4","2/5","1/4","3/7","2/4","3","2/5","2/5","2/4","1/5","2/6","2/4","2/6","1/4","2/6","2/5","2/5","2/5","2/6","2/5","1/5","3/7","2/6","1/4","3/7","3","2/5","2/5","2/5","2/4","2/6","2/6","2/6","2/4","1/4","3/6","2/6","2/5","2/5","2/5","2/4","2/4","2/6","2/5","2/4","2/5","2/5","2/6","1/3","2/5","1/4","3/6","2/4","2/6","2/5","2/4","2/4","2/6","2/6","2/4","2/4","2","2","2/6","6","2/4","2/6","2/5","2/4","2/4"]
["Tactics","Academic","In/Re","2/4","1/2","2/4","2/5","2/5","1/2","2/4","5","1/3","1/4","1/3","1/2","2/5","1/4","2/6","2/4","2/5","2/7","2/6","2/5","1/2","2/4","2/6","1/4","1/2","2/4","2/5","1/4","1/3","2/5","1/3","1/4","1/2","1/2","1/2/2","1/4","2/4","2/4","2/4","1/3","2/6","2/4","1/4","1/3","2/6","1/3","1/3","1/4","1/3","1/2","1/4","1/3","1/4","2/5","1/4","1/2","1/6","2/4","2/4","1/2","1/2","1/3","2/5","1/4","1/4","2/4","4","1/4","2/6","1/4","2/4","2/4"]
["Trading Lore","Academic","Re","2/6","2/7","2/5","2/7","2/6","2/6","1/4","2/7","1/3","1/2","2/5","1/5","2/4","2/5","2/6","2/4","2/4","2/4","2/6","2/4","2/7","1/4","1/5","2/6","2/7","2/5","2/4","2/7","2/7","2/5","1/2","2/5","4/9","2/7","2/7","2/6","2/5","2/6","2/5","2/7","2/6","2/4","2/6","2/5","2/6","2/7","1/4","1/2","2/7","2/7","1/3","2/7","1/3","2/5","2/6","2/7","2/4","1/4","2/6","2/7","2/7","2/5","1/2","2/6","2/6","2/4","6","2/6","3/5","1/2","2/5","2/5"]
["Weather Watching","Academic","In/Em","1/4","3/7","1/4","3/7","1/2","3/7","2/6","6","1/4","1/5","3/7","3/7","1/3","1/4","2/6","3/7","1/3","3/7","2/5","1/3","3/7","1/4","1/3","2/5","3/7","1/4","1/3","6","3/7","2/6","3/7","1/4","3/7","3/7","2/6","2/6","1/4","2/6","1/5","3/7","2/5","1/4","2/6","3/7","2/6","3/7","2/5","1/5","3/7","3/7","1/4","2/4","2/5","1/2","2/6","3/7","1/3","2/6","1/3","3/7","3/7","3/7","2/5","2/7","2/7","1/4","6","2/5","1/3","1/5","1/4","1/4"]
["Xeno lore","Academic","varies","4/6","6","4/7","6","4/7","6","3/5","6","4","4","6","1/5","4/7","4/7","6","4/7","4/7","6","6","4/7","6","4/7","6","5","6","4/7","4/7","6","6","3/5","6","4/7","6","6","6","4/7","4/7","4/7","4","6","6","4/7","4/7","4","6","6","4","4","6","6","3/6","6","3/8","4/7","4/7","6","4/7","3/5","4/7","6","6","5","5","6","6","4/7","6","5","4/7","4","4/7","4/7"]
["Animal Handling","Animal","Em/Pr/Ap","2/5","2/8","4","3","2","1/3","1/5","4","1/2","1/3","3/6","1/4","2","2/4","2/6","3","1/3","2/7","3","1/2","1/4","2/6","1/3","1/5","1/4","2/5","2","2/6","1/2","1/5","1/4","2/5","1/4","1/4","1/4","2","2/5","2","2/5","1/4","2/7","2/6","2","2/5","2/6","1/4","1/4","1/3","1/4","1/4","3","2/4","2/5","2","2","1/4","2/4","1/5","2/7","1/4","1/4","2/5","1/3","2/6","2/6","24","6","1/5","1/4","1/3","2/5","2/5"]
["Animal Training","Animal","Em/Pr/Ap","4","3/7","4","3","4","1/3","3/7","4","1/2","3/7","3/8","3/7","4","4","2/6","4","3/7","2/7","5","1/3","3/7","4","1/3","2/6","3/7","4","4","3/8","2/3","3/7","2/3","4","3/7","3/7","3/7","4","4","3","4","3/6","3","4","4","3/8","2/6","3/6","3/7","3/6","3/6","3/7","3","4","2/6","3","4","3/7","4","3/7","4","3/7","3/7","3/7","1/4","3/8","3/8","4","6","2/6","2","3/7","4","4"]
["Beast Master","Animal","Em/Pr","5","4","2/5","3","5","3/7","4","4","1/2","4","5","4","5","4","2/6","5","4","3/8","4","2/4","4","4","1/3","4","4","4","5","4","4","4","8","4","4","4","4","5","4","4","4","4","3/5","4","5","5","2/6","4","4","4","4","4","4","4","4","4","5","4","3/6","4","5","4","4","4","2/5","4","4","1/4","6","4","2/5","4","4","4"]
["Driving","Animal","Ag/Qu","3","1/4","4","3","3","1/3","2/7","4","1/4","2/7","2/6","1/4","3","3","2/6","5","2/7","2/7","3","2","1/4","3","1/3","2/4","1/4","3","3","2/6","1/5","2/7","1/5","3","1/4","1/4","1/4","3","3","3","2/7","1/5","2/7","3","3","3","2/6","1/5","2/6","2/7","1/5","1/4","3","2/6","2/6","3","3","1/4","3","2/7","3","1/4","1/4","2/6","1/2","2/6","2/6","3","6","2/4","3","2/7","3","3"]
["Herding","Animal","Em/Pr","2/6","1/4","2/5","3","3/7","1/4","2/7","4","1/2","2/7","2/5","1/4","2/5","2/5","2/6","4","2/7","2/5","3/6","1/3","1/4","3/5","1/3","3/7","1/4","2/6","2/5","6","1/4","2/7","1/4","2/6","1/4","1/4","1/4","2/6","2/6","3/7","3/7","1/4","2/5","3/5","2/6","2","2/6","1/4","2/6","2/7","1/4","1/4","3/7","2/4","2/6","3/7","2/6","1/4","2/5","2/7","2/7","1/4","1/4","2/5","2/4","2/6","2/6","3/6","6","3/7","2/5","2/7","2/6","2/6"]
["Loading","Animal","Em/Re","3","1/4","4","3","3","1/3","2/7","4","1/4","2/7","2/6","1/4","2","3","2/6","4","2/7","3/6","3","2","1/4","3","1/3","2/4","1/4","3","2","2/6","1/5","2/7","1/5","3","1/4","1/4","1/4","3","3","3","2/7","1/5","2/6","3","3","3","2/6","1/5","2/6","2/5","1/5","1/4","4","2/4","3","3","3","1/4","3","2/7","3","1/4","1/4","2/6","1/2","2/6","2/6","3","6","2/4","3","2/7","3","3"]
["Riding","Animal","Em/Ag","3","2/6","4","3","3","2/6","2/7","2/6","1/3","2/6","3","2/5","3","3","2/6","4","2/6","3/7","3","1/4","2/6","4","1/5","2/6","2/6","3","3","3","1/3","2/7","2/5","3","2/6","1/3","2/4","6","3","2","3","2/6","3","3","3","3","2/6","2/5","2/5","2/6","2/5","2/5","3","3/7","3","2","3","2/6","2/4","2/6","3","2/6","1/3","2/6","1/4","2/7","2/7","3","3","2/6","3","2/6","3","3"]
["Athletic Games","Athletic","St/Ag/Qu","7","1/4",7,"1/5","7","1/4","2/6","1/5","1/5","1/4","1/5","1/4","5","6","2/6","8","1/4","1/4","3/6","3","1/4","7","2/6","2/6","1/4","6","6","1/5","1/5","2/6","1/5","7","1/4","1/4","1/4","7","6","5","1/5","2/6","3/6","7","7","2/6","2/6","1/5","1/5","1/4","1/5","1/4","9","1/5","7","4","7","1/4","7","2/6","7","1/4","1/4","1/5","2/6","1/5","1/5","4","2/6","2/6","7","1/4","6","6"]
["Body Development","Athletic","Co/10","6","2/6","6","2/7","6","1/3","3/8","1/3","2/7","1/5","3/7","1/4","4/8","6","4","6","2/5","1/5","2/6","4/8","1/5","6","1/4","2/6","1/3","6","3/7","2/5","2/5","3/9","2/5","6","1/3","1/5","1/4","3/7","6","6","3/7","3/7","3/5","6","6","3/7","2/6","2/5","2/5","2/6","2/5","2/7","6","2/5","6","6","6","2/5","2/4","3/8","6","1/5","2/5","2/6","2/6","1/4","2/7","6","1/3","2/8","6","2/7","8","6"]
["Climbing","Athletic","Ag","7","3/7",7,"1/5","7","2/6","3/9","2/6","2/5","3/6","1/3","5","5","6","3/7","5","3/9","2/5","2/5","4","3/7","7","2/5","2/7","3/7","6","6","2/6","3/7","3/9","3/7","7","2/4","3/7","4","4","6","5","3/7","3/9","5","7","7","3/7","3/6","3/7","6","3/9","3/7","3/7","7","1/4","6","4","5","3/7","5","3/9","7","3/7","3/7","2/5","4","2/4","3/7","4","2/6","3/9","5","5","6","6"]
["Dancing","Athletic","Ag/In","2/6","2/6","2/6","2/4","2/5","2/6","1/3","6","2/6","2/6","2/4","2/6","1/5","2/6","2/6","2/6","2/5","1/2","1/5","1/5","2/6","1/3","2/6","2/6","2/6","2/6","2/4","6","2/4","1/3","2/4","2/6","2/6","2/6","2/6","2/6","2/6","2/6","1/5","1/3","1/5","2/4","2/6","2/4","2/6","2/4","2/5","2/5","2/4","2/6","2/6","2/4","2/6","2/5","2/6","2/6","1/4","1/5","2/7","2/6","2/6","2/4","2/6","2/4","2/4","2/6","6","2/6","1/4","2/5","2/6","2/6"]
["Distance Running","Athletic","Co","3","2/4",3,"2/5","3","2/4","2/6","1/2","2/5","2/4","1/3","2/4","3","3","2/6","3","2/6","1/4","1/2","3","2/4","3","2/6","2/5","2/4","3","3","1/4","2/5","2/6","2/5","3","2/4","2/4","2/4","3","3","3","2/6","2/6","1/2","3","3","1/3","2/6","2/5","2/5","2/6","2/5","2/4","3","2/5","3","3","3","2/4","3","2/6","3","2/4","2/4","1/3","2/5","1/5","1/5","3","2/6","2/7","4","2/6","3","3"]
["Diving","Athletic","Sd/Ag","3","2/6",3,"1/3","3","2/6","2/5","1/5","2/4","2/6","1/3","2/6","2/5","3","2/6","3","2/5","1/3","1/3","2/5","2/6","3","2/6","2/5","2/6","3","2/5","2/5","2/4","2/5","2/4","3","2/6","2/6","2/6","3","3","3","2/4","2/5","1/3","3","3","2/4","2/6","2/4","2/6","2/5","2/4","2/6","3","2/4","3","3","3","2/6","3","2/5","3","2/6","2/6","1/3","2/5","1/4","1/4","3","6","2/6","4","2/5","3","3"]
["Endurance","Athletic","None","6","2/6",8,"2/7","6","1/3","3/8","1/3","2/7","1/5","3/7","1/4","6","7","4","8","2/5","1/5","2/6","4","1/5","8","1/4","2/5","1/3","8","1/3","2/7","2/5","3/9","2/5","8","1/2","1/3","1/4","3/7","8","6","3/7","3/8","3/5","8","8","3/8","2/6","2/5","2/5","2/7","2/5","2/7","6","2/5","7","6","6","1/3","2/4","3/8","8","1/3","1/3","3/7","2/6","1/4","2/7","8","1/3","2/8","6","2/7","8","8"]
["Flying/Gliding","Athletic","Ag","3","3/6",3,"2/6","3","3/6","2/6","2/5","2/6","3/6","1/5","3/6","2/7","3","2/6","3","2/6","2/4","2/5","2/7","3/6","3","2/6","2/5","3/6","3","2/7","2/5","2/6","2/6","2/6","3","3/6","3/6","3/6","3","3","3","2/5","2/6","2/5","3","3","1/5","2/6","4/12","2/6","2/6","2/6","3/6","3","2/6","3","3","3","3/6","3","2/6","3","3/6","3/6","1/5","2/6","2/5","2/5","3","6","2/5","1/4","2/6","3","3"]
["Holding Breath","Athletic","Co/Sd","6","2/6",8,"2/7","6","1/3","3/8","1/3","2/7","1/5","3/7","1/4","6","7","4","8","2/5","1/5","2/6","4","1/5","8","1/4","2/5","1/3","8","1/3","2/7","2/5","3/9","2/5","8","1/2","1/3","1/4","3/7","8","6","3/7","3/8","3/5","8","8","3/8","2/6","2/5","2/5","2/7","2/5","2/7","6","2/5","7","6","6","1/3","2/4","3/8","8","1/3","1/3","3/7","2/6","1/4","2/7","8","1/3","2/8","6","2/7","8","8"]
["Portaging","Athletic","none","2/4","1/2","2/4","2/5","2/5","1/2","2/4","5","1/3","1/4","1/3","1/2","2/5","1/4","2/6","2/4","2/5","2/7","2/6","2/5","1/2","2/4","2/6","1/4","1/2","2/4","2/5","1/4","1/3","2/5","1/3","1/4","1/2","1/2","1/2/2","1/4","2/4","2/4","2/4","1/3","2/6","2/4","1/4","1/3","2/6","1/3","1/3","1/4","1/3","1/2","1/4","1/3","1/4","2/5","1/4","1/2","1/6","2/4","2/4","1/2","1/2","1/3","2/5","1/4","1/4","2/4","1/4","1/4","2/6","1/4","2/4","2/4"]
["Rappelling","Athletic","Ag","7","3/7",6,"1/3","7","3/7","3/9","2/5","3/7","3/7","2/5","3/7","5","6","2/6","3/7","3/9","2/5","3/7","4","3/7","7","2/6","2/5","3/7","6","6","2/5","3/7","3/9","3/7","7","2/4","3/7","3/7","7","6","5","3/7","3/9","3/7","7","7","2/5","2/6","3/7","3/7","3/9","3/7","3/7","8","3/7","7","4","7","3/7","6","3/9","7","3/7","3/7","2/5","3/7","2/4","3/7","4","6","3/8","8","3/9","6","6"]
["Rowing","Athletic","St/Sd","3","1/4",3,"2/5","3","1/4","2/5","6","1/3","1/4","1/4","1/4","2/5","3","2/6","4","2/4","3/7","3/9","2/7","1/4","3","2/6","2/5","1/4","3","2/6","6","1/3","2/5","1/3","3","1/4","1/4","1/4","3","3","3","1/5","2/5","3/9","3","3","1/4","2/6","1/3","2/4","2/4","1/3","1/4","5","1/3","3","3","3","1/4","2/4","2/5","3","1/4","1/4","1/4","1/4","1/4","1/4","3","3/7","2/5","3","2/4","3","3"]
["Sailing","Athletic","Em/In","3","2/6","3","2/6","3","2/6","2/6","6","2/6","2/6","2/6","2/6","2/4","3","2/6","3/7","2/5","3/7","3/7","2/7","2/6","3","2/6","2/5","2/6","3","2/5","6","2/6","2/6","2/6","3","2/6","2/6","2/6","3","3","3","2/4","2/6","3/7","3","3","2/6","2/6","2/6","2/5","2/5","2/6","2/6","3","1/3","3","3","3","2/6","2/4","2/6","3","2/6","2/6","2/6","2/6","2/6","2/6","3","6","3/7","3","2/5","3","3"]
["Skating","Athletic","Ag/Sd","3","2/7","3","2/6","3/7","2/5","2/7","6","2/6","2/7","2/6","2/7","2/6","3","2/6","2/6","2/6","1/2","1/3","2/7","2/7","3/7","2/6","2/5","2/7","3","2/7","6","2/6","2/7","2/6","3","2/7","2/7","2/7","3/7","3","3/5","2/6","2/7","1/3","3/7","3/7","2/6","2/6","4/12","2/6","2/6","2/6","2/7","3","2/6","3","3/5","3/7","2/7","2/5","2/7","3/7","2/7","2/7","2/6","2/5","2/5","2/5","3/7","6","2/6","3","2/6","3","3"]
["Skiing","Athletic","Ag/Sd","3","2/7","3","2/6","3/7","2/5","2/7","6","2/6","2/7","2/6","2/7","2/6","3","2/6","2/6","2/6","1/4","1/4","2/7","2/7","3/7","2/6","2/5","2/7","3","2/7","6","2/6","2/7","2/6","3","2/7","2/7","2/7","3/7","3","3/5","2/6","2/7","1/4","3/7","3/7","2/6","2/6","2/6","2/7","2/6","2/6","2/7","5","2/6","3","3/5","3/7","2/7","2/5","2/7","3/7","2/7","2/7","2/6","2/5","2/5","2/5","3/7","6","2/6","3","2/6","3","3"]
["Sprinting","Athletic","Qu","3","2/4","3","2/5","3","2/4","2/6","1/2","2/5","2/4","1/3","2/4","3","3","2/6","4","2/6","1/4","1/3","3","2/4","3","2/6","2/5","2/4","3","3","1/5","2/5","2/6","2/5","3","2/4","2/4","2/4","3","3","3","2/6","2/6","1/3","3","3","1/3","2/6","2/5","2/5","2/6","2/5","2/4","3","2/5","3","3","3","2/4","3","2/6","3","2/4","2/4","1/3","2/5","1/5","1/5","3","4","2/7","3","2/6","3","3"]
["Surfing","Athletic","Ag/Sd","3","2/7","3","2/6","3/7","2/5","2/7","6","2/6","2/7","2/6","2/7","2/6","3","2/6","5","2/6","1/3","1/4","2/7","2/7","3/7","2/6","2/5","2/7","3","2/7","6","2/6","2/7","2/6","3","2/7","2/7","2/7","3/7","3","3/5","2/6","2/7","1/4","3/7","3/7","2/6","2/6","4/12","2/6","2/6","2/6","2/7","3","2/6","3","3/5","3/7","2/7","2/5","2/7","3/7","2/7","2/7","2/6","2/5","2/5","2/5","3/7","6","2/6","3","2/6","3","3"]
["Swimming","Athletic","Ag","3","2/6","3","2/5","3","1/3","2/6","2/5","2/5","2/6","2/6","3","3","3","3","3","2/6","2/5","1/5","3","2/6","3","1/5","2/5","2/6","3","3","2/5","2/5","2/7","2/5","3","1/3","2/6","3","3","3","3","2/6","2/5","3","3","3","3","2/6","2/5","3","2/6","2/5","3/7","3","1/2","3","3","3","2/6","3","2/6","3","2/6","2/6","1/3","2/5","1/5","1/5","3","5","2/6","3","3","3","3"]
["Shield Expertise","Combat","None","20","5","20","9","20","6","15","6","6","4","9","3/8","9","20","20","20","9","10","15","9","3/8","20","20","6","3/8","20","20","10","6","15","9","20","4/8","5","6","15","20","20","15","9","15","20","20","15","7","6","5","9","6","8","20","6","20","20","20","5","9","10","20","3/8","3/8","6","6","3/8","15","20","3/8","6","20","6","20",15]
["AirBorne Combat","Combat","Ag/Qu","18","2/6","18","3/6","20","3/6","3/6","3/6","3/6","2/6","3/6","2/6","20","18","2/6","20","3/6","6","12","20","4","20","3/8","3/6","2/6","18","20","3/6","2/3","3/6","3/6","18","4/9","1/3","2/6","18","18","8","3/6","3/6","12","20","18","18","2/6","5","3/6","3/6","3/6","2/6","20","3/6","20","15","18","2/6","20","3/6","20","2/6","2/6","3/6","5","3/6","3/6","20","2/6","3/6","20","3/6","18","18"]
["Brawling","Combat","St/Ag/Eq","18","2/6","18","2/7","18","2/5","5","1/4","2/6","2/6","2/7","3/7","7","18","2/6","20","5","3/5","5","5","2/6","18","3/8","2/6","2/6","18","18","2/6","1/5","5","1/5","18","1/3","2/6","1/4","18","18","8","2/6","5","5","18","18","2/7","2/6","1/5","3/6","3/7","1/5","2/6","20","1/5","18","15","18","1/3","18","5","18","2/6","4/8","2/5","2/5","1/4","2/6","15","1/3","6","18","5","18","18"]
["Closing","Combat","Qu/Ag","15","2/7","15","2/7","15","1/5","5","1/5","5","2/7","2/7","1/5","15","15","15","15","5","2/7","5","15","1/5","15","2/7","2/7","1/5","15","15","2/7","2/7","5","2/7","15","1/5","2/7","1/5","5","15","15","5","5","5","15","15","5","2/7","2/7","2/7","5","1/5","1/5","15","2/7","2/7","15","15","2/7","15","5","15","1/5","2/7","2/7","2/7","1/2/2","1/5","15","1/5","2/7","15","5","15","15"]
["Defensive Technique","Combat","none","20","2/5","20","3/7","20","1/5","6","2/6","3/7","2/7","3/8","1/5","7","20","8","12","4","5","5","8","2/5","20","4","3/7","2/5","20","20","3/8","3/8","6","3/8","20","2/5","2/5","2/7","7","20","8","8","4","5","20","20","4","3/6","2/5","3/7","3/7","3/8","2/5","10","3/8","6","15","20","2/5","7","5","20","2/5","2/5","3/8","3/8","4/8","6","20","1/5","3/7","20","3/7","15","15"]
["Defensive Weaving","Combat","None","20","2/5","20","3/7","20","1/5","6","2/6","3/7","2/7","2/5","1/5","7","20","8","12","4","5","5","8","2/5","20","4","3/7","2/5","20","20","3/8","3/8","6","3/8","20","2/5","2/5","2/7","7","20","8","8","3/7","5","20","20","4","3/6","2/5","3/7","3/7","2/5","2/5","10","2/5","6","15","20","2/5","7","5","20","2/5","2/5","2/5","3/8","4/8","6","20","1/5","3/7","20","3/7","15","15"]
["Disarm, Armed","Combat","Ag/Eq","6","2/5","6","2/5","6","2/5","5","3/6","2/5","2/5","2/5","2/5","5","6","2/6","9","4","3/6","5","5","1/3","6","3/8","4","2/5","6","7","1/3","2/5","5","2/5","5","2/5","2/5","2/5","6","6","6","3","5","5","6","6","2/5","2/6","2/5","2/5","3/6","2/5","2/5","9","2/5","7","6","6","2/5","7","5","6","1/3","2/5","2/5","4","2/3","2/3","5","2/5","4","5","2/5","6","6"]
["Disarm, Unarmed","Combat","Ag/Eq","9","3/6","9","3/6","8","3/8","6","3/6","3/6","3/6","3/6","3/6","7","9","3/6","9","5","2/5","4","7","2/4","8","3/8","6","3/6","9","9","2/4","3/6","6","3/6","9","3/6","3/6","3/6","9","9","3","2/4","6","4","8","9","3/7","2/6","3/6","3/7","5","3/6","3/6","9","3/6","6","3","9","3/6","9","6","8","3/6","3/6","3/6","5","1/5","1/5","7","3/6","6","7","3/6","9","9"]
["Distract Foe","Combat","Ag/Qu","9","3/7","6","3/7","6","3/7","3","1/2","3/7","3/7","3/7","3/7","6","9","4","9","3/7","1/5","2/5","6","3/7","6","3/8","3/8","3/7","9","6","1/2","3/7","3","3/7","9","2/4","3/7","3/7","5","9","3","2/5","3","2/5","6","9","3/7","3/6","3/7","6","4","3/7","4","4","3/7","3","3","8","3/7","6","4","9","3/7","3/7","3/7","3/7","1/3","1/3","9","3/6","3/8","8","4","9","9"]
["Donning/Doffing Chain","Combat","Ag/Qu",10,"2/*","10","4/*","6/*","5/*","3/*","6/*","4/*","3/*","10","2/*","10","10","6/*","15","3/*","3/*","9/*","10","5/*","8/*","6/*","3/*","2/*","10","10","3/*","2/*","3/*","2/*","10","1/*","2/*","2/*","4/*","10","6/*","10","4/*","9/*","6/*","10","4/*","3/*","2/*","2/*","3/*","2/*","5/*","6/*","4/*","5/*","6/*","10","2/*","10","4/*","10","2/*","2/*","3/*","4/*","1/*","10","6/*","1/*","3/*","10","3/*","10","10"]
["Donning/Doffing Plate","Combat","Ag/Qu",11,"2/*","11","7/*","7/*","7/*","5/*","10","6/*","4/*","10","2/*","11","11","9/*","20","4/*","15","20","11","7/*","9/*","7/*","4/*","2/*","20","11","5/*","3/*","5/*","3/*","11","2/*","2/*","2/*","5/*","11","7/*","11","5/*","20","7/*","11","6/*","4/*","3/*","3/*","4/*","3/*","7/*","7/*","7","7/*","7/*","11","2/*","11","8","11","2/*","2/*","4/*","5","10","10","7/*","1/*","4/*","11","4/*","11","11"]
["Donning/Doffing RL","Combat","Ag/Qu",9,"1/*","9","1/*","5/*","3/*","2/*","1/*","2/*","1/*","9","1/*","2/*","9","3/*","12","2/*","9","7/*","1/*","3/*","7/*","3/*","2/*","1/*","9","3/*","2/*","1/*","2/*","1/*","9","1/*","1/*","1/*","3/*","9","5/*","9","3/*","7/*","5/*","9","2/*","2/*","1/*","1/*","2/*","1/*","3/*","5/*","1/*","4/*","5/*","9","1/*","2/*","2/*","9","1/*","1/*","2/*","2/*","1/*","9","4/*","1/*","2/*","9","2/*","9","9"]
["Donning/Doffing SL","Combat","Ag/Qu",9,"1/*","9","1/*","4/*","2/*","2/*","1/*","2/*","1/*","9","1/*","1/*",9,"2/*",10,"1/*","2/*","5/*","1/*","2/*","6/*","2/*","2/*","1/*",9,"2/*","2/*","1/*","2/*","1/*",9,"1/*","1/*","1/*","2/*",9,"4/*","9","2/*","5/*","4/*",9,"2/*","1/*","1/*","1/*","1/*","1/*","2/*","4/*","1/*","3/*","4/*",9,"1/*","1/*","1/*",9,"1/*","1/*","1/*","2/*","1/*","9","4/*","1/*","2/*",9,"1/*",9,9]
["Expertise","Combat","none","20","6","20","6","20","3/8","15","3/8","6","6","9","3/8","9","20","20","20","6","10","15","9","3/8","20","20","9","4/9","20","20","8","6","15","6","20","4/9","5","5","15","20","20","15","9","15","20","20","9","7","6","6","9","6","8","20","6","20","20","20","5","9","10","20","2/5","5","6","6","4/9","15","20","4/9","9","20","9","20","20"]
["Feinting","Combat","Qu/Pr","6","2/5","6","2/5","6","2/5","5","3/6","2/5","2/5","2/5","2/5","5","6","2/6","9","4","3/6","5","5","1/3","6","3/8","4","2/5","6","7","1/3","2/5","5","2/5","5","2/5","2/5","1/4","6","6","6","3","2/5","5","6","6","2/5","2/6","2/5","2/5","4","2/5","2/5","9","2/5","7","6","6","2/5","7","5","6","1/3","2/5","1/4","4","2/3","2/3","5","2/5","4","5","4","6","6"]
["Grappling Hook","Combat","Ag","3","2/6","3","1/5","3","2/6","2/5","2/5","2/6","2/6","1/3","2/6","2/5","3","2/6","2/4","2/5","2/4","3","2/5","4","5","3/8","2/6","2/6","3","2/6","2/5","1/5","2/5","1/5","3","2/6","2/6","2/6","2/6","3","3","2/4","2/5","3","3","2/6","1/3","2/6","1/5","2/6","2/5","1/5","2/6","3","1/5","2/4","3","2/6","2/6","2/6","2/5","3","2/6","2/6","1/3","1/4","2/5","2/5","3","2/6","3/6","3/8","2/5","3","3"]
["Honing","Combat","Ag/Em","20","2/5","20","3/7","20","2/5","6","1/5","4","2/7","3/8","2/5","7","20","8","12","4","5","5","8","6","20","4","2/5","2/5","20","20","3/8","3/8","6","3/8","20","2/5","2/5","3/7","7","20","8","8","4","5","20","20","6","3/6","3/8","3/8","4","3/8","2/5","10","3/8","6","15","20","2/5","7","5","20","2/5","2/5","3/8","3/8","4/8","6","20","1/5","3/8","20","4","15","15"]
["Iai","Combat","Qu/Eq","15","1/3","18","2/5","20","3/6","3/5","5","2/6","2/6","1/5","2/7","9","15","2/6","20","2/6","2/5","2/5","9","1/5","20","3/8","2/7","2/7","15","20","1/5","3/8","3/5","2/4","15","1/5","2/7","2/7","15","15","6","2/4","3/5","2/5","20","15","3/7","2/6","2/5","2/5","2/6","2/5","2/7","15","2/5","10","6","15","1/4","20","3/5","20","1/4","2/7","2/7","6","2/6","2/6","20","2/7","3/6","15","2/6","15","15"]
["Increase Wounds","Combat","Ag/St","20","3/9","20","3/9","20","2/7","10","2/7","10","3/9","3/9","2/7","20","20","20","20","10","3/9","10","20","2/7","20","3/9","3/9","2/7","20","20","3/9","3/9","10","3/9","20","2/7","3/9","2/7","10","20","20","10","10","10","20","20","10","3/9","3/9","3/9","10","2/7","2/7","20","3/9","3/9","20","20","3/9","20","10","20","2/7","3/9","3/9","3/9","2/7","2/7","20","2/7","3/9","20","10","20","20"]
["Instinctive Maneuver","Combat","Qu/Em","6","2/6","6","3/6","7","3/6","5","5","3/6","2/6","3/6","1/5","5","6","2/6","9","4","4","4","4","2/6","7","3/8","2/6","2/6","6","7","2/5","3/6","5","3/6","6","2/6","2/6","2/6","6","6","6","3/6","5","4","7","6","3/6","2/6","3/6","2/6","4","3/6","2/6","9","3/6","7","6","6","2/5","5","5","7","2/6","2/6","2/6","5","2/6","2/6","6","2/6","3/7","7","2/5","6","6"]
["Lancing","Combat","St/Ag","18","2/6","18","3/6","20","3/6","3/6","3/6","3/6","2/6","3/6","2/6","20","18","2/6","20","3/6","6","12","20","4","20","3/8","5","2/6","18","20","3/6","2/3","3/6","3/6","18","4/9","1/3","2/6","18","18","8","3/6","3/6","12","20","18","18","2/6","5","3/6","3/6","3/6","2/6","20","3/6","20","15","18","2/6","20","3/6","20","2/6","2/6","3/6","5","3/6","3/6","20","2/6","3/6","20","3/6","18","18"]
["MA Strikes","Combat","St/St/Ag","9","3/7","6","2/5","6","2/5","3","1/2","3/7","3/7","3/7","3/7","6","9","4","9","2/5","1/5","2/5","6","3/7","6","3/8","3/7","3/7","9","6","1/2","3/7","3","3/7","9","2/5","3/7","3/7","5","9","3","2/5","3","2/5","6","9","3/7","3/6","3/7","3/7","3/7","3/7","4","4","2/5","3","3","8","2/5","6","4","9","3/7","3/7","3/7","3/7","1/3","1/3","9","3/6","3/8","8","4","9","9"]
["MA Sweeps","Combat","St/Ag/Ag","9","3/7","6","2/5","6","2/5","3","1/2","3/7","3/7","3/7","3/7","6","9","4","9","2/5","1/5","2/5","6","3/7","6","3/8","3/7","3/7","9","6","1/2","3/7","3","3/7","9","2/5","3/7","3/7","5","9","3","2/5","3","2/5","6","9","3/7","3/6","3/7","3/7","3/7","3/7","4","4","2/5","3","3","8","2/5","6","4","9","3/7","3/7","3/7","3/7","1/3","1/3","9","3/6","3/8","8","4","9","9"]
["Man. Chain","Combat","St",10,"2/*","10","4/*","6/*","5/*","3/*","6/*","4/*","3/*","10","2/*","10","10","6/*","15","3/*","3/*","9/*","10","5/*","8/*","6/*","3/*","2/*","10","10","3/*","2/*","3/*","2/*","10","1/*","2/*","2/*","4/*","10","6/*","10","4/*","9/*","6/*","10","4/*","3/*","2/*","2/*","3/*","2/*","5/*","6/*","4/*","5/*","6/*","10","2/*","10","4/*","10","2/*","2/*","3/*","4/*","1/*","10","6/*","1/*","3/*","10","3/*","10","10"]
["Man. Plate","Combat","St",11,"2/*","11","7/*","7/*","7/*","5/*","10","6/*","4/*","10","2/*","11","11","9/*","20","4/*","15","20","11","7/*","9/*","7/*","4/*","2/*","20","11","5/*","3/*","5/*","3/*","11","2/*","2/*","2/*","5/*","11","7/*","11","5/*","20","7/*","11","6/*","4/*","3/*","3/*","4/*","3/*","7/*","7/*","7","7/*","7/*","11","2/*","11","8","11","2/*","2/*","4/*","5","10","10","7/*","1/*","4/*","11","4/*","11","11"]
["Man. Rigid L","Combat","Ag",9,"1/*","9","1/*","5/*","3/*","2/*","1/*","2/*","1/*","9","1/*","2/*","9","3/*","12","2/*","9","7/*","1/*","3/*","7/*","3/*","2/*","1/*","9","3/*","2/*","1/*","2/*","1/*","9","1/*","1/*","1/*","3/*","9","5/*","9","3/*","7/*","5/*","9","2/*","2/*","1/*","1/*","2/*","1/*","3/*","5/*","1/*","4/*","5/*","9","1/*","2/*","2/*","9","1/*","1/*","2/*","2/*","1/*","9","4/*","1/*","2/*","9","2/*","9","9"]
["Man. Soft L","Combat","Ag",9,"1/*","9","1/*","4/*","2/*","2/*","1/*","2/*","1/*","9","1/*","1/*",9,"2/*",10,"1/*","2/*","5/*","1/*","2/*","6/*","2/*","2/*","1/*",9,"2/*","2/*","1/*","2/*","1/*",9,"1/*","1/*","1/*","2/*",9,"4/*","9","2/*","5/*","4/*",9,"2/*","1/*","1/*","1/*","1/*","1/*","2/*","4/*","1/*","3/*","4/*",9,"1/*","1/*","1/*",9,"1/*","1/*","1/*","2/*","1/*","9","4/*","1/*","2/*",9,"1/*",9,9]
["Melee Scuffle","Combat","St/Ag","8","1/4","8","2/5","8","1/2","2/7","1/2","2/7","1/4","1/4","1/2","8","8","8","8","2/7","1/4","2/7","2/7","1/4","8","1/4","2/5","1/2","8","8","1/4","1/4","2/7","2/5","8","1/2","1/4","1/2","2/7","8","8","2/7","2/7","2/7","8","8","2/7","1/4","1/4","1/4","2/5","1/2","1/2","8","1/4","1/4","8","8","1/4","8","2/7","8","1/2","1/4","2/5","1/4","1/2","2/4","8","1/2","2/7","8","1/4","8","8"]
["Missile Artillery","Combat","In/Ag","3/6","1/3","3/6","1/4","2/7","2/4","2/5","1/4","2/5","1/3","1/4","1/3","3/6","3/6","3/6","3","2/5","2/5","3/7","3/7","20","4/7","3/8","1/4","1/3","3/6","4","1/4","1/4","2/5","1/4","3/6","2/6","1/3","1/3","3/6","3/6","3/6","2/5","2/5","3/7","2/7","3/6","2/5","3/6","4/8","1/4","2/5","1/4","1/3","3","1/4","2/5","3/7","3/6","1/3","4","2/5","2/7","1/3","1/3","1/4","3/6","1/5","1/5","3/7","1/3","2/5","4","2/5","3/6","3/6"]
["Moving Strike","Combat","Ag/Sd","20","2/7","20","3/7","20","3/8","5","2/4","3/7","2/7","3/5","2/7","20","20","2/6","20","3/7","3/7","3/9","15","20","20","3/8","3/8","2/7","20","20","2/4","3/7","5","3/7","20","2/7","2/7","2/7","20","20","20","3/7","5","3/9","20","20","4","2/6","3/7","3/7","3/7","3/7","2/7","20","3/7","20","20","20","2/7","20","5","20","1/4","2/7","4","4","2/6","2/6","20","2/7","3/8","20","3/7","20","20"]
["Restr. Area Combat","Combat","none","9","3/8","9","1/2","9","2/5","6","3/8","3","2/6","1/3","9","9","7","3/9","9","2/5","2/5","3","6","7","6","3/8","3","3/8","9","9","2/5","2/5","3","2/5","5","3/8","3/8","4","6","9","9","4","4","6","4","9","3","3/6","2/5","9","3","2/5","7","9","2/5","3/9","9","8","3/8","9","3","9","3/8","3/8","1/3","4","1/2","3/9","6","4","3","9","3","9","9"]
["Reverse Stroke","Combat","Ag/Re","20","2/7","20","3/7","20","3/8","5","2/4","3/7","2/7","3/5","2/7","20","20","2/6","20","3/7","3/7","3/9","15","20","20","3/8","3/8","2/7","20","20","2/4","3/7","5","3/7","20","2/7","2/7","2/7","20","20","20","3/7","5","3/9","20","20","4","2/6","3/7","3/7","3/7","3/7","2/7","20","3/7","20","20","20","2/7","20","5","20","1/4","2/7","4","4","2/6","2/6","20","2/7","3/8","20","3/7","20","20"]
["SeaBorn Combat","Combat","Ag/Ag/Me","3","1/4",3,"2/5","3","1/4","2/5","6","1/3","1/4","1/4","1/4","2/5","3","2/6","4","2/4","3/7","3/9","2/7","1/4","3","2/6","2/5","1/4","3","2/6","1/4","2/7","2/5","2/4","3","2/4","2/7","1/4","3","3","3","2/4","2/5","3/9","3","3","1/4","2/6","1/3","2/4","2/4","1/3","1/4","5","1/3","3","3","3","1/4","2/4","2/5","3","1/4","2/4","2/4","1/4","2/4","2/4","3","2/4","2/5","3","2/4","3","3"]
["Shield Bash","Combat","St/St/Ag","20","2/5","20","3/7","20","1/4","6","1/5","2/5","2/5","3/8","1/4","7","20","8","12","4","5","5","8","1/4","20","4","3/7","2/5","20","20","3/8","3/8","6","3/8","20","2/5","2/5","2/5","7","20","8","8","4","5","20","20","6","3/6","2/7","2/7","4","2/5","2/5","10","3/8","6","15","20","2/5","7","5","20","2/5","2/5","3/8","3/8","1/3","6","20","1/5","2/5","20","2/5","15","15"]
["Shield Skill","Combat","none","20","2/5","20","3/7","20","2/5","6","4","3/8","2/7","3/8","1/4","7","20","8","12","4","5","5","8","2/4","20","4","2/7","2/5","20","20","3/8","3/8","6","3/8","20","2/5","2/5","2/5","7","20","8","8","4","5","20","20","6","3/6","2/7","2/7","2/7","2/7","2/5","10","2/7","6","15","20","2/5","7","5","20","2/5","2/5","3/8","3/8","1/5","6","20","1/5","3/8","20","3/8","15","15"]
["Spell Deflection","Combat","In/Ag","6","2/6","6","3/6","7","3/6","5","5","3/6","2/6","3/6","3/7","5","6","2/6","9","4","4","4","4","2/6","7","3/8","3/7","2/6","6","7","2/5","3/6","5","3/6","6","2/6","2/6","2/6","6","6","6","3/6","5","4","7","6","3/6","2/6","3/6","3/7","4","3/6","2/6","9","3/6","7","6","6","1/3","5","5","7","2/6","2/6","3/6","5","3/6","3/6","6","2/6","3/7","7","4","6","6"]
["Stunned Maneuver","Combat","Sd","4","2/6","5","2/6","34","2/5","2/7","1/2","2/5","2/6","2/6","2/6","4","5","2/6","3","2/7","2/5","2/5","3","1/4","4","3/8","2/6","2/6","5","4","1/2","2/6","2/7","2/6","5","1/3","2/6","2/6","5","5","3","2/4","2/7","2/5","4","5","1/4","2/6","2/6","2/5","2/7","2/6","2/6","3","2/6","3","3","5","2/6","4","2/7","4","1/3","1/3","2/6","3","1/3","1/3","3","1/5","2/5","4","2/7","5","5"]
["Subduing","Combat","Ag/Qu","6","2/5","6","1/5","6","2/5","5","5","2/5","1/4","1/4","2/5","3/6","6","2/6","9","2/5","2/5","3/6","2/5","2/5","3/5","3/8","2/4","2/5","6","3/6","2/5","1/5","5","1/5","4","2/5","2/5","2/5","6","6","6","3","5","3/6","3/5","6","1/4","2/6","1/5","3/6","3/6","1/5","2/5","7","1/5","6","5","6","2/5","3/6","1/5","6","2/5","2/5","1/4","3","3","1/2","3","2/5","3/7","3/6","1/5","6","6"]
["Tackling","Combat","St/Ag","9","3/7","6","3/7","6","1/2","3","1/2","1/4","1/4","3/7","1/4","6","9","4","9","3/7","1/5","2/5","6","3/7","6","3/8","2/7","2/5","9","6","1/2","1/5","3","3/7","9","1/3","1/4","1/4","5","9","3","2/5","3","2/5","6","9","3/7","3/6","1/5","1/4","4","1/5","4","4","2/5","3","3","8","3/7","6","4","9","1/3","1/4","3/7","3/7","1/2","1/3","9","2/5","3/8","8","3/7","9","9"]
["Trick Shot","Combat","Ag/Qu","20","2/7","20","3/7","20","6","15","8","9","8","9","6","9","20","20","20","9","10","15","9","20","20","20","6","5","20","20","8","6","15","2/7","20","5","5","6","15","20","20","15","9","15","20","20","15","7","6","6","9","6","8","20","6","20","20","20","5","9","10","20","5","5","6","6","15","15","20","5","12","20","9","20","20"]
["Tumbling Attack","Combat","Ag/Qu","5","2/6","5","1/5","5","2/5","2/6","2/7","2/6","2/6","1/5","3/6","3/7","5","2/6","9","3/5","1/4","2/5","3/6","1/5","5","3/8","2/6","2/6","5","3/6","2/7","1/5","2/6","1/5","5","2/6","2/6","2/6","5","5","4","2/5","2/6","2/5","5","5","1/5","2/6","1/5","2/5","3/5","1/5","2/6","7","1/5","6","4","5","2/6","3/6","2/6","5","2/6","2/6","1/5","2/6","1/4","1/4","5","2/6","3/6","4","3/5","5","5"]
["Tumbling Evasion","Combat","Ag/Qu","3","1/5","3","1/3","3","1/4","2/5","5","1/5","1/5","1/3","3/6","2/6","3","2/6","4","2/4","1/2","1/4","2/5","1/5","3","3/8","2/5","1/5","3","2/5","2/5","1/3","2/5","1/3","3","1/5","1/5","1/5","3","3","2","1/4","2/5","1/4","3","3","1/3","2/6","1/3","2/6","2/4","1/3","1/5","3","1/3","3","2","3","1/5","2/5","2/5","3","1/5","1/5","1/3","2/5","1/2","1/2","3","1/5","2/5","3/7","2/4","3","3"]
["Two Weapon Combo","Combat","St","v","v","v","v","v","v","v","v","v","v","v","v","v","v","v","v","v","v","v","v","v","v","v","v","v","v","v","v","v","v","v","v","v","v","v","v","v","v","v","v","v","v","v","v","v","v","v","v","v","v","v","v","v","v","v","v","v","v","v","v","v","v","v","v","v","v","v","v","v","v","v","v"]
["Unarmed Expertise","Combat","Ag/St/Eq","9","3/7","6","3/7","6","2/5","3","1/2","3/7","3/7","3/7","3/7","6","9","4","9","3/7","1/5","2/5","6","3/7","6","3/8","3/8","3/7","9","6","1/2","3/7","3","3/7","9","2/4","3/7","3/7","5","9","3","1/5","3","2/5","6","9","3/7","3/6","3/7","6","4","3/7","4","4","3/7","3","3","8","2/5","6","4","9","3/7","3/7","3/7","3/7","1/3","1/3","9","3/6","3/8","8","4","9","9"]
["Unhorsing","Combat","St/St/Ag","18","2/6","18","3/6","20","3/6","3/6","3/6","3/6","2/6","3/6","2/6","20","18","2/6","20","3/6","6","12","20","4","20","3/8","3/6","2/6","18","20","3/6","2/3","3/6","3/6","18","4/9","1/3","2/6","18","18","8","3/6","3/6","12","20","18","18","2/6","5","3/6","3/6","3/6","2/6","20","3/6","20","15","18","2/6","20","3/6","20","2/6","2/6","3/6","5","3/6","3/6","20","2/6","3/6","20","3/6","18","18"]
["Weapon #1","Combat",null,"9","1/3","9","2/5","9","1/5","3/9","1/5","2/7","2/5","3/8","1/5","4/8","9","4","9","3/7","3/9","3/9","4/8","1/3","9","3/8","2/7","1/5","9","9","3/7","2/5","3/9","2/5","9","1/3","1/3","2/4","4/8","9","6","5","3/7","3/9","9","9","3/9","3/6","2/5","2/5","2/6","2/5","1/4","8","2/5","4/8","6","9","1/3","6","3/7","9","1/3","1/5","2/7","2/7","1/5","4","8","1/3","2/7","9","2/5","8","8"]
["Weapon #2","Combat",null,"20","2/5","20","3/7","20","2/5","6","1/5","3/8","2/7","3/8","2/5","7","20","8","12","4","5","5","8","6","20","4","3/8","2/5","20","20","3/8","3/8","6","3/8","20","2/5","2/5","3/7","7","20","8","8","4","5","20","20","6","3/6","3/8","3/8","3/8","3/8","2/5","10","3/8","6","15","20","2/5","7","5","20","2/5","2/5","3/8","3/8","3/7","6","20","1/5","3/8","20","3/8","15","15"]
["Weapon #3","Combat",null,"20","2/7","20","3/9","20","3/8","7","2/5","6","3/8","4","2/7","9","20","9","15","6","6","6","8","8","20","6","3/9","2/7","20","20","4","3/9","7","3/9","20","2/7","2/7","3/8","9","20","15","8","6","6","20","20","7","4","3/9","4","4","3/9","4","15","3/9","9","20","20","2/7","9","7","20","2/7","2/7","4","3/9","8","8","20","2/5","3/9","20","4","20","20"]
["Weapon #4","Combat",null,"20","2/7","20","4","20","4","7","2/5","6","4","6","2/8","9","20","9","20","6","8","6","8","8","20","15","5","2/7","20","20","8","3/9","7","3/9","20","2/7","2/7","3/9","9","20","20","8","6","6","20","20","7","5","3/9","4","4","3/9","4","20","3/9","15","20","20","2/7","9","7","20","2/7","2/7","4","4","8","8","20","2/7","5","20","4","20","20"]
["Weapon #5","Combat",null,"20","2/7","20","6","20","4","7","2/7","6","6","6","4","9","20","9","20","6","9","9","8","20","20","20","9","2/7","20","20","8","3/9","7","4","20","2/7","2/7","4","9","20","20","15","6","9","20","20","7","6","3/9","4","6","3/9","8","20","3/9","20","20","20","2/7","9","7","20","2/7","2/7","4","5","8","8","20","2/7","9","20","6","20","20"]
["Weapon #6","Combat",null,"20","5","20","9","20","6","15","3/8","9","8","9","6","9","20","20","20","9","10","15","9","20","20","20","12","5","20","20","8","6","15","6","20","5","5","6","15","20","20","15","9","15","20","20","15","7","6","6","9","6","8","20","6","20","20","20","5","9","10","20","5","5","6","6","15","15","20","2/7","12","20","9","20","20"]
["Weapon Brawling","Combat","St/Ag/Qu","9","3/7","9","2/5","9","1/5","3/9","1/5","2/5","2/5","3/8","1/5","6","9","4","9","3/7","3/9","3/9","5","1/5","9","3/8","2/5","1/5","9","9","3/7","2/5","3/9","2/5","9","1/5","1/5","2/4","5","9","6","5","3/9","3/9","9","9","3/9","3/6","2/5","2/5","3/7","2/5","1/4","8","2/5","4/8","6","9","2/5","6","3/7","9","1/5","1/5","2/7","2/7","1/3","4","8","1/4","2/7","9","2/5","8","8"]
["Weapon Bugei","Combat","St/St/Ag","9","3/7","6","3/7","6","3/7","3","1/2","3/7","3/7","3/7","3/7","6","9","4","9","3/7","1/5","2/5","6","3/7","6","3/8","3/8","3/7","9","6","1/2","3/7","3","3/7","9","2/4","3/7","3/7","5","9","3","2/5","3","2/5","6","9","3/7","3/6","3/7","6","4","3/7","4","4","3/7","3","3","8","3/7","6","4","9","3/7","3/7","3/7","3/7","1/3","1/3","9","3/6","3/8","8","4","9","9"]
["Weapon Casting","Combat","St/St/Ag","10","2/6","10","2/6","10","1/5","3/9","1/5","3/9","2/6","2/6","1/5","10","10","10","10","3/9","2/6","3/9","10","1/5","10","2/6","2/6","1/5","10","10","2/6","2/6","3/9","2/6","10","1/5","2/6","1/5","3/9","10","10","3/9","3/9","3/9","10","10","3/9","2/6","2/6","2/6","3/9","1/5","1/5","10","2/6","2/6","10","10","2/6","10","3/9","10","1/5","2/6","2/6","2/6","1/5","1/5","10","1/5","2/6","10","3/9","10","10"]
["Weapon Kata","Combat","St/Ag/Qu","9","3/7","6","3/7","6","2/5","3","1/2","3/7","3/7","3/7","3/7","6","9","4","9","3/7","1/5","2/5","6","3/7","6","3/8","3/8","3/7","9","6","1/2","3/7","3","3/7","9","2/4","3/7","3/7","5","9","3","2/5","3","2/5","6","9","3/7","3/6","3/7","6","4","3/7","4","4","3/7","3","3","8","2/5","6","4","9","3/7","3/7","3/7","3/7","1/3","1/3","9","3/6","3/8","8","4","9","9"]
["Weapon Shatter","Combat","St/St/Ag","10","2/6","10","2/6","10","1/5","3/9","1/5","3/9","2/6","2/6","1/5","10","10","10","10","3/9","2/6","3/9","10","1/5","10","2/6","2/6","1/5","10","10","2/6","2/6","3/9","2/6","10","1/5","2/6","1/5","3/9","10","10","3/9","3/9","3/9","10","10","3/9","2/6","2/6","2/6","3/9","1/5","1/5","10","2/6","2/6","10","10","2/6","10","3/9","10","1/5","2/6","2/6","2/6","1/5","1/5","10","1/5","2/6","10","3/9","10","10"]
["Weapon Snare","Combat","Qu/Ag","6","2/5","6","2/5","6","2/5","5","3/6","2/5","2/5","2/5","2/5","5","6","2/6","9","4","3/6","5","5","1/3","6","3/8","4","2/5","6","7","1/3","2/5","5","2/5","5","2/5","2/5","2/5","6","6","6","3","5","5","6","6","2/5","2/6","2/5","2/5","4","2/5","2/5","9","2/5","7","6","6","2/5","7","5","6","1/3","2/5","2/5","4","2/3","2/3","5","2/5","4","5","4","6","6"]
["Weapon Trickery","Combat","Qu/Ag","9","1/3","9","2/5","9","1/5","3/9","1/5","3/7","2/5","3/8","1/5","6","9","4","9","3/7","3/9","3/9","5","1/3","9","3/8","2/7","1/5","9","9","3/7","2/5","3/9","2/5","9","1/3","1/3","2/4","5","9","6","5","3/9","3/9","9","9","3/9","3/6","2/5","2/5","3/7","2/5","1/4","8","2/5","4/8","6","9","1/3","6","3/7","9","1/3","1/5","2/7","2/7","2/4","4","8","1/4","2/7","9","3/7","8","8"]
["Weapon Use","Combat","St/Ag","20","3/9","20","3/9","20","2/7","10","2/7","10","3/9","3/9","2/7","20","20","20","20","10","3/9","10","20","2/7","20","3/9","3/9","2/7","20","20","3/9","3/9","10","3/9","20","2/7","3/9","2/7","10","20","20","10","10","10","20","20","10","3/9","3/9","3/9","10","2/7","2/7","20","3/9","3/9","20","20","3/9","20","10","20","2/7","3/9","3/9","3/9","2/7","2/7","20","2/7","3/9","20","10","20","20"]
["Wrestling","Combat","St/Ag","9","3/7","6","3/7","6","3/7","3","1/2","3/7","3/7","3/7","3/7","6","9","4","9","3/7","1/5","2/5","6","3/7","6","3/8","3/8","3/7","9","6","1/2","3/7","3","3/7","9","2/4","3/7","3/7","5","9","3","2/5","3","2/5","6","9","3/7","3/6","3/7","6","4","3/7","4","4","3/7","3","3","8","3/7","6","4","9","3/7","3/7","3/7","3/7","1/3","1/3","9","3/6","3/8","8","4","9","9"]
["Yado","Combat","Qu/Ag","6","2/6","6","3/6","7","3/6","5","5","3/6","2/6","3/6","3/7","5","6","2/6","9","4","4","4","4","2/6","7","3/8","3/7","2/6","6","7","2/5","3/6","5","3/6","6","2/6","2/6","2/6","6","6","6","3/6","5","4","7","6","3/6","2/6","3/6","3/7","4","3/6","2/6","9","3/6","7","6","6","1/3","5","5","7","2/6","2/6","3/6","5","3/6","3/6","6","2/6","3/7","7","4","6","6"]
["AM Balance","Concentration","Ag/Sd","6","1/3","5","2/4","5","2/4","2/7","2/4","2/7","2/7","1/3","3/8","5","6","5","5","2/6","1/2","1/4","5","1/4","5","5","3/7","2/6","6","5","1/3","2/6","2/7","2/6","6","2/5","1/3","3","4","6","3","2/4","2/5","3/7","5","5","2/4","2/6","2/6","3/7","2/7","2/5","2/6","7","1/4","5","3","5","2/6","5","2/7","5","2/6","2/6","2/6","2/6","1/3","1/3","5","5","3/7","5","2/7","6","6"]
["AM Landing","Concentration","Ag/Sd","6","2/6","5","2/4","5","2/4","2/7","2/4","2/7","2/7","1/3","3/8","5","6","5","5","2/6","1/2","1/4","5","1/4","5","5","3/7","2/6","6","5","1/3","2/6","2/7","2/6","6","2/5","2/6","3","4","6","3","2/4","2/5","3/7","5","5","2/4","2/6","2/6","3/7","2/7","2/5","2/6","7","2/6","5","3","5","2/6","5","2/7","5","2/6","2/6","2/6","2/6","1/3","1/3","5","5","3/7","5","2/7","6","6"]
["AM Leaping","Concentration","Ag/Sd","6","2/6","5","2/4","5","2/4","2/7","2/4","2/7","2/7","1/3","3/8","5","6","5","5","2/6","1/3","1/4","5","1/4","5","5","3/7","2/6","6","5","1/3","2/6","2/7","2/6","6","2/5","2/6","3","4","6","3","2/4","2/5","3/7","5","5","2/4","2/6","2/6","3/7","2/7","2/5","2/6","8","2/4","5","3","5","2/6","5","2/7","5","2/6","2/6","2/6","2/6","1/3","1/3","5","5","3/7","5","2/7","6","6"]
["AM Quickdraw","Concentration","Ag/Eq","4","1/3","5","1/4","3","1/4","2/4","2/4","1/4","2/4","1/2","2/4","3","4","5","3","2/6","1/4","1/4","3","1/4","3","2/4","2/4","2/4","6","3","1/2","2/4","2/7","2/4","4","1/3","2/4","2/6","4","4","3","1/4","2/4","3/7","3","3","1/4","2/4","2/6","2/4","2/4","2/4","2/4","7","2/4","4","3","3","1/3","3","2/4","3","1/2","2/4","2/4","2/4","1/2","1/2","3","2/4","2/4","3","2/4","6","6"]
["AM Speed","Concentration","Ag/Sd","6","2/6","5","2/4","5","2/4","2/7","2/4","2/7","2/7","1/3","3/8","5","6","5","5","2/6","1/3","1/3","5","1/4","5","5","3/7","2/6","6","5","1/3","2/6","2/7","2/6","6","2/5","2/6","2/6","4","6","3","2/4","2/5","3/7","5","5","2/4","2/6","2/6","3/7","2/7","2/5","2/6","7","2/4","5","3","5","2/6","5","2/7","5","2/6","2/6","2/6","2/6","1/3","1/3","5","2/6","3/7","5","2/7","6","6"]
["AM Strength","Concentration","Ag/Sd","6","2/6","5","3/8","5","2/4","2/7","2/4","2/7","2/7","1/3","2/5","5","6","5","5","2/6","1/5","1/5","5","1/4","5","5","3/7","2/6","6","5","1/3","2/6","2/7","2/6","6","1/3","2/6","2/6","4","6","3","2/4","2/5","3/7","5","5","2/4","2/6","2/6","3/7","2/7","2/5","2/6","8","2/6","5","3","5","2/6","5","2/7","5","2/6","2/6","2/6","2/6","1/3","1/3","5","1/3","3/7","5","2/7","6","6"]
["Adrenal Defense","Concentration","None","20","20","15","10","15","6","15","12","15","20","7","20","20","20","20","20","15","3/8","3","20","6","15","20","12","12","20","20","2/6","20","15","20","20","10","20","20","20","20","15","6","10","20","15","20","7","15","20","20","20","15","20","15","20","18","15","20","12","20","20","20","20","20","10","20","3/7","3/7","15","20","20","20","20","20","20"]
["Armored AD","Concentration","None","20","20","15","10","15","6","15","12","15","20","7","20","20","20","20","20","15","3/8","3","20","6","15","20","12","12","20","20","2/6","20","15","20","20","10","20","20","20","20","15","6","15","20","15","20","7","15","20","20","20","20","20","15","20","18","15","20","20","20","20","20","20","20","20","20","3/7","3/7","15","20","20","20","20","20","20"]
["ASA","Concentration","Pr","6","2/6","5","3/8","5","2/4","2/7","2/4","2/7","3/6","1/3","3/8","5","6","5","5","2/6","1/3","1/3","5","1/4","5","5","3/7","2/6","6","5","1/3","2/6","2/7","2/6","6","1/3","2/6","3","4","6","3","2/4","2/7","3/7","5","5","2/4","2/6","2/6","3/9","2/7","2/6","2/6","7","2/6","5","3","5","2/6","5","2/7","5","2/6","2/6","2/6","2/6","1/3","1/3","5","5","3/7","5","2/7","6","6"]
["Blind Fighting","Concentration","Re/Em","10","2/6","10","2/6","10","1/5","3/9","1/5","3/9","2/6","2/6","1/5","10","10","10","10","3/9","2/6","3/9","10","1/5","10","2/6","2/6","1/5","10","10","2/6","2/6","3/9","2/6","10","1/5","2/6","1/5","3/9","10","10","3/9","3/9","3/9","10","10","3/9","2/6","2/6","2/6","3/9","1/5","1/5","10","2/6","2/6","10","10","2/6","10","3/9","10","1/5","2/6","2/6","2/6","1/5","1/5","10","1/5","2/6","10","3/9","10","10"]
["Blind Fight. Intuition","Concentration","In","25","15","25","15","25","8","25","8","25","15","15","8","25","25","25","25","25","15","25","25","8","25","15","15","8","25","25","15","15","25","15","25","8","15","8","25","25","25","25","25","25","25","25","25","15","15","15","25","8","8","25","15","15","25","25","15","25","25","25","8","15","15","15","8","8","25","8","15","25","25","25","25"]
["Blind Fight. Smell","Concentration","Re/In","20","3/9","20","3/9","20","2/7","10","2/7","10","3/9","3/9","2/7","20","20","20","20","10","3/9","10","20","2/7","20","3/9","3/9","2/7","20","20","3/9","3/9","10","3/9","20","2/7","3/9","2/7","10","20","20","10","10","10","20","20","10","3/9","3/9","3/9","10","2/7","2/7","20","3/9","3/9","20","20","3/9","20","10","20","2/7","3/9","3/9","3/9","2/7","2/7","20","2/7","3/9","20","10","20","20"]
["Blind Fight. Touch","Concentration","Re/Em","25",6,"25",6,"25","4/10","20","4/10","20",6,6,"4/10","25","25","25","25","20",6,"20","25","4/10","25",6,6,"4/10","25","25",6,6,"20",6,"25","4/9",6,"4/10","20","25","25","20","20","20","25","25","20",6,6,6,"20","4/10","4/10","25",6,6,"25","25",6,"25","20","25","4/10",6,6,6,"4/10","4/10","25","4/10",6,"25","20","25","25"]
["Body Damage Stabilization","Concentration","Sd/Em","3/5","3/8","3","3/7","2/5","3/6","2/5","2/6","2/5","1/4","2/5","1/4","1/4","2/6","3/6","3/7","1/4","3/6","1/5","2/4","1/4","3/6","3/6","3/6","3/8","3/5","1/2","1/4","3/7","2/5","3/7","3/5","3/8","3/8","3/8","2/5","3/5","1/4","1/3","3/7","2/6","1/3","2/5","1/3","3/6","3/7","1/5","1/4","3/7","3/8","3/5","3/7","3/6","1/3","2/5","3/8","1/2","2/5","2/5","3/8","3/8","3/6","3/8","1/4","1/4","1/4","2/7","3/6","2/4","1/4","3/5","3/5"]
["Body Rigidity","Concentration","Sd","20","20","15","15","15","6","15","15","15","20","7","20","20","20","20","20","20","3/8","3","20","6","15","20","20","20","20","20","2/6","20","15","20","20","10","20","20","20","20","15","6","15","20","15","20","7","15","20","20","20","20","20","15","20","18","15","20","20","20","20","20","20","20","20","20","3/7","3/7","15","20","20","20","20","20","20"]
["Control Lycantrophy","Concentration","Sd","3/6","2/6","1/3","2/6","2/5","2/4","2/6","2/6","2/6","2/6","1/3","2/6","1/4","1/5","2/6","2/6","1/4","2/6","1/3","2/4","2/6","1/3","2/6","2/6","2/6","1/4","1/2","1/3","4/12","2/6","2/6","2/4","2/6","2/6","2/6","2/4","1/4","1/4","2/6","2/6","1/3","1/3","2/4","2/6","2/6","4/12","1/4","2/6","2/6","2/6","3/7","2/6","3/7","1/2","2/4","2/6","1/2","2/6","2/5","2/6","2/6","2/6","2/6","1/3","1/3","1/2","6","2/6","2/4","2/6","2/4","2/4"]
["Directed Strength","Concentration","Sd","6","2/6","6","3/6","7","3/6","5","5","3/6","2/6","3/6","3/7","5","6","2/6","9","4","4","4","4","2/6","7","3/8","3/7","2/6","6","7","2/5","3/6","5","3/6","6","2/6","2/6","2/6","6","6","6","3/6","5","4","7","6","3/6","2/6","3/6","3/7","4","3/6","2/6","9","3/6","7","6","6","1/3","5","5","7","2/6","2/6","3/6","5","3/6","3/6","6","2/6","3/7","7","4","6","6"]
["Dowsing","Concentration","Em","2/5","3/7","1/3","3/6","2/5","2/5","2/5","2/6","3/7","2/4","3/6","3/7","2/4","2/5","2/6","1/4","2/4","3/6","2/4","1/2","3/7","3/7","2/6","3/7","3/7","1/3","2/5","2/5","6","2/5","3/6","2/5","3/7","3/7","3/7","2/5","1/3","2/4","2/4","3/6","2/7","1/4","2/5","3/5","2/6","3/6","3/6","2/4","3/6","3/7","3/6","3/6","3/6","1/4","2/5","3/7","1/5","2/5","1/4","3/7","3/7","3/5","3/5","2/5","2/5","3/6","6","3/7","2/6","2/4","1/3","1/3"]
["Focus","Concentration","Sd","18","2/6","18","3/6","20","3/6","3/6","3/6","3/6","2/6","3/6","2/6","20","18","2/6","20","3/6","6","12","20","4","20","3/8","3/6","2/6","18","20","3/6","2/3","3/6","3/6","18","4/12","1/3","2/6","18","18","8","3/6","3/6","12","20","18","18","2/6","5","3/6","3/6","3/6","2/6","20","3/6","20","15","18","2/6","20","3/6","20","2/6","2/6","3/6","5","3/6","3/6","20","2/6","3/6","20","3/6","18","18"]
["Frenzy","Concentration","Em/Sd","6","4/9","5","2/6","5","1/5","2/6","1/2","2/6","4","2/6","2/6","3","5","2/6","9","3","2/5","1/3","3","4","3","2/6","5","2/6","5","3","2/5","2/6","2/6","5","5","2/6","2/6","2/6","4","5","2/4","2/6","2/6","1/3","3","4","2/6","2/6","3/6","4","4","2/6","2/6","8","2/6","6","6","4","2/6","3","2/6","3/6","2/6","4/9","3/6","2/5","2/6","2/6","1/5","3/6","5","5","4","5","5"]
["Meditation Cleansing","Concentration","Sd/Em","2/4","3/8","1/2","2/4","2/4","3/5","2/6","2/6","3/6","1/4","3/6","3/8","1/2","2/4","2/6","1/4","1/2","3/6","1/3","2/4","3/8","2/4","2/6","1/4","3/8","2/4","1/2","2/5","3/7","2/6","3/7","2/4","6","3/8","3/8","2/4","2/4","1/3","1/2","3/7","1/3","2/4","2/4","3/6","2/6","3/7","1/2","1/4","3/7","3/8","1/4","3/7","2/4","1/2","2/4","3/8","1/3","2/6","2/4","3/8","2/4","3/6","4","2/5","2/5","2/4","6","1/4","1/4","1/4","2/4","2/4"]
["Meditation Death","Concentration","Sd/Pr","1/5","4","1/3","2/4","3/6","4","2/4","2/6","2/4","2/4","4","4","3/6","1/5","3/7","2/6","3/6","4","2/6","3/6","4","2/4","3/7","3/7","4","1/5","3/6","1/5","4","2/4","4","1/5","6","4","4","1/2","1/5","1/4","1/4","4","2/6","2/4","1/2","2/6","3/7","4","2/4","2/4","4","4","2/5","4","4","1/4","1/2","4","2/4","2/4","3/8","4","6","4","5","2/6","2/6","3/6","6","3/7","3/6","2/4","1/5","1/5"]
["Meditation Healing","Concentration","Sd/Em","2/4","3/7","1/5","2/4","2/4","3/7","2/4","2/6","2/5","2/4","3/6","3/7","1/2","2/4","2/6","1/4","1/2","2/6","1/4","1/3","3/7","1/3","2/6","3/7","3/7","2/4","1/2","2/5","3/6","2/4","3/6","2/4","6","3/7","3/7","3/7","2/4","1/3","1/4","3/6","1/4","1/3","3/7","3/6","2/6","3/6","2/4","2/4","3/6","3/7","1/4","3/6","2/5","1/3","3/7","3/7","1/2","2/4","2/4","3/7","3/7","3/6","2/6","2/4","2/4","1/4","6","3/7","2/4","2/4","2/4","2/4"]
["Meditation Ki","Concentration","Sd/Pr","3/5","2/8","3/5","2/4","2/4","3/7","2/5","2/6","2/6","2/5","3/6","2/8","2/4","2/6","2/6","2/5","2/4","2/7","3/7","2/6","2/8","2/6","2/6","3/7","2/8","3/5","2/4","1/4","3/7","2/5","3/7","3/5","6","2/8","2/8","2/5","3/5","1/4","1/3","3/7","3/7","2/6","2/5","3/6","2/6","3/7","1/5","2/5","3/7","2/8","2/5","3/7","2/5","1/3","2/5","2/8","2/4","2/5","3/8","2/8","2/8","3/6","4","1/5","1/5","2/5","6","3/7","2/4","2/5","3/5","3/5"]
["Meditation Sleep","Concentration","Sd/In","1/4","3/7","1/5","2/4","2/5","3/7","2/4","2/6","2/7","2/4","3/6","3/7","1/4","1/4","2/6","1/4","1/4","3/7","3/6","1/4","3/7","1/3","2/6","2/6","3/7","1/4","1/2","2/5","3/6","2/4","3/6","1/4","6","3/7","3/7","1/4","1/4","1/2","1/5","3/6","3/6","1/3","1/4","3/6","2/6","3/6","2/4","2/4","3/6","3/7","1/3","3/6","1/4","1/2","1/4","3/7","1/2","2/4","2/4","3/7","3/7","3/6","2/6","2/4","2/4","1/2","6","2/6","2/5","2/4","1/3","1/3"]
["Meditation Trance","Concentration","Sd/Pr","1/4","3/7","1/5","2/4","2/4","3/7","2/4","2/6","3/7","2/4","3/6","3/7","2/4","1/4","2/6","1/4","2/4","3/9","3/6","2/4","3/7","1/3","2/6","3/6","3/7","1/3","1/3","2/5","3/6","2/4","3/6","1/3","6","3/7","3/7","2/4","1/3","1/2","1/5","3/6","3/6","1/3","2/4","3/6","2/6","3/6","2/4","2/4","3/6","3/7","1/3","3/6","2/4","1/3","2/4","3/7","1/2","2/4","2/4","3/7","2/4","3/6","2/6","2/4","2/4","1/3","6","3/6","2/4","2/4","1/3","1/3"]
["Mind Block","Concentration","Sd/Pr","7","7","7","7","7","7","7","7","7","7","7","7","7","7","7","7","7","7","7","7","7","7","7","7","7","7","7","7","7","7","7","7","7","7","7","7","7","7","7","7","7","7","7","7","7","7","7","7","7","7","7","7","7","7","7","7","7","7","7","7","7","7","7","7","7","7","7","7","7","7","7","7"]
["Mnemonics","Concentration","Re/Sd","1/4","3/7","1/4","2/7","2/4","3/8","1/3","2/6","3/7","2/5","2/5","3/7","2/4","1/4","2/6","1/4","2/4","2/5","2/6","2/4","3/7","1/4","2/6","2/5","3/7","1/4","2/4","1/4","2/7","1/3","2/7","1/4","6","3/7","3/7","1/4","1/4","1/3","2/4","2/7","2/6","1/4","1/4","2/6","2/6","2/7","2/6","2/5","2/7","3/7","1/2","2/7","1/4","1/2","1/4","3/7","1/4","1/5","2/4","3/7","3/7","2/6","1/4","2/4","2/4","1/4","6","2/5","2/5","2/5","1/4","1/4"]
["Prepared Shot","Concentration","Sd/In","6","1/2","5","2/4","5","2/4","2/7","2/4","2/7","3/6","1/3","3/8","5","6","5","5","2/6","1/2","1/4","5","1/4","5","5","3/7","2/6","6","5","1/3","2/6","2/7","2/6","6","1/3","1/3","3","4","6","3","2/4","2/7","3/7","5","5","2/7","2/6","2/6","3/9","2/7","2/6","2/6","7","1/4","5","3","5","1/2","5","2/7","5","2/6","2/6","2/6","2/6","1/3","1/3","5","5","3/7","5","2/7","6","6"]
["Presence Projection","Concentration","Pr","9","3/8","9","1/2","9","2/5","6","3/8","3","2/6","1/3","9","9","7","3/9","9","2/5","2/5","3","6","7","6","3/8","3","3/8","9","9","2/5","2/5","3","2/5","5","3/8","3/8","4","6","9","9","4","4","6","4","9","3","3/6","2/5","9","3","2/5","7","9","2/5","3/9","9","8","3/8","9","3","9","3/8","3/8","1/3","4","3/9","3/9","6","4","3","9","3","9","9"]
["Spacial loc. Awareness","Concentration","In","3/6","6","1/4","5","2/5","4","2/5","2/6","6","1/4","3/8","6","2/5","2/5","3/8","1/3","2/5","6","3/7","2/5","6","1/3","3/8","2/5","6","2/5","2/5","1/4","10","2/5","5","2/5","6","6","6","2/5","2/5","1/4","1/3","5","3/7","1/3","2/5","3/8","3/8","5","1/4","1/4","5","6","1/5","5","2/6","1/2","2/5","6","2/5","2/5","2/5","6","6","3/8","6","1/4","1/4","1/4","6","2/5","2/5","1/4","2/5","2/5"]
["WOW Fatigue","Concentration","Sd","20","2/5","20","2/5","20","2/5","6","1/5","4","2/7","3/8","2/5","7","20","8","12","4","5","5","8","6","20","4","2/7","2/5","20","20","2/5","3/8","6","3/8","20","2/5","2/5","3/7","7","20","8","4","4","5","20","20","2/6","3/6","2/6","2/6","3/8","3/8","2/5","10","3/8","6","15","20","2/5","7","5","20","2/5","2/5","3/8","3/8","4/8","2/6","20","1/5","3/8","20","4","15","15"]
["WOW Pain","Concentration","Sd","20","2/5","20","2/5","20","2/5","6","1/5","4","2/7","3/8","2/5","7","20","8","12","4","5","5","8","6","20","4","2/7","2/5","20","20","2/5","3/8","6","3/8","20","2/5","2/5","3/7","7","20","8","4","4","5","20","20","2/6","3/6","2/6","2/6","3/8","3/8","2/5","10","3/8","6","15","20","2/5","7","5","20","2/5","2/5","3/8","3/8","2/6","2/6","20","1/5","3/8","20","4","15","15"]
["WOW Unconsciousness","Concentration","Sd","20","2/5","20","2/5","20","2/5","6","1/5","4","2/7","3/8","2/5","7","20","8","12","4","5","5","8","6","20","4","2/7","2/5","20","20","2/5","3/8","6","3/8","20","2/5","2/5","3/7","7","20","8","4","4","5","20","20","2/6","3/6","2/6","2/6","3/8","3/8","2/5","10","3/8","6","15","20","2/5","7","5","20","2/5","2/5","3/8","3/8","2/6","2/6","20","1/5","3/8","20","4","15","15"]
["WOW Will","Concentration","Sd","20","2/5","20","2/5","20","2/5","6","1/5","4","2/7","3/8","2/5","7","20","8","12","4","5","5","8","6","20","4","2/7","2/5","20","20","2/5","3/8","6","3/8","20","2/5","2/5","3/7","7","20","8","4","4","5","20","20","2/6","3/6","2/6","2/6","3/8","3/8","2/5","10","3/8","6","15","20","2/5","7","5","20","2/5","2/5","3/8","3/8","4/8","2/6","20","1/5","3/8","20","1/3","15","15"]
["Ambush","Deadly","None","9","3/8","9","1/2","9","2/5","6","3/8","3","2/6","1/3","9","9","7","3/9","9","2/5","2/5","3","6","7","6","3/8","2/7","3/8","9","9","2/5","2/5","3","2/5","5","3/8","3/8","4","6","9","9","4","4","6","4","9","3","3/6","2/5","9","3","2/5","7","9","2/5","3/9","9","8","3/8","9","3","9","3/8","3/8","1/3","4","3/9","3/9","6","4","3","9","3","9","9"]
["Silent Kill","Deadly","Ag","6","2/6","6","1/4","6","2/5","5","1/4","2/6","2/6","1/3","5","3/6","5","2/6","9","4","3/8","5","3/6","7","3/5","3/8","2/4","2/6","6","3/6","1/4","1/4","5","1/4","4","2/6","2/6","2/6","5","6","6","3","1/4","5","3/5","5","1/3","2/6","1/4","3/7","4","1/4","2/6","6","1/4","5","5","5","2/6","3/6","5","6","2/6","2/6","1/3","6","1/5","1/5","2/6","6","4","3/6","4","6","6"]
["Sniping","Deadly","None","9","3/8","9","1/2","9","2/5","6","3/8","3","2/6","1/3","9","9","7","3/9","9","2/5","2/5","3","6","7","6","3/8","2/5","3/8","9","9","2/5","2/5","3","2/5","5","3/8","3/8","4","6","9","9","4","4","6","4","9","3","3/6","2/5","9","3","2/5","7","9","2/5","3/9","9","8","3/8","9","3","9","3/8","3/8","1/3","4","3/9","3/9","6","4","3","9","3","9","9"]
["Use/Remove Poison","Deadly","Ag/In","1/4","2/5","2/6","1/3","2/6","2/5","2/6","4","2/5","2/5","1/4","2/5","2/5","1/4","2/6","3/7","2/5","1/4","3","1/5","7","2/4","3/8","2/4","2/5","2/6","2/5","4","2/4","2/6","2/4","2/6","4/9","2/5","2/5","1/4","2/6","2/6","2/6","2/4","3","2/6","1/4","1/4","2/6","2/4","3/6","2/5","2/4","2/5","2/6","2/4","1/4","2/6","1/4","2/5","2/5","2/6","2/4","2/5","2/5","1/4","2/7","2/5","2/5","2/5","6","2/7","1/4","2/5","2/6","2/6"]
["Appraisal","Evaluation","Re","1/2","2/5","3/7","2/4","2","3/6","1/3","3/6","2/5","1/4","1/2","1/5","2","3/7","2/6","2/5","2","1/4","3","2","2/5","3/5","2/6","3/7","2/5","3/7","2","2/5","2/4","2/5","2/4","3/7","2/5","2/5","2/5","2","3/7","2","2/5","2/4","2/5","3/5","2","1/4","2/6","4/8","1/4","1/4","2/4","2/5","2/5","2/4","1/4","2/5","2","2/5","2/4","2/5","2","2/5","2/5","1/4","1/2","2","2","2","6","3/7","2","1/4","3/7","3/7"]
["Armor Evaluation","Evaluation","In/Re","1/3","1/2","4","1/3","4","1/3","2/5","3/6","1/2","1/4","1/3","1/5","2","3","2/6","3/7","2","2/7","6","2","1/2","3","2/6","2/4","1/2","4","5","2/5","1/3","2/5","1/3","4","1/2","1/2","1/2","3","4","3","3/6","1/3","6","3","3","1/3","2/6","1/3","1/3","1/4","1/3","1/2","4","1/3","3","2/6","3","1/2","3","2/5","3/6","1/2","1/2","1/3","1/3","3","3","3","6","2/4","3","1/4","4","4"]
["Looting","Evaluation","Eq/Pr","18","2/6","18","2/7","18","2/5","5","1/4","2/6","2/6","2/7","3/7","7","18","2/6","20","5","3/5","5","5","2/6","18","3/8","2/6","2/6","18","18","8","1/5","5","1/5","18","1/3","2/6","2/6","18","18","8","8","5","5","18","18","2/7","2/6","1/5","3/6","5","1/5","2/6","20","1/5","18","15","18","1/3","18","5","18","2/6","4/12","2/7","2/5","8","8","15","2/6","6","18","5","18","18"]
["Metal Evaluation","Evaluation","In/Re","1/2","3/6","2/5","2/5","2","3/6","2/4","3/6","3/6","2/5","1/2","1/5","2","2/5","2/6","1/4","2","1/4","4","2","3/6","3/6","2/6","2/6","3/6","2/5","2","2/5","2/5","2/4","2/5","2/5","3/6","3/6","3/6","2","2/5","2","3","2/5","3/6","3/6","2","1/3","2/6","2/5","2/5","2/5","2/5","3/6","2/5","2/5","1/4","2/5","2","3/6","2","2/4","2","3/6","3/6","1/3","1/2","3","3","2","6","2/6","2","2/5","2/5","2/5"]
["Stone Evaluation","Evaluation","In/Re","1/2","3/6","2/4","2/5","1/5","3/6","2/4","3/6","3/6","2/5","1/2","1/5","2/5","2/4","2/6","1/4","2/5","1/4","4","2/3","3/6","3/6","2/6","2/6","3/6","2/4","2","2/5","2/5","2/4","2/5","2/4","3/6","3/6","3/6","3","2/4","2/5","3","2/5","3/6","3/6","3","1/3","2/6","2/5","2/5","2/5","2/5","3/6","2/5","2/5","1/4","2/5","3","3/6","2/4","2/4","2/5","3/6","3/6","1/3","1/2","3","3","2","6","2/6","2/4","2/5","2/4","2/4"]
["Weapon Evaluation","Evaluation","In/Re","1/3","1/2","4","1/3","4","1/3","2/5","3/6","1/2","1/4","1/3","1/5","2","3","2/6","3/7","2","2/5","3","2","1/2","3","2/6","2/4","1/2","4","5","2/5","1/3","2/5","1/3","4","1/2","1/2","1/2","3","4","3","3/6","1/3","3","3","3","1/4","2/6","1/3","1/3","1/4","1/3","1/2","3/7","1/3","2/6","2/6","3","1/2","3","2/5","3/6","1/2","1/2","1/4","1/3","1/3","1/3","3","3","2/4","3","1/4","4","4"]
["Advertising","General","In/Re","3/5","3/6","3/6","2/4","3/6","4","1/5","6","3/6","3/6","2/4","3/6","2/5","3/6","2/6","3/6","3/6","1/4","1/4","2/6","3/6","3/6","2/6","3/6","3/6","3/5","2/6","6","2/4","2/5","2/4","2/4","3/6","3/6","2/5","3/6","3/5","3/5","3/6","2/4","1/4","3/6","3/6","3/5","2/6","2/4","3/6","3/6","2/4","3/6","1/4","2/4","1/4","3/5","3/6","3/6","1/4","1/5","3/6","3/6","3/6","2/4","2/6","3/5","3/5","2/4","6","3/6","1/4","3/6","3/5","3/5"]
["Cookery","General","In/Re","1/2","2/5","2/6","2/5","2/6","2/5","2/6","6","2/5","2/4","1/5","2/5","2/4","2/6","2/6","2/5","2/4","1/5","2/6","1/4","2/5","1/5","1/4","2/5","2/5","2/6","1/5","6","2/5","2/6","1/2","2/6","2/5","2/5","2/5","2/5","2/6","2/6","2/6","2/5","2/6","2/6","2/5","1/5","2/6","2/5","2/6","2/4","2/5","2/5","2/5","2/5","1/4","2/6","2/5","2/5","2/4","2/6","2/4","2/5","2/5","1/5","1/3","2/5","2/5","2/4","6","2/6","1/2","2/4","2/6","2/6"]
["Crafting","General","Ag/Sd","1/2","2/5","2/5","2/4","2/6","2/6","3/5","2/5","2/4","2/4","1/4","2/5","2/6","2/4","2/6","2/6","2/4","2/5","3","2/6","2/5","2/6","1/5","2/5","2/5","2/5","2/6","2/5","2/4","3/5","2/4","2/4","2/5","2/5","2/5","2/5","2/5","2/4","1/4","2/4","3","2/6","2/5","2/6","2/6","2/4","2/4","2/4","2/4","2/5","2/6","2/4","1/5","2/5","2/5","2/5","2/6","3/5","2/6","2/5","2/5","1/5","1/4","2/5","2/5","2/6","6","2/5","2/6","2/4","2/4","2/4"]
["Fletching","General","Ag/Sd","1/3","1/2","2/7","2/4","3/6","2/4","2/5","6","1/4","2/5","2/4","2/4","2/5","2/6","2/6","3","2/5","3/8","3","2/4","2/4","3/6","2/6","2/5","2/4","2/6","2/6","6","2/4","2/5","2/4","2/7","2/4","2/4","2/4","2/6","2/6","2/6","2/5","2/4","3","3/6","2/6","2/6","2/6","2/4","2/5","2/5","2/4","2/4","3","2/4","3","2/6","2/6","2/4","2/5","2/5","3/5","2/4","2/4","2/4","2/5","2/5","2/5","3/5","6","2/5","3/7","2/5","2/6","2/6"]
["Gimmickry","General","Re","2/4","3/7","2/5","2/6","3/7","3/8","2/5","4","2/6","2/7","2/4","3/7","3/7","3","2/6","3/7","2/7","3/7","3","3/7","3/7","3/7","2/6","3/7","3/7","3","3/7","4","2/6","2/5","2/6","3","3/7","3/7","3/7","3","3","3","2/6","2/6","3","3/7","3","2/5","2/6","2/6","2/6","2/7","2/6","3/7","2/6","2/6","2/5","3","3","3/7","3/7","2/5","2/6","3/7","3/7","2/5","2/5","3/7","3/7","3/7","6","3/7","2/5","2/7","3","3"]
["Horticulture","General","In/Em","1/4","8","2/6","6","2/6","3/8","2/6","6","8","1/2","8","8","2/5","2/5","2/6","5","1/2","8","2/6","1/4","8","2/6","1/2","3/8","8","2/6","1/3","6","6","2/6","6","2/6","8","8","8","2/6","2/6","2/6","1/4","6","2/6","2/6","2/6","4","2/6","6","3","1/2","6","8","1/3","6","1/4","2/6","2/6","8","2/5","2/6","2/6","8","8","4","3","3","3","2/6","8","3/8","1/4","1/2","2/6","2/6"]
["Hygien","General","Co/Sd","3","1/3","4","1/4","3","1/2","2/4","1/2","1/4","1/3","2/4","1/2","3","4","2","4","1/3","1/3","1/3","2","1/3","4","1/2","1/2","1/2","4","1/2","1/3","1/3","2/5","1/3","4","1/1","1/2","1/2","2/4","4","3","2/4","2/4","2/3","4","4","2/4","1/3","1/3","1/3","1/3","1/3","1/4","3","1/3","4","3","3","1/2","1/2","1/4","4","1/2","1/2","2/4","1/3","1/2","1/4","4","1/2","1/4","3","1/3","4","4"]
["Leatherworking","General","Ag/Re","3","2/4","3","2/4","3","2/4","2/6","6","2/4","2/5","2/4","2/4","2/6","3","2/6","3/7","2/5","2/5","3/5","2/5","2/4","3","2/6","2/6","2/4","3","2/5","6","2/4","2/6","1/2","3","2/4","2/4","2/4","3","3","3","2/6","2/4","3/5","3","3","2/4","2/6","2/4","2/5","2/5","2/4","2/4","4","2/4","3","3","3","2/4","2/4","2/6","3","2/4","2/4","2/4","2/5","2/4","2/4","3","6","2/6","2/6","2/5","3","3"]
["Painting","General","In/Ag","2/5","2/6","2/4","2/6","2/7","2/6","1/4","4","2/6","1/4","2/6","2/6","2/5","2/5","2/6","2/4","1/4","2/6","4","2/4","2/6","2/4","2/6","2/5","2/6","2/4","2/4","1/3","2/6","2/5","2/6","2/4","2/6","2/6","2/6","2/4","2/4","2/5","1/3","2/6","4","2/4","2/4","2/6","2/6","2/6","1/4","1/4","2/6","2/6","2/5","2/6","1/4","2/4","2/4","2/6","2/4","1/4","2/4","2/6","2/6","2/6","2/6","1/3","1/3","2/4","6","2/5","2/4","1/4","2/4","2/4"]
["Play Instrument #1","General","Ag/Re","2/6","2/6","2/6","2/6","2/4","2/6","1/2","2/4","2/6","2/6","2/6","2/6","2/5","2/6","2/6","2/6","2/6","1/4","2/6","2/6","2/6","2/4","2/6","2/6","2/6","2/6","2/6","2/4","2/6","2/5","2/6","2/6","2/6","2/6","2/6","2/6","2/6","2/6","2/6","2/6","2/6","2/5","2/6","2/6","2/6","2/6","2/6","2/6","2/6","2/6","3/6","2/6","2/4","2/5","2/6","2/6","2/4","1/2","2/6","2/6","2/6","2/6","1/4","6","2/6","2/6","6","2/6","2/5","2/6","2/6","2/6"]
["Play Instrument #2","General","Ag/Re","3/7","3/7","3/7","3/7","3/5","3/7","1/3","3/5","3/7","3/7","3/7","3/7","3/6","3/7","3/7","3/7","3/7","1/5","3/7","3/7","3/7","3/5","3/7","3/7","3/7","3/7","3/7","3/5","3/7","2/5","3/7","3/7","3/7","3/7","3/7","3/7","3/7","3/7","3/7","3/7","3/7","3/6","3/7","3/7","3/7","3/7","3/7","3/7","3/7","3/7","3/9","3/7","3/6","3/6","3/7","3/7","3/5","1/3","3/7","3/7","3/7","3/7","2/5","6","3/7","3/7","6","3/7","3/6","3/7","3/7","3/7"]
["Play Instrument #3","General","Ag/Re","3","3","3","3","3","3","1/4","3","3","3","3","3","3","3","3","3","3","2/6","3","3","3","3","3","3","3","3","3","3","3","2/5","3","3","3","3","3","3","3","3","3","3","3","3","3","3","3","3","3","3","3","3","4","3","3","3","3","3","3","1/4","3","3","3","3","3/6","6","3","3","6","3","3","3","3","3"]
["Rope Mastery","General","Ag/Re","3","2/6","3","1/5","3","1/6","2/5","2/5","2/6","1/3","1/3","2/6","2/5","3","2/6","3","2/5","2/4","2/6","2/5","2/6","3","2/6","3/5","2/6","3","2/6","2/5","1/5","2/5","1/5","3","2/6","2/6","2/6","2/6","3","3","2/4","1/5","2/6","3","2/6","1/3","2/6","1/5","2/6","2/5","1/5","2/6","3","1/5","3","3","2/6","2/6","2/6","2/5","3","2/6","2/6","1/3","1/4","2/5","2/5","3","6","3/5","2/7","2/5","3","3"]
["Sculpting","General","In/Ag","1/4","2/7","2/5","2/7","3/7","2/6","2/6","2/4","2/6","2/5","2/7","2/7","2/7","2/7","2/6","2/4","2/5","3/6","4","2/7","2/7","2/7","2/6","2/7","2/7","2/4","2/7","2/4","2/7","2/6","2/7","2/4","2/7","4/14","2/7","2/5","2/4","2/7","2/5","2/7","4","2/7","2/5","2/7","2/6","2/7","2/7","2/5","2/7","2/7","3/8","2/7","2/7","2/6","2/5","2/7","2/7","2/6","2/7","2/7","2/7","2/7","2/7","2/5","2/5","2/6","6","2/7","2/7","2/5","1/5","1/5"]
["Skinning","General","In/Ag","3","2/6","3","1/5","2/5","1/4","2/5","3/6","1/4","1/3","3/6","2/6","2/5","3","2/6","6","1/3","3/7","4","1/4","2/6","3/4","1/5","1/5","2/6","3","2/6","3/6","1/5","2/5","1/3","3","2/6","2/6","2/6","1/4","3","2/5","2/6","1/5","4","3/4","1/4","3","2/6","1/5","2/6","1/3","1/5","2/6","5","2/6","4","2/4","1/4","2/6","1/5","2/5","1/2","2/6","2/6","1/3","1/3","2/5","2/5","4","6","3/7","2/5","1/3","3","3"]
["Smithing","General","St/Ag","1/2","3/5","3","2/7","3","3/5","3/5","6","3/5","2/7","2/6","2/5","3","3","2/6","2/4","2/7","3/7","4","3","3/5","3","2/6","3/7","3/5","3","3","6","2/7","3/5","2/7","3","3/5","3/5","2/6","3","3","3","2/6","2/7","4","3","3","2/6","2/6","2/7","3/5","2/7","2/7","3/5","5","2/7","4","3","3","3/5","3","3/5","3","3/5","6","2/6","3/6","3/5","3/5","4","6","3/7","3","2/7","3","3"]
["Stonecrafts","General","Ag/Sd","1/2","2/7","3","3/7","3","2/7","2/7","6","2/6","2/6","3/7","2/7","3","3","2/6","2/4","2/6","4","4","3","2/7","3","2/6","3","2/7","3","3","6","3/7","2/7","3/7","3","2/7","2/7","2/7","3","3","3","2/7","3/7","4","3","3","3/5","2/6","3/7","3/5","2/6","3/7","2/7","5","3/7","4","3","3","2/7","3","2/7","3","2/7","2/7","3/7","3/8","3/5","3/5","3","6","3","3","2/6","3","3"]
["Tactical Games","General","Re","1/4","2/4","1/2","2/4","2/4","2/4","2/4","2/4","2/5","2/4","2/4","1/4","2/4","1/5","2/6","2/4","2/4","2/4","2/4","2/4","2/4","1/4","2/6","2/4","2/4","1/4","2/4","2/4","2/4","2/5","4/8","1/4","2/4","2/4","1/2","2/6","1/4","2/4","1/4","2/4","2/4","1/4","2/6","1/4","2/6","2/4","1/4","2/4","2/4","2/4","2/4","2/4","1/4","2/4","2/6","2/4","2/4","2/4","1/4","2/4","2/4","2/4","2/4","2/4","2/4","1/4","6","2/4","2/4","2/4","1/4","1/4"]
["WA Maintenance","General","Ag/Sd","1/2","3/5","3","2/7","3","3/5","3/5","6","3/5","2/7","2/6","2/5","3","3","2/6","2/4","2/7","3/7","4","3","3/5","3","2/6","3/7","3/5","3","3","6","2/7","3/5","2/7","3","3/5","3/5","2/6","3","3","3","2/6","2/7","4","3","3","2/6","2/6","2/7","3/5","2/7","2/7","3/5","5","2/7","4","3","3","3/5","3","3/5","3","3/5","6","2/6","3/6","3/5","3/5","4","4","3/7","3","2/7","3","3"]
["Woodcrafts","General","Ag/Em","1/3","2/6","3","2/6","3","2/6","2/4","6","1/3","2/4","2/7","2/6","2/6","3","2/6","3","2/4","3/6","3","2/5","2/6","3","1/5","3/7","2/6","3","2/6","6","2/6","2/5","2/6","3","2/6","2/6","2/6","4","3","3","1/5","2/6","3","3","4","3/5","2/6","2/6","2/4","2/4","2/6","2/6","4","2/6","3","3","4","2/6","2/6","2/4","3","2/6","2/6","2/7","2/6","2/6","2/6","3","6","3/7","2/6","2/4","2/4","2/4"]
["Acrobatics","Gymnastic","Ag/Qu","3","2/5",3,"1/4","3","2/5","2/6","2/5","2/5","2/6","1/3","2/7","2/7","3","2/6","3/7","2/6","1/2","1/4","2/7","2/5","3","2/6","2/7","2/5","3","2/7","2/5","1/4","2/6","1/4","3","2/5","2/5","2/5","3","3","3/7","1/5","2/6","1/4","3","3","1/3","2/6","1/4","2/6","2/6","1/4","2/5","5","1/4","5","3/7","3","2/5","2/7","2/6","3","2/5","2/5","1/3","2/6","1/3","1/3","3","6","2/7","4","2/6","3","3"]
["Calisthenics","Gymnastic","None","20","4/9","20","3/8","20","4/9","10","4/9","4/9","4/9","3/8","4/9","20","20","20","20","6","3/9","5/10","20","4/9","20","5/10","6","4/9","20","20","3/8","6","10","6","20","4/9","6","6","10","20","20","3/8","3/8","10","20","20","3/8","5/10","6","6","6","4/9","4/9","20","6","5/10","20","20","3/8","20","10","20","4/9","6","6","5/10","4/9","4/9","20","3/8","6","20","6","20","20"]
["Contortions","Gymnastic","Ag/Sd","5","2/6",5,"1/3","5","2/6","2/5","2/5","2/6","2/6","1/3","2/7","3/7","5","2/6","2/6","2/6","1/2","1/4","2/6","2/6","4","2/6","2/7","2/6","5","2/6","2/5","2/4","2/5","2/4","4","2/6","2/6","2/6","5","5","3","2/4","2/5","1/4","4","5","1/3","2/6","2/4","2/5","2/6","2/4","2/6","4","2/4","4","3","5","2/6","2/6","2/5","5","2/6","4/12","1/3","2/5","1/2","1/2","4","6","3/7","3/7","2/6","5","5"]
["Juggling","Gymnastic","Ag/In","3","1/5",3,"1/3","2/6","2/5","1/5","3/7","1/5","2/7","1/3","2/7","2/6","3","2/6","3","2/7","1/4","2/5","2/7","1/5","2/5","2/6","2/6","1/5","3","2/7","3/7","1/3","1/5","1/3","3","1/5","1/5","1/5","2/5","3","2/6","2/7","1/5","2/5","2/5","2/5","1/2","2/6","2/6","2/7","2/7","1/3","1/5","4","1/3","3","2/5","2/5","1/3","2/7","1/5","2/5","1/5","2/10","1/2","1/4","2/7","2/7","2/5","6","2/6","3/7","2/7","3","3"]
["Jumping","Gymnastic","St/Ag","4","1/3",4,"1/3","4","1/3","3/6","1/3","1/3","1/3","1/4","2/7","3","4","2/6","3/7","3/6","1/3","1/4","3","1/3","4","2/6","3/6","1/3","4","3","1/3","1/3","3/6","1/3","4","1/3","1/3","1/3","4","4","4","2/5","3/6","1/4","4","4","1/4","2/6","1/3","3/6","3/6","1/3","1/3","3","1/3","3","4","4","1/3","3","3/6","4","1/3","1/3","1/4","1/4","1/3","1/3","4","6","3/6","3","3/6","4","4"]
["Pole Vaulting","Gymnastic","St/Ag","5","2/5",5,"1/4","5","2/5","3/6","2/5","2/5","2/6","1/3","2/7","4","5","2/6","4","2/6","1/4","2/5","4","2/5","5","2/6","3/7","2/5","5","4","1/4","1/4","3/6","1/4","5","2/5","2/5","2/5","5","5","5","2/5","3/6","2/5","5","5","1/3","2/6","1/4","3/6","2/6","1/4","2/5","6","1/4","5","5","5","2/5","4","3/6","5","2/5","2/5","1/3","2/5","1/4","1/4","6","6","3/7","4","2/6","5","5"]
["Stilt Walking","Gymnastic","St/Ag","4","2/5",4,"1/4","4","2/6","3/6","2/6","2/5","3/6","1/3","2/7","3","4","2/6","4","3/6","1/3","2/5","3","2/5","4","2/6","3/8","2/5","4","3","2/6","1/4","3/6","1/4","4","2/5","2/5","2/5","4","4","4","2/5","3/6","2/5","4","4","1/3","2/6","1/4","3/6","3/6","1/4","2/5","4","1/4","3","4","4","2/5","3","3/6","4","2/5","2/5","1/3","2/5","1/3","1/3","4","6","3/8","3","3/6","4","4"]
["Tightrope Walking","Gymnastic","Ag/Sd","3","3/6",3,"2/4","3","3/7","2/6","3/6","3/6","2/6","1/3","2/7","2","3","2/6","3/7","2/6","1/3","1/5","2","3/6","3","2/6","3/6","3/6","3","2","1/4","1/4","2/6","1/4","3","3/6","3/6","3/6","3","3","3","1/5","2/6","1/5","3","3","1/3","2/6","1/4","2/6","2/6","1/4","3/6","3","1/4","3","3","3","3/6","2","2/6","3","3/6","3/6","1/3","2/5","1/3","1/3","3","6","3/6","3","2/6","3","3"]
["Tumbling","Gymnastic","Ag/Sd","3","1/5",3,"1/3","3","1/5","2/5","2/7","2/5","2/5","1/4","2/7","2/6","3","2/6","3","2/4","1/2","1/4","2/5","1/5","3","2/6","2/6","2/5","3","2/5","1/3","2/5","2/5","2/6","3","2/6","2/6","2/5","3","3","2","1/4","2/5","1/4","3","3","1/4","2/6","1/5","2/4","2/4","1/4","1/5","4","1/4","4","2","3","2/5","2/5","2/5","3","2/5","2/7","1/4","1/4","1/3","1/3","3","2/6","2/6","3/7","2/4","3","3"]
["Language","Linguistic","None","1/*","3/*","1/*","1/*","1/*","3/*","1/*","3/*","3/*","3/*","3/*","2/*","2/*","1/*","2/*","2/*","3/*","3/*","3/*","2/*","3/*","1/*","3/*","3/*","3/*","2/*","2/*","3/*","3/*","1/*","3/*","1/*","3/*","3/*","2/*","2/*","2/*","2/*","3/*","3/*","2/*","1/*","1/*","3/*","2/*","2/*","3/*","3/*","3/*","1/*","1/*","3/*","1/*","1/*","2/*","3/*","2/*","2/*","2/*","3/*","3/*","3/*","1/*","3/*","3/*","1/*","3/*","3/*","2/*","1/*","2/*","2/*"]
["Lip Reading","Linguistic","In/Re","3/5","3/5","2/4","2/5","1/3","3/7","1/4","2/5","3/7","2/6","3/5","3/5","2/4","3/5","2/6","2/6","2/6","2/5","3/5","2/4","3/5","1/3","2/6","2/5","3/5","2/4","2/4","2/5","2/5","1/5","2/5","1/3","3/5","3/5","2/6","2/4","2/4","2/4","2/4","2/5","3/5","1/3","2/4","3/5","2/6","2/5","2/5","2/6","2/5","3/5","2/6","2/5","2/5","1/4","2/4","3/5","2/4","2/6","2/4","3/5","3/5","3/5","2/4","3/5","3/5","1/4","6","2/5","2/4","2/6","2/4","2/4"]
["Mimicry","Linguistic","In/Sd","2/6","2/5","2/6","1/5","2/7","2/5","1/5","2/5","2/5","2/6","2/5","2/5","2/7","2/4","2/6","3/7","2/6","2/5","2/6","1/5","2/5","1/4","2/6","2/6","2/5","2/6","2/7","2/5","1/5","1/5","1/5","1/3","2/5","2/5","2/5","2/4","2/6","2/6","2/6","1/5","2/6","1/4","2/4","2/5","2/6","1/5","2/5","2/6","1/5","2/5","3/6","1/5","3/5","1/5","2/4","2/5","2/7","2/6","2/7","2/5","2/5","2/5","1/4","2/5","2/5","1/4","6","2/6","2/7","2/6","2/6","2/6"]
["Music","Linguistic","Ag/Em","2/6","2/6","2/6","2/6","2/4","2/6","1/2","6","2/6","2/6","2/6","2/6","2/5","2/6","2/6","2/5","2/6","2/4","2/6","2/5","2/6","2/5","2/6","2/6","2/6","2/6","2/6","6","2/6","1/5","2/6","2/6","2/6","2/6","2/6","2/6","2/6","2/6","2/6","2/6","2/6","2/5","2/6","2/6","2/6","4/12","2/6","2/6","2/6","2/6","1/4","2/6","2/5","2/5","2/6","2/6","2/5","2/6","2/6","2/6","2/6","2/6","2/6","2/6","2/6","2/4","6","2/6","2/4","2/6","2/6","2/6"]
["Poetic Improvisation","Linguistic","Re","2/6","6","2/6","2/5","2/4","2/6","1/2","3","2/6","2/6","2/5","6","2/5","1/5","2/6","2/5","2/6","1/4","1/4","2/5","6","2/5","2/6","2/6","6","2/6","2/6","3","2/5","1/5","2/5","2/5","6","6","6","2/6","2/6","2/5","2/6","2/5","1/4","2/5","2/6","2/5","2/6","4/10","2/6","2/6","2/5","6","1/2","2/5","1/3","2/4","2/6","6","1/5","2/6","2/6","6","6","2/5","1/4","2/6","2/6","1/5","6","2/6","1/4","2/6","2/6","2/6"]
["Propaganda","Linguistic","In/Em","3/5","3/6","3/6","2/4","3/6","4","1/5","6","3/6","3/6","2/4","3/6","2/6","3/6","2/6","2/5","3/6","2/6","3/6","2/6","3/6","1/5","2/6","3/5","3/6","3/5","2/6","6","2/4","1/5","2/4","2/4","3/6","3/6","1/3","3/6","3/5","3/5","3/6","2/4","3/6","3/6","3/6","3/5","2/6","2/4","3/6","3/6","2/4","3/6","1/4","2/4","2/3","3/5","3/6","3/6","1/4","2/6","3/6","3/6","3/6","2/4","1/2","3/5","3/5","1/5","6","3/5","1/4","3/6","3/5","3/5"]
["Public Speaking","Linguistic","Em/Pr/Ap","3/5","2/6","2/6","2/4","3/6","2/6","1/2","6","2/6","2/6","2/6","1/5","2/6","3/6","2/6","2/5","2/6","2/4","2/6","2/6","2/6","3/6","2/6","2/6","2/6","3/5","2/6","6","2/4","1/5","2/4","2/4","4/9","2/6","1/3","3/6","3/5","3/5","2/6","2/4","2/6","3/6","3/6","2/6","2/6","2/4","1/4","2/6","2/4","1/3","1/4","2/4","2/5","3/5","3/6","2/6","1/4","2/6","3/6","2/6","2/6","2/6","1/4","2/6","2/6","1/5","6","2/6","1/4","2/6","3/5","3/5"]
["Signaling","Linguistic","Re/Sd","1/5","1/4","1/5","1/4","1/4","1/4","1/5","6","1/4","1/5","1/3","1/4","2/5","1/4","2/6","2/6","1/5","2/4","2/5","2/5","1/4","2/4","2/6","1/4","1/4","1/5","2/6","6","1/4","1/5","1/4","2/4","1/4","1/4","1/4","2/6","1/5","2/6","2/6","1/4","2/5","1/3","2/6","1/3","2/6","1/4","1/5","1/4","1/4","1/4","2/5","1/4","1/5","2/6","2/6","1/4","2/6","2/6","2/6","1/4","1/4","1/3","1/4","1/4","1/4","2/5","6","1/4","2/5","1/5","1/5","1/5"]
["Singing","Linguistic","Pr/In","2/6","2/6","2/6","2/6","2/4","2/6","1/2","6","2/6","2/6","2/6","2/6","2/5","2/6","2/6","2/4","2/6","1/4","2/5","2/6","2/6","1/3","2/6","2/6","2/6","2/6","2/6","6","2/6","1/5","2/6","2/6","2/6","2/6","2/6","2/6","2/6","2/6","2/6","2/6","2/5","2/5","2/6","2/6","2/6","2/6","2/6","2/6","2/6","2/6","1/5","2/6","2/5","2/5","2/6","2/6","2/6","2/6","2/6","2/6","2/6","2/6","2/6","2/6","2/6","2/4","6","2/6","2/4","2/6","2/6","2/6"]
["Tale Telling","Linguistic","Pr","2/6","2/6","2/6","2/5","2/4","2/6","1/3","2/6","2/6","2/6","2/5","2/6","2/5","2/6","2/6","2/6","2/6","1/4","2/5","2/6","2/6","2/5","2/6","2/6","2/6","2/6","2/5","2/6","2/5","1/5","2/5","2/5","2/6","2/6","2/6","2/6","2/6","2/5","2/6","2/5","2/5","2/5","2/6","2/5","2/6","2/5","2/6","2/6","2/5","1/4","1/4","2/5","2/5","2/4","2/6","2/6","2/5","2/6","2/6","2/6","2/6","2/5","1/4","2/6","2/6","2/5","6","2/6","2/4","2/6","2/6","2/6"]
["Trading","Linguistic","Re","3/5","3/6","3/5","2/4","3/6","3/6","2/4","6","3/6","3/5","2/4","3/6","2/5","3/6","2/6","2/5","3/5","3/5","3/6","2/6","3/6","2/6","2/6","3","3/6","3/5","2/6","6","2/4","2/4","2/4","2/4","3/6","3/6","2/5","2/6","3/5","3/5","3/6","2/4","3/6","3/6","2/6","2/4","2/6","2/4","3/6","3/5","2/4","3/6","2/5","2/4","2/4","3/6","2/6","3/6","1/4","2/6","3/6","3/6","3/6","2/4","1/2","3/5","3/5","3/6","6","3","1/4","3/5","3/5","3/5"]
["Ventriloquism","Linguistic","Sd/In","3/6","3/5","3/6","2/5","3/7","3/5","2/5","3/5","3/5","3/6","3/5","3/5","3/7","3/6","2/6","3/7","3/6","2/6","3/7","2/5","3/5","2/4","2/6","3/6","3/5","3/6","3/7","3/5","2/5","2/5","2/5","2/3","3/5","3/5","3/5","3/7","3/6","3/6","3/6","2/5","3/7","2/4","3/7","3/5","2/6","2/5","3/6","3/6","2/5","3/5","2/5","2/5","3/5","2/5","3/7","3/5","3/7","2/6","3/7","3/5","3/5","3/5","2/4","3/5","3/5","2/5","6","3/6","1/5","3/6","3/6","3/6"]
["Channeling","Magical","In","4/8","20","4/8","20","2/5","20","6","20","3/7","20","20","20","1/4","4/8","20","3/7","2/5","20","3/7","2/5","20","4/8","20","3/7","20","4/8","2/5","20","20","4/8","20","4/8","20","20","20","3/7","4/8","4/8","6","6","3/7","4/8","3/7","6","10","20","3/7","3/7","20","20","4/8","20","15","4/8","3/7","20","1/4","3/7","3/7","20","20","20","20","20","10","3/7","20","6","1/4","3/7","7","4/8"]
["Circle Lore","Magical","Re","2/4","6","1/4","6","2/5","7","3/6","4","6","6","4","6","2/4","1/3","2/6","2/4","3/6","5","3/8","1/5","6","2/5","6","3","6","1/4","2/5","4","5","3/6","5","2/4","6","6","6","2/5","1/4","2/5","3/6","3/6","3/8","2/5","2/5","4","2/6","5","3/6","3/6","5","6","1/4","5","3/6","2/5","2/5","10","2/4","3/6","1/4","10","6","4","6","5","5","1/4","6","2/7","1/4","3/6","1/4","1/4"]
["Directed Spells","Magical","Ag","2/7","20","2/6","20","2/7","25","10","20","9","20","20","20","3","2/6","20","3/8","15","20","15","3/7","20","2/8","20","3/9","20","2/5","3","20","20","10","20","2/6","20","20","20","8","1/4","2/6","9","10","3/7","2/6","2/6","2/6","3/6","20","20","20","20","20","2/7","20","15","2/7","2/5","20","2/7","10","2/5","20","20","20","20","20","20","2/7","25","3/6","2/5","15","3/6","3/6"]
["Divination","Magical","In/Em","2/4","3/6","2/4","3/6","1/4","3/6","3/5","3/5","3/5","3/6","3/6","3/6","1/5","1/4","2/6","1/5","3/5","3/5","3/5","2/5","3/6","1/4","3/6","3/6","3/6","2/4","2/5","3/5","3/6","3/5","3/6","2/4","3/6","10","2/7","1/5","2/4","2/4","3/5","3/5","3/5","1/4","1/5","3/5","2/6","3/6","3/5","3/5","3/6","3/6","1/4","3/6","2/5","1/3","1/5","6","1/4","3/5","2/5","6","3/6","3/6","2/5","3/5","3/5","1/4","6","3/6","1/3","1/5","2/4","2/4"]
["Magical Language","Magical","none","1/*","9","1/*","9","1/*","8","4/*","6","6/*","9","9","9","2/*","2/*","2/6","1/*","4/*","8","4/*","2/*","9","1/*","9","4/*","9","1/*","2/*","6","9","4/*","9","2/*","9","9","6","2/*","1/*","3/*","4/*","4/*","4/*","1/*","2/*","4/*","2/6","9","4/*","4/*","9","9","1/*","9","3/*","1/*","2/*","9","1/*","4/*","1/*","9","9","8","7","6","6","1/*","9","4/*","1/*","4/*","1/*","1/*"]
["Magical Rituals","Magical","Re/In","1/4","8","1/4","8","2/5","11","4","8","4","8","7","8","1/4","1/2","5/6","2/3","2/4","8","4","1/4","8","2/5","8","3","8","2/5","1/4","8","7","4","7","1/4","8","8","6","2/4","1/4","2/6","3","4","4","2/5","2/4","4","5/6","7","5","4","7","8","3","7","6","2/6","2/4","8","1/3","4","2/4","8","4","7","7","7","7","2/5","8","3","2/4","4","1/3","1/3"]
["Magnitude","Magical","realm","3/8","20","1/4","20","2/5","20","8","20","12","20","20","20","3/8","2/5","20","2/5","8","20","12","3/8","20","8","20","3/8","20","2/5","8","20","20","12","20","2/5","20","20","20","12","2/5","3/8","12","12","2/5","2/5","2/5","8","20","20","12","12","20","20","3/8","20","8","3/8","2/5","20","3/8","12","3/8","20","20","20","20","20","20","2/5","20","3/8","3/8","12","2/5","2/5"]
["Overcasting","Magical","realm","2/5","20","2/5","20","2/5","20","3/8","20","3/8","20","20","20","2/5","2/5","20","2/5","3/8","20","3/8","2/5","20","3/8","20","3/8","20","2/5","2/5","20","20","3/8","20","2/5","20","20","20","3/8","2/5","2/5","3/8","3/8","2/5","2/5","2/5","3/8","10","20","3/8","3/8","10","20","2/5","20","4","2/5","2/5","20","2/5","3/8","2/5","20","20","20","20","20","20","2/5","20","3/8","2/5","3/8","2/5","2/5"]
["Power Manipulation","Magical","realm","3/6","10","2/3","10","2/3","10","2/5","10","3/7","10","10","10","2/5","2/5","10","2/5","2/5","10","3/7","2/5","10","2/3","10","3/7","10","2/5","2/3","10","10","2/5","10","2/5","10","10","10","2/5","2/5","2/3","3/7","2/5","2/5","2/3","2/5","3/7","10","10","2/5","3/7","10","10","2/3","10","10","2/3","2/5","10","2/3","3/7","2/5","10","10","10","10","10","10","2/3","10","2/5","2/3","2/5","2/3","2/3"]
["Power Perception","Magical","Em","1/3","6","1/2","6","1/4","7","2/5","3/7","2/5","6","5","6","1/3","1/3","2/6","1/4","2/5","5","2/5","1/3","6","1/4","6","3/6","6","1/3","1/3","3/7","5","2/5","5","1/3","6","6","6","1/4","1/3","1/3","2/5","2/5","2/5","1/4","1/4","2/5","2/6","3","2/5","2/5","5","6","1/4","5","3/6","1/3","1/4","6","1/3","2/5","1/4","6","6","4","10","3/7","3/7","1/3","6","3/6","1/3","2/5","1/3","1/3"]
["PP Development","Magical","realm/2","2/5","15","2/5","15","2/5","20","4/8","6","4/8","15","9","15","2/5","2/5","4/8","2/5","4/8","9","4/8","2/5","15","2/5","15","4/8","15","2/5","2/5","6","10","4/8","10","2/5","15","15","10","2/5","2/5","2/5","4/8","4/8","4/8","2/5","2/5","4/8","4/8","10","4/8","4/8","10","15","2/5","10","5","2/5","2/5","15","2/5","4/8","2/5","15","15","8","10","6","6","2/5","15","4/8","2/5","4/8","2/5","2/5"]
["Power Projection","Magical","realm","1/4","12","2/4","12","1/5","15","3/6","6","12","12","10","12","1/4","2/4","3/8","2/6","3/6","10","2/5","1/4","12","2/5","12","3","12","2/4","1/4","6","10","3/6","10","2/4","12","12","6","2/5","2/4","2/4","2/5","3/6","2/5","2/5","2/5","9","3/8","10","2/6","3/6","10","12","2/5","10","8","2/4","2/5","12","1/3","3/6","2/5","12","25","9","8","6","6","2/5","12","3/6","1/4","3/6","1/4","1/4"]
["Rejuvenation","Magical","SD/realm","2/5","20","2/5","20","2/5","20","3/8","20","3/8","20","20","20","2/5","2/5","20","2/5","3/8","20","3/8","2/5","20","3/8","20","3/8","20","2/5","2/5","20","20","3/8","20","2/5","20","20","20","3/8","2/5","2/5","3/8","3/8","2/5","2/5","2/5","3/8","10","20","3/8","3/8","10","20","2/5","20","4","2/5","2/5","20","2/5","3/8","2/5","20","20","20","20","20","20","2/5","20","3/8","2/5","3/8","2/5","2/5"]
["Runes","Magical","Em/In","1/3","7","1/4","7","2/6","8","3/7","9","5","8","6","7","2/5","1/4","10","2/6","5","6","8","2/6","7","2/5","10","6","7","1/4","2/6","7","6","5","6","1/4","14","7","5","4","1/4","2/5","4","5","3/7","2/5","2/5","6","3/6","6","7","5","6","7","1/4","6","3/9","2/6","2/5","14","2/5","4","2/5","14","7","6","5","6","6","2/5","25","3/6","2/5","5","1/4","1/4"]
["Scrying","Magical","In/Pr","2/4","3/6","2/4","3/6","1/4","3/6","3/5","3/5","3/5","3/6","3/6","3/6","1/5","1/4","2/6","1/5","3/5","3/5","3/5","2/5","3/6","1/4","3/6","3","3/6","2/4","2/5","3/5","3/6","3/5","3/6","2/4","3/6","10","2/7","1/5","2/4","2/4","3/5","3/5","3/5","1/4","1/5","3/5","2/6","3/6","3/5","3/5","3/6","3/6","1/4","3/6","2/5","1/3","1/5","6","1/4","3/5","2/5","6","3/6","3/6","2/5","3/5","3/5","1/4","6","3/6","1/3","3/5","2/4","2/4"]
["SL (base)","Magical","realm","1/*","20","1/*","15","1/*","25","3/*","20","3/*","20","10","20","1/*","1/*","15","1/*","3/*","10","3/*","1/*","20","1/*","20","3/*","20","1/*","1/*","20","8","3/*","8","1/*","20","20","10","3/*","1/*","1/*","3/*","3/*","3/*","1/*","1/*","3/*","5/*","8","3/*","3/*","6","20","1/*","8","4","1/*","1/*","20","1/*","3/*","1/*","20","20","10","7","10","10","1/*","25","3/*","1/*","3/*","1/*","1/*"]
["SL (closed, A)","Magical","realm","N/A","40","N/A","30","N/A","50","6/*","40","6/*","40","20","40","N/A","N/A","30","N/A","6/*","20","6/*","N/A","40","1/*","40","6/*","40","N/A","N/A","40","16","6/*","16","N/A","40","40","20","6/*","N/A","N/A","6/*","6/*","6/*","1/*","N/A","6/*","10","16","6/*","6/*","16","40","N/A","16","8","N/A","1/*","40","N/A","6/*","1/*","40","40","20","14","20","20","1/*","50","6/*","1/*","6/*","N/A","N/A"]
["SL (closed, B)","Magical","realm","1/*","N/A","1/*","N/A","1/*","N/A","10","N/A","10","N/A","N/A","N/A","1/*","1/*","N/A","1/*","10","N/A","10","1/*","N/A","3/*","N/A","10","N/A","1/*","1/*","N/A","N/A","10","N/A","1/*","N/A","N/A","N/A","10","1/*","1/*","10","10","10","3/*","1/*","10","N/A","N/A","10","10","N/A","N/A","1/*","N/A","N/A","1/*","3/*","N/A","1/*","10","3/*","N/A","N/A","N/A","N/A","N/A","N/A","3/*","N/A","10","3/*","10","1/*","1/*"]
["SL (closed, C)","Magical","realm","N/A","40","N/A","30","N/A","50","6/*","40","6/*","40","20","40","N/A","N/A","30","N/A","6/*","20","6/*","N/A","40","1/*","40","6/*","40","N/A","N/A","40","16","6/*","16","N/A","40","40","20","6/*","N/A","N/A","6/*","6/*","6/*","1/*","N/A","6/*","10","16","6/*","6/*","16","40","N/A","16","8","N/A","1/*","40","N/A","6/*","1/*","40","40","20","14","20","20","1/*","50","6/*","1/*","6/*","N/A","N/A"]
["SL (closed, D)","Magical","realm","1/*","N/A","1/*","N/A","1/*","N/A","30","N/A","30","N/A","N/A","N/A","1/*","1/*","N/A","1/*","30","N/A","30","1/*","N/A","4/*","N/A","30","N/A","1/*","1/*","N/A","N/A","30","N/A","1/*","N/A","N/A","N/A","30","1/*","1/*","30","30","30","4/*","1/*","30","N/A","N/A","30","30","N/A","N/A","1/*","N/A","N/A","1/*","4/*","N/A","1/*","30","4/*","N/A","N/A","N/A","N/A","N/A","N/A","4/*","N/A","30","4/*","30","1/*","1/*"]
["SL (closed, E)","Magical","realm","3/*","N/A","2/*","N/A","3/*","N/A","N/A","N/A","N/A","N/A","N/A","N/A","3/*","3/*","N/A","3/*","N/A","N/A","N/A","3/*","N/A","8/*","N/A","N/A","N/A","3/*","3/*","N/A","N/A","N/A","N/A","3/*","N/A","N/A","N/A","N/A","3/*","3/*","N/A","N/A","N/A","8/*","3/*","N/A","N/A","N/A","N/A","N/A","N/A","N/A","3/*","N/A","N/A","3/*","8/*","N/A","3/*","N/A","8/*","N/A","N/A","N/A","N/A","N/A","N/A","8/*","N/A","N/A","8/*","N/A","3/*","3/*"]
["SL (open, A)","Magical","realm","N/A","20","N/A","15","N/A","25","3/*","20","3/*","20","10","20","N/A","N/A","15","N/A","3/*","10","3/*","1/*","20","N/A","20","3/*","20","N/A","N/A","20","8","3/*","8","N/A","20","20","10","3/*","N/A","N/A","3/*","3/*","3/*","N/A","N/A","3/*","5/*","8","3/*","3/*","8","20","N/A","8","4","N/A","N/A","20","N/A","3/*","N/A","20","20","10","7","10","10","N/A","25","3/*","N/A","3/*","1/*","1/*"]
["SL (open, B)","Magical","realm","1/*","N/A","1/*","N/A","1/*","N/A","N/A","N/A","N/A","N/A","N/A","N/A","1/*","1/*","N/A","1/*","N/A","N/A","N/A","1/*","N/A","1/*","N/A","N/A","N/A","1/*","1/*","N/A","N/A","N/A","N/A","1/*","N/A","N/A","N/A","N/A","1/*","1/*","N/A","N/A","N/A","1/*","1/*","N/A","N/A","N/A","N/A","N/A","N/A","N/A","1/*","N/A","N/A","1/*","1/*","N/A","1/*","N/A","1/*","N/A","N/A","N/A","N/A","N/A","N/A","1/*","N/A","N/A","1/*","N/A","1/*","1/*"]
["SL (open, C)","Magical","realm","N/A","40","N/A","30","N/A","50","3/*","40","3/*","40","20","40","N/A","N/A","30","N/A","3/*","20","3/*","N/A","40","N/A","40","3/*","40","N/A","N/A","40","16","3/*","16","N/A","40","40","20","3/*","N/A","N/A","3/*","3/*","3/*","N/A","N/A","3/*","10","16","3/*","3/*","16","40","N/A","16","8","N/A","N/A","40","N/A","3/*","N/A","40","40","20","14","20","20","N/A","50","3/*","N/A","3/*","N/A","N/A"]
["SL (open, D)","Magical","realm","1/*","N/A","1/*","N/A","1/*","N/A","10","N/A","10","N/A","N/A","N/A","1/*","1/*","N/A","1/*","10","N/A","10","1/*","N/A","3/*","N/A","10","N/A","1/*","1/*","N/A","N/A","10","N/A","1/*","N/A","N/A","N/A","10","1/*","1/*","10","10","10","3/*","1/*","10","N/A","N/A","10","10","N/A","N/A","1/*","N/A","N/A","1/*","3/*","N/A","1/*","10","3/*","N/A","N/A","N/A","N/A","N/A","N/A","3/*","N/A","10","3/*","10","1/*","1/*"]
["SL (open, E)","Magical","realm","1/*","N/A","2/*","N/A","1/*","N/A","20","N/A","20","N/A","N/A","N/A","1/*","1/*","N/A","1/*","20","N/A","20","1/*","N/A","10","N/A","20","N/A","1/*","1/*","N/A","N/A","20","N/A","1/*","N/A","N/A","N/A","20","1/*","1/*","20","20","20","10","1/*","20","N/A","N/A","20","20","N/A","N/A","1/*","N/A","N/A","1/*","10","N/A","1/*","20","10","N/A","N/A","N/A","N/A","N/A","N/A","10","N/A","20","10","20","1/*","1/*"]
["SL (oth realm, base, A)","Magical","realm","10","N/A","N/A","N/A","10","N/A","N/A","N/A","N/A","N/A","N/A","N/A","10","10","N/A","10","N/A","N/A","N/A","30","N/A","10","N/A","N/A","N/A","10","10","N/A","N/A","N/A","N/A","10","N/A","N/A","N/A","N/A","10","10","N/A","N/A","N/A","10","10","N/A","N/A","N/A","N/A","N/A","N/A","N/A","10","N/A","N/A","10","10","N/A","10","N/A","10","N/A","N/A","N/A","N/A","N/A","N/A","10","N/A","N/A","10","N/A","30","30"]
["SL (oth realm, cl, A)","Magical","realm","5","N/A","N/A","N/A","5","N/A","20","N/A","20","N/A","N/A","N/A","5","5","N/A","5","20","N/A","20","10","N/A","5","N/A","20","N/A","5","5","N/A","N/A","20","N/A","5","N/A","N/A","N/A","20","5","5","20","20","20","5","5","20","N/A","N/A","20","20","N/A","N/A","5","N/A","N/A","5","5","N/A","5","20","5","N/A","N/A","N/A","N/A","N/A","N/A","5","N/A","20","5","20","10","10"]
["SL (oth realm, cl, B)","Magical","realm","10","N/A","N/A","N/A","10","N/A","N/A","N/A","N/A","N/A","N/A","N/A","10","10","N/A","10","N/A","N/A","N/A","30","N/A","10","N/A","N/A","N/A","10","10","N/A","N/A","N/A","N/A","10","N/A","N/A","N/A","N/A","10","10","N/A","N/A","N/A","10","10","N/A","N/A","N/A","N/A","N/A","N/A","N/A","10","N/A","N/A","10","10","N/A","10","N/A","10","N/A","N/A","N/A","N/A","N/A","N/A","10","N/A","N/A","10","N/A","30","30"]
["SL (oth realm, op, A)","Magical","realm","4/*","N/A","N/A","N/A","4/*","N/A","N/A","N/A","N/A","N/A","N/A","N/A","4/*","4/*","N/A","4/*","N/A","N/A","N/A","4/*","N/A","5","N/A","N/A","N/A","4/*","4/*","N/A","N/A","N/A","N/A","4/*","N/A","N/A","N/A","N/A","4/*","4/*","N/A","N/A","N/A","5","4/*","N/A","N/A","N/A","N/A","N/A","N/A","N/A","4/*","N/A","N/A","4/*","5","N/A","4/*","N/A","5","N/A","N/A","N/A","N/A","N/A","N/A","5","N/A","N/A","5","N/A","4/*","4/*"]
["SL (oth realm, op, C)","Magical","realm","8","N/A","N/A","N/A","8","N/A","N/A","N/A","N/A","N/A","N/A","N/A","8","8","N/A","8","N/A","N/A","N/A","15","N/A","10","N/A","N/A","N/A","8","8","N/A","N/A","N/A","N/A","8","N/A","N/A","N/A","N/A","8","8","N/A","N/A","N/A","10","8","N/A","N/A","N/A","N/A","N/A","N/A","N/A","8","N/A","N/A","8","10","N/A","8","N/A","10","N/A","N/A","N/A","N/A","N/A","N/A","10","N/A","N/A","10","N/A","15","15"]
["SL (oth realm, op, D)","Magical","realm","10","N/A","N/A","N/A","10","N/A","N/A","N/A","N/A","N/A","N/A","N/A","10","10","N/A","10","N/A","N/A","N/A","30","N/A","15","N/A","N/A","N/A","10","10","N/A","N/A","N/A","N/A","10","N/A","N/A","N/A","N/A","10","10","N/A","N/A","N/A","15","10","N/A","N/A","N/A","N/A","N/A","N/A","N/A","10","N/A","N/A","10","15","N/A","10","N/A","15","N/A","N/A","N/A","N/A","N/A","N/A","15","N/A","N/A","15","N/A","30","30"]
["SL (other base, A)","Magical","realm","3/*","N/A","3/*","N/A","3/*","N/A","20","N/A","20","N/A","N/A","N/A","3/*","3/*","N/A","3/*","20","N/A","20","3/*","N/A","10","N/A","20","N/A","3/*","3/*","N/A","N/A","20","N/A","3/*","N/A","N/A","N/A","20","3/*","3/*","20","20","20","10","3/*","20","N/A","N/A","20","20","N/A","N/A","3/*","N/A","N/A","3/*","10","N/A","3/*","20","10","N/A","N/A","N/A","N/A","N/A","N/A","10","N/A","20","10","20","3/*","3/*"]
["SL (other base, C)","Magical","realm","4/*","N/A","4/*","N/A","4/*","N/A","N/A","N/A","N/A","N/A","N/A","N/A","4/*","4/*","N/A","4/*","N/A","N/A","N/A","4/*","N/A","N/A","N/A","N/A","N/A","4/*","4/*","N/A","N/A","N/A","N/A","4/*","N/A","N/A","N/A","N/A","4/*","4/*","N/A","N/A","N/A","N/A","4/*","N/A","N/A","N/A","N/A","N/A","N/A","N/A","4/*","N/A","N/A","4/*","N/A","N/A","4/*","N/A","N/A","N/A","N/A","N/A","N/A","N/A","N/A","N/A","N/A","N/A","N/A","N/A","4/*","4/*"]
["SL (other base, D)","Magical","realm","5","N/A","5","N/A","5","N/A","N/A","N/A","N/A","N/A","N/A","N/A","5","5","N/A","5","N/A","N/A","N/A","10","N/A","N/A","N/A","N/A","N/A","5","5","N/A","N/A","N/A","N/A","5","N/A","N/A","N/A","N/A","5","5","N/A","N/A","N/A","N/A","5","N/A","N/A","N/A","N/A","N/A","N/A","N/A","5","N/A","N/A","5","N/A","N/A","5","N/A","N/A","N/A","N/A","N/A","N/A","N/A","N/A","N/A","N/A","N/A","N/A","N/A","10","10"]
["SL (other base, E)","Magical","realm","10","N/A","10","N/A","10","N/A","N/A","N/A","N/A","N/A","N/A","N/A","10","10","N/A","10","N/A","N/A","N/A","20","N/A","N/A","N/A","N/A","N/A","10","10","N/A","N/A","N/A","N/A","10","N/A","N/A","N/A","N/A","10","10","N/A","N/A","N/A","N/A","10","N/A","N/A","N/A","N/A","N/A","N/A","N/A","10","N/A","N/A","10","N/A","N/A","10","N/A","N/A","N/A","N/A","N/A","N/A","N/A","N/A","N/A","N/A","N/A","N/A","N/A","20","20"]
["Spell Ambush","Magical","None","2","15","3","15","3","20","4","6","4","15","9","15","2","2","4","3","4","9","4","2","15","3","15","4","15","2","2","6","10","4","10","2","15","15","10","3","2","2","4","4","4","3","3","4","4","10","4","4","10","15","2","10","5","2","3","15","2","4","3","15","15","8","10","6","6","3","15","4","3","4","2","2"]
["Spell Artistery","Magical","realm","1/3","6","1/3","6","1/3","6","2/5","6","3/5","6","6","6","1/3","1/3","6","1/3","1/4","6","2/5","1/3","6","1/3","6","3/9","6","1/3","2/4","6","5","1/3","5","1/3","6","6","6","2/5","2/5","1/3","2/5","2/5","2/5","1/3","2/5","2/5","3/6","5","3/5","3/5","5","6","1/3","5","4","1/3","1/3","6","1/2","3/5","1/3","12","6","6","5","5","5","1/3","6","2/4","1/3","3/5","1/5","1/5"]
["Spell Mastery","Magical","realm","2/7","6","2/4","6","2/5","6","3/5","6","3/5","6","6","6","2/4","2/5","3/6","2/4","3/5","6","3/5","2/4","6","2/5","6","3/7","6","2/4","2/5","6","5","3/5","5","2/4","6","6","6","2/5","2/5","2/5","3/5","3/5","3/5","2/5","2/5","3/5","3/6","5","3/5","3/5","5","6","1/4","5","4","2/5","2/5","6","2/4","3/5","2/5","12","6","6","5","5","5","2/5","6","3/5","2/4","3/5","1/5","1/5"]
["Spell Trickery","Magical","Pr/Qu","2/5","6","2/4","6","2/5","6","3/5","6","3/5","6","6","6","2/4","2/5","3/6","2/4","3/5","6","3/5","2/4","6","2/5","6","3/5","6","2/6","2/4","6","5","3/5","5","2/5","6","6","6","2/5","2/5","2/5","3/5","3/5","3/5","2/5","2/5","3/5","3/6","5","3/5","3/5","5","6","1/4","5","4","2/5","2/5","6","2/4","3/5","2/5","12","6","6","5","5","5","2/5","6","3/5","2/4","3/5","1/5","1/5"]
["Staves & Wands","Magical","Em/In","1/3","9","1/4","9","2/6","8","6","10","6","6","7","9","2/5","1/4","10","2/5","6","8","6","2/5","12","1/5","10","6","9","1/4","3/7","7","8","6","8","1/4","18","9","7","4","1/4","2/5","5","6","3/7","2/5","2/5","7","3/6","4","9","6","8","9","2/5","8","4","2/6","2/5","9","2/5","6","2/5","9","9","7","5","25","9","2/5","25","3/7","2/5","3","1/4","1/4"]
["Summoning","Magical","Em/Re","2/4","6","1/4","6","2/5","7","3/6","4","6","6","4","6","2/4","1/3","2/6","2/4","2/5","5","3/8","1/5","6","2/5","6","3","6","2/5","2/5","4","5","3/6","5","2/4","6","6","6","2/5","2/5","2/5","3/6","3/6","3/8","2/5","2/5","4","2/6","5","3/6","2/5","5","6","1/4","5","3/6","2/5","2/5","10","2/4","3/6","2/5","10","6","4","6","5","5","2/5","6","3/6","1/4","2/7","1/4","1/4"]
["Symbol Lore","Magical","Re","1/4","10","1/4","5","1/4","7","1/4","5","7","5","4","5","1/4","1/4","2/6","2/4","2/4","4","3/6","2/4","5","1/4","5","3/7","5","2/4","2/4","5","4","2/4","4","2/4","5","5","5","2/5","2/4","2/5","2/5","2/4","3/6","1/4","2/5","6","2/6","4","3/6","3/6","4","5","1/4","4","3/6","1/4","2/5","5","1/3","2/4","2/5","5","5","3","4","6","3","1/4","5","2/7","1/4","2/7","1/4","1/4"]
["Targeting Skill","Magical","In","2/5","6","2/4","6","1/5","6","2/4","6","2/5","6","6","6","1/3","1/4","2/5","1/4","2/4","6","2/4","1/3","6","2/4","6","3/7","6","2/4","2/5","6","5","2/5","5","1/3","6","6","6","2/4","2/4","2/4","2/5","2/5","2/5","2/5","1/4","2/5","3/6","5","2/4","2/4","5","6","1/4","5","4","2/5","2/4","6","1/3","3/5","1/4","12","6","6","5","5","5","1/4","6","2/4","2/4","2/4","2/4","2/4"]
["Transcend Armor","Magical","realm","4","15","4","15","7","20","3/9","18","3/9","15","18","15","4","6","15","6","3/7","12","4/6","5","15","7","15","2/5","15","9","5","18","12","3/9","12","6","15","15","6","6","6","6","8","3/9","4/6","7","6","3/9","15","12","2/6","3/7","12","15","3/7","12","10","7","6","15","5","2/6","6","15","15","10","13","20","20","5","15","2/5","6","2/5","7","7"]
["Warding Lore","Magical","In/Re","1/4","5","2/4","5","2/4","8","3/6","7","5","5","4","5","2/4","1/3","2/6","2/4","2/4","4","3/6","1/4","5","2/5","5","3/7","5","2/4","1/4","7","8","3/6","4","2/4","5","10","6","2/5","2/4","2/4","3/6","3/6","3/6","2/5","2/5","3","2/6","4","2/5","2/4","4","5","1/4","4","3/6","2/4","2/5","5","1/4","3/6","2/5","10","5","3","4","5","5","2/5","6","2/6","1/4","2/4","1/4","1/4"]
["Animal Healing","Medical","Em/Re","2/5","2/6","2/6","2/5","2/6","2/6","2/5","2/6","2/6","2/6","2/6","2/6","1/5","2/6","2/6","4","2/5","2/6","2/5","1/4","2/6","2/5","2/6","1/4","2/6","2/6","1/3","2/6","2/5","2/5","2/5","2/6","2/6","2/6","2/6","2/6","2/6","2/6","2/5","2/5","2/5","2/5","2/6","2/6","2/6","2/5","1/5","1/5","2/5","2/6","2/5","2/5","2/5","2/5","2/6","2/6","1/2","2/5","2/6","2/6","2/6","2/6","2/6","2/5","2/5","3/6","6","2/6","2/4","2/5","2/6","2/6"]
["Dentistry","Medical","Re/Ag","5","7","6","7","6","8","6","5","7","7","6","7","4","6","5","5","3/6","6","3/6","3/7","7","6","5","3","7","6","2/5","5","7","6","7","6","7","7","7","5","6","6","5","7","3/6","6","5","6","5","7","3","3/6","7","7","5","7","3/6","5","5","7","4","6","8","7","7","6","7","4","4","6","7","6","6","3/6","6","6"]
["Diagnostics","Medical","In/Re","2","3","2","2/3","3/6","3","1/4","2/5","3","3","3","3","2/5","2","2/6","2/6","1/4","1/5","2/5","1/4","3","3/5","2/6","1/4","3","2","1/2","2/5","3","1/4","3","2","3","3","2/3","2/4","2","3/6","1/4","3","2/5","3/5","2/4","3","2/6","3","1/4","1/4","3","3","1/5","3","2/5","2/5","2/4","3","1/3","1/4","3/6","3","3","3","3","2/5","2/5","3/6","6","3","2/5","1/4","2","2"]
["Drug Tolerance","Medical","Co/Sd","2/5","3/5","3/6","1/4","3/6","3","2/5","1/5","3","3/5","3/5","3/5","3/6","3/6","2/6","3/5","3/6","2/3","2/5","3","3/5","3/6","2/6","3/5","3/5","3/6","2/5","1/5","2/6","2/5","2/6","3/6","3/5","3/5","3/5","3/6","3/6","3/6","1/5","2/6","2/5","3/6","3/6","1/3","2/6","2/6","3/6","3/6","2/6","3/5","3/6","2/6","2/4","3/6","3/6","3/5","2/5","2/5","3/6","3/5","3/5","1/4","2/6","2/5","2/5","2/5","2/6","3/5","2/5","3/6","3/6","3/6"]
["First Aid","Medical","Sd/Em","2/5","2/6","2/6","2/6","2/6","2/6","2/6","2/6","2/6","2/6","2/6","2/6","1/5","2/6","2/6","2/6","2/4","2/6","1/4","1/5","2/6","2/6","2/6","1/3","2/6","2/6","1/2","2/6","2/6","2/6","2/6","2/6","2/6","2/6","2/6","3/6","2/6","2/6","2/6","2/6","1/4","2/6","3/6","2/6","2/6","2/6","1/5","2/4","2/6","2/6","2/4","2/6","1/4","2/6","3/6","2/6","1/2","2/6","3/6","2/6","2/6","2/6","2/6","2/6","2/6","3/6","3/7","2/6","2/4","2/4","2/6","2/6"]
["Hypnosis","Medical","Pr/Sd","2/4","4","2/4","4","3/6","6","2/5","2/5","4","4","5","4","3/6","1/4","2/6","2/6","3/6","4","2/5","3","4","2/5","2/6","3/5","4","2/4","3/6","2/5","4","2/5","4","1/4","4","4","4","2/5","2/4","1/5","4","4","2/5","2/5","2/5","2/6","2/6","4","3/6","3/6","4","4","2/4","4","2/3","2/5","2/5","4","2/6","2/5","3","4","4","3/6","4","4","4","1/2","6","3/5","3/6","3/6","2/4","2/4"]
["Midwifery","Medical","Em/In","4","4","4","4","4","4","4","4","4","4","4","4","3/6","4","3/6","4","2/6","4","2/6","2/6","4","4","3/6","4","4","4","1/3","4","4","4","4","4","4","4","4","7","4","4","4","4","2/6","4","7","4","3/6","4","2/5","2/6","4","4","4","4","2/4","4","7","4","1/3","4","6","4","4","4","4","4","4","4","6","4","3/8","2/6","4","4"]
["Second Aid","Medical","Sd/Em/In","3/6","3/7","3/7","3/7","3/7","3/7","3/7","3/7","3/7","3/7","3/7","3/7","2/6","3/7","3/7","2/6","2/5","3/7","2/5","2/6","3/7","3/7","3/7","2/5","3/7","3/7","1/5","3/7","3/7","3/7","3/7","3/7","3/7","3/7","3/7","5","3/7","3/7","3/7","3/7","2/5","3/7","5","3/7","3/7","3/7","2/5","2/5","3/7","3/7","2/5","3/7","2/4","2/5","5","3/7","1/5","3/7","4","3/7","3/7","3/7","3/7","3/7","3/7","2/7","6","3/7","3/6","2/5","3/7","3/7"]
["Surgery","Medical","Sd/Em/In","5","7","6","7","6","8","6","5","7","7","6","7","4","6","5","5","3/6","6","3/6","3/7","7","6","5","2/4","7","6","2/5","5","7","6","7","6","7","7","7","5","6","6","5","7","3/6","6","5","6","5","7","3","3/6","7","7","5","7","3/6","5","5","7","4","6","8","7","7","6","7","4","4","6","7","6","6","3/6","6","6"]
["Awakening","Perception","In","18","2/6","18","2/7","18","2/5","5","1/4","2/6","2/6","2/7","3/7","7","18","2/6","20","5","3/5","5","5","2/6","18","3/8","6","2/6","18","18","8","1/5","5","1/5","18","1/3","2/6","2/6","18","18","8","8","5","5","18","18","2/7","2/6","1/5","3/6","5","1/5","2/6","20","1/5","18","15","18","1/3","18","5","18","2/6","4/12","2/7","2/5","8","8","15","2/6","6","18","5","18","18"]
["Battle Perception","Perception","In/Re","2/4","1/2","2/4","2/5","2/5","1/2","2/4","5","1/3","1/4","1/3","1/2","2/5","1/4","2/6","2/4","2/5","2/7","2/6","2/5","1/2","2/4","2/6","1/4","1/2","2/4","2/5","1/4","1/3","2/5","1/3","1/4","1/2","1/2","1/2/2","1/4","2/4","2/4","2/4","1/3","2/6","2/4","1/4","1/3","2/6","1/3","1/3","1/4","1/3","1/2","1/4","1/3","1/4","2/5","1/4","1/2","1/6","2/4","2/4","1/2","1/2","1/3","2/5","1/4","1/4","2/4","6","1/4","2/6","1/4","2/4","2/4"]
["Detecting Traps","Perception","In","2/5","2/4","3","1/3","2/5","2/5","1/4","2/6","2/4","1/3","1/2","2/4","3","3","2/6","3/6","1/3","1/4","3/7","2/4","2/4","3","2/6","2/6","2/4","3","3","1/4","1/3","1/4","1/3","1/4","2/4","2/4","2/4","3","3","3","2/5","1/3","3/7","1/4","3","1/2","2/6","1/3","1/4","1/3","1/3","2/4","3","1/3","2/4","1/4","3","2/4","3","1/4","3","2/4","2/4","1/2","1/4","1/4","1/4","1/4","6","2/6","3","1/3","3","3"]
["Direction Sense","Perception","In/Re","2/4","1/4","2/4","1/4","1/2","1/4","1/4","2/6","1/4","1/2","1/4","1/4","2/4","1/5","2/6","1/4","1/2","1/4","1/4","1/4","1/4","2/4","2/6","1/5","1/4","2/4","2/4","1/3","1/4","1/4","1/4","1/4","1/4","1/4","1/4","2/4","2/4","1/3","2/4","1/4","1/4","2/4","2/4","1/4","2/6","1/4","2/4","1/2","1/4","1/4","1/3","1/4","2/4","1/2","2/4","1/4","2/4","1/4","2/5","1/4","1/4","1/4","1/3","1/3","1/3","2/5","6","1/5","2/5","1/2","2/4","2/4"]
["Find Weakness","Perception","Re/In","1/3","10","3/5","10","3/5","10","7","10","7","10","10","10","1/3","1/3","1/3","3/5","7","10","7","1/3","10","1/3","10","7","10","1/3","1/3","10","10","7","10","1/3","10","10","10","7","1/3","1/3","7","7","7","3/5","3/5","7","10","10","7","7","10","10","3/5","10","10","1/3","3/5","10","7","7","3/5","10","10","10","10","10","10","1/3","10","7","3/5","7","1/3","1/3"]
["General Perception","Perception","In/Re","3","2/5","2","1/3","2","2/4","2/7","2/5","2/7","1/3","1/3","2/5","3","2","2/6","2/8","2/7","2/4","2/4","3/7","2/5","2/8","2/6","2/6","2/5","3/7","3/7","2/5","2/4","2/7","1/3","3/7","2/5","2/5","1/3","3/7","3/7","3/7","2/7","2/4","2/5","2/8","3/7","2/7","2/6","1/2","3/7","2/6","1/3","2/5","2/8","1/3","1/3","1/3","3","2/5","3/7","1/3","3/7","2/5","2/4","1/3","1/3","2/5","2/5","2/7","4","2/6","3/7","2/5","3","3/7"]
["Lie Perception","Perception","In/Re","3/5","3/5","2/5","2/5","2/4","3/5","1/2","2/6","3/5","2/6","1/4","3/5","1/4","2/4","2/6","2/6","3/5","2/5","1/3","1/4","3/5","1/3","2/6","2/5","3/5","2/5","1/3","2/5","2/5","1/2","2/5","1/4","3/5","3/5","3/5","2/4","2/5","2/4","2/4","2/5","1/3","1/3","2/4","1/5","2/6","1/3","1/3","3/5","2/5","3/5","2/4","2/5","2/4","2/4","2/4","3/5","1/3","1/2","3/6","3/5","3/5","1/5","1/2","3/5","3/5","1/4","6","2/5","1/4","3/5","2/5","2/5"]
["Locate Secret Opening","Perception","In/Re","2/5","2/5","3/6","1/4","3/6","2/6","1/5","2/6","2/5","1/4","1/2","2/5","3/6","3/6","2/6","2/6","1/4","2/4","2/5","3/5","2/5","3/6","2/6","2/6","2/5","3/6","3/6","1/4","1/4","1/5","1/4","3/6","2/5","2/5","2/5","3/6","3/6","3/6","2/5","1/4","2/5","1/4","3/6","1/3","2/6","1/4","2/4","1/4","1/4","2/5","3/5","1/4","2/4","1/4","3/6","2/5","3/6","1/5","3/6","2/5","2/5","1/3","1/4","1/4","1/4","2/5","6","2/6","3/6","1/4","3/6","3/6"]
["Poison Perception","Perception","In/Re","1/4","2/5","3","1/4","3","2/6","2","2/6","2/5","1/5","1/3","2/5","2/5","3","2/6","3/7","3","1/4","3","1/4","2/5","3","2/6","1/4","2/5","3","1/3","1/4","1/4","2","1/4","2","2/5","4/10","2/5","1/5","3","3","1/4","1/4","3","2","1/5","1/3","2/6","1/4","1/4","3","1/4","2/5","3/6","1/4","2/6","2","1/5","2/5","1/4","1/5","1/4","2/5","2/5","1/3","1/3","1/4","1/4","1/4","4","2/6","1/4","3","3","3"]
["Read Tracks","Perception","In/Re","3/7","2/5","3","1/4","2/4","1/4","2/4","2/6","1/2","1/3","3/6","2/5","2/5","2/6","2/6","3/7","1/3","3/6","3/6","1/4","2/5","3/6","2/6","2/6","2/5","3/6","2/7","2/6","1/4","2/4","1/4","3/6","2/5","2/5","2/5","3/8","3/6","3/8","2/5","1/4","3/6","2/4","3/8","1/4","2/6","1/4","2/4","1/3","1/4","2/5","1/3","3/7","1/4","1/4","3/8","2/5","2/4","1/3","3/7","2/5","2/5","1/4","2/5","2/5","2/5","2/6","6","2/6","3/5","1/3","3/6","3/6"]
["Sense Ambush","Perception","In/Re","3","1/4","3","1/4","2","1/4","1/4","2/6","1/3","1/3","1/3","1/4","3","3","2/6","3/5","1/3","2/5","1/5","3","1/4","3","2/6","2/5","1/4","3","3","1/4","1/4","1/4","1/4","2","1/4","1/4","1/4","3","3","3","1/4","1/4","1/5","2","3","1/3","2/6","1/4","1/4","1/3","1/4","1/4","3/6","1/4","2/5","1/3","3","1/4","3","1/4","3","1/4","1/4","1/3","1/4","1/4","1/4","2/5","3","2/5","3","1/3","3","3"]
["Sense Reality Warp","Perception","In/Em","1/4","6","1/2","5","3/7","9","3/6","2/6","3/6","3/6","5","6","1/3","1/3","3/8","2/4","3/6","5","3/6","2/5","6","1/3","3/8","3/8","6","1/3","3/6","2/5","5","3/6","5","1/2","6","6","6","2/5","1/3","2/5","3/6","5","3/6","1/3","2/5","3/6","3/8","3","3/6","3/6","5","6","1/3","5","3/8","1/2","2/5","6","1/5","3/6","1/4","6","3","4","6","3","3","1/4","6","3/8","1/4","3/6","1/2","1/2"]
["Spell Perception","Perception","In/Re","4/9","7","4/9","7","7","7","4/9","7","4/9","7","7","7","4/9","4/9","7","4/9","4/9","7","4/9","4/9","7","4/9","7","7","7","4/9","7","7","7","4/9","7","4/9","7","7","7","4/9","4/9","4/9","4/9","4/9","4/9","4/9","4/9","4/9","7","7","7","4/9","7","7","4/9","7","7","4/9","4/9","7","4/9","7","4/9","7","7","7","7","7","7","4/9","7","7","4/9","4/9","4/9","5/10"]
["Surveillance","Perception","In/Sd","2/6","1/3","2/6","1/4","2/6","3/6","2/5","2/6","3/6","1/3","1/4","2/5","2/6","2/6","2/6","3/5","2/6","2/3","2/6","3/6","2/5","2/6","2/6","2/5","2/5","2/6","3/6","3/6","1/4","2/5","1/4","2/5","2/5","2/5","2/5","2/6","2/6","2/6","2/6","1/4","2/6","2/5","2/6","1/2","2/6","1/4","2/6","2/6","1/4","2/5","2/4","1/4","2/3","1/5","2/6","2/5","2/6","1/2","2/6","2/5","2/5","1/2","1/4","2/5","2/5","2/3","4","2/5","2/6","2/6","2/6","2/6"]
["Time Sense","Perception","In/Re","1/3","2/5","1/2","2/4","1/3","3/6","1/3","2/6","3/5","1/3","1/4","2/5","1/4","1/4","2/6","1/4","1/3","1/4","2/4","1/4","2/5","1/4","2/6","2/5","2/5","1/4","1/2","1/4","2/4","1/3","2/4","1/4","2/5","2/5","2/5","1/3","1/4","1/3","1/4","2/4","2/4","1/3","1/3","1/4","2/6","2/4","2/4","1/3","2/4","2/5","1/3","2/4","1/4","1/3","1/3","2/5","1/4","1/3","1/4","2/5","2/5","1/4","2/4","1/4","1/4","1/3","6","2/5","1/2","1/3","1/4","1/4"]
["Tracking","Perception","In/Re","3","1/4","3","1/4","2/4","1/4","2/6","2/6","1/2","1/2","1/3","1/4","2/6","3","2/6","2/7","2/5","2/5","2/6","1/4","1/4","3","2/6","2/5","1/4","3","3/5","6","1/4","2/6","1/4","3","1/4","1/4","1/4","3","3","3","2/6","1/4","2/6","2/4","3","3","2/6","1/4","2/6","2/5","1/4","1/4","2/6","2/5","2/4","1/5","3","1/4","2/5","1/5","3","2/8","1/4","1/3","2/4","1/3","1/3","2/5","6","2/5","3/6","2/5","3","3"]
["Diplomacy","Social","Pr/In","2/5","2/5","2/4","1/3","2/4","3/6","1/4","2/4","2/5","2/6","2/4","2/5","1/4","2/5","2/6","2/5","2/6","2/4","2/6","3/8","2/5","1/4","2/6","2/4","2/5","2/4","2/4","2/4","2/5","1/3","2/5","2/4","4/9","2/5","1/5","2/6","2/4","2/4","2/6","1/4","2/6","2/5","2/6","2/5","2/6","2/5","1/4","2/4","2/5","1/3","2/6","2/5","1/4","1/5","2/6","2/5","1/5","1/4","3/8","2/5","1/3","2/5","1/3","4/10","2/5","1/4","6","2/4","3/6","2/6","2/4","2/4"]
["Duping","Social","Pr","3/5","2/6","2/5","1/4","2/6","2/4","1/4","3/7","2/6","2/6","2/4","2/6","3/6","2/5","2/6","2/6","2/6","1/4","3/5","3/6","2/6","1/3","2/6","2/7","2/6","3/5","3/6","3/7","1/4","1/2","1/4","3/5","2/6","2/6","2/6","2/5","3/5","2/6","2/6","1/4","3/5","1/4","2/5","2/4","2/6","1/4","2/4","2/6","1/4","1/4","2/4","1/4","2/6","2/4","2/5","2/6","2/4","1/4","2/5","2/6","2/6","2/4","1/3","2/6","2/6","1/4","6","2/7","1/4","2/6","3/5","3/5"]
["Gambling","Social","Re/Pr","2/6","2/4","2/6","2/5","1/5","2/5","2/6","2/6","2/4","2/6","1/3","2/4","1/4","2/6","2/6","2/4","2/6","1/3","3/5","2/6","1/5","2/4","2/6","2/5","2/4","2/6","2/4","2/6","1/4","1/3","1/4","2/5","2/4","2/4","2/4","2/5","2/6","2/5","2/6","2/6","3/5","2/5","2/5","1/3","2/6","1/4","3/6","2/6","1/4","1/3","2/4","1/4","2/5","1/3","2/5","2/4","2/4","1/5","2/7","2/4","2/4","1/3","1/4","2/4","2/4","2/4","3/7","2/5","2/5","2/6","2/6","2/6"]
["Interrogation","Social","Ag/Re","4","3/9","3","2/7","3/5","2/6","1/4","7","2/4","1/3","2/7","1/5","2/5","3","2/6","2/4","2/6","2/5","3/6","1/5","3/9","1/4","2/6","2/5","3/9","3","3/7","7","2/7","1/2","2/7","2/5","3/9","3/9","2/6","2/5","3","2/5","3","1/4","3/6","2/4","2/5","1/2","2/6","1/3","1/4","2/4","2/7","3/9","2/5","2/7","3/6","2/4","2/5","3/9","2/5","1/2","1/4","3/9","3/9","2/6","3/5","4","4","1/4","6","3/7","2/4","2/6","3","3"]
["Intimidation","Social","Pr/Re","2/5","2/6","2/5","2/5","2/6","2/5","1/4","3/6","2/6","2/6","2/6","2/6","2/6","2/5","2/6","2/6","2/6","1/2","2/5","2/6","2/6","1/2","2/6","2/5","2/6","2/5","2/6","3/6","2/5","1/2/2","2/5","2/5","2/6","2/6","2/6","2/6","2/5","2/6","2/6","1/4","2/5","1/3","2/6","2/6","2/6","2/5","2/6","2/6","2/5","2/*","2/6","2/5","2/6","2/4","2/6","2/6","2/6","1/4","2/5","2/6","2/6","2/6","2/5","2/6","2/6","1/3","3","2/5","1/4","2/6","2/5","2/5"]
["Leadership","Social","Pr/Re","2/4","2/5","2/4","2/5","2/6","2/5","1/4","1/4","2/6","3/6","2/6","1/3","2/5","2/5","2/6","2/4","2/6","2/7","2/5","2/5","3/6","1/4","2/6","2/5","2/5","2/4","2/5","1/4","2/5","1/4","2/5","2/4","4/9","2/5","1/2","2/6","2/4","2/5","2/6","1/4","2/5","1/5","2/6","2/6","2/6","2/5","2/6","1/3","2/5","1/4","2/6","2/5","2/6","2/5","2/6","2/5","1/4","1/4","2/5","2/5","2/5","2/6","2/6","2/6","2/6","1/4","6","2/5","3/6","2/6","2/4","2/4"]
["Seduction","Social","Em/Pr/Ap","2/5","2/6","2/5","2/5","2/6","2/5","1/4","3/6","2/6","2/6","2/6","2/6","2/6","2/5","2/6","2/6","2/6","1/2","2/5","2/6","2/6","1/2","2/6","2/5","2/6","2/5","2/6","3/6","2/5","1/2/2","2/5","2/5","2/6","2/6","2/6","2/6","2/5","2/6","2/6","1/4","2/5","1/3","2/6","2/6","2/6","2/5","2/6","2/6","2/5","2/*","2/6","2/5","2/6","2/4","2/6","2/6","2/6","1/4","2/5","2/6","2/6","2/6","2/5","2/6","2/6","1/3","6","2/5","1/4","2/6","2/5","2/5"]
["Acting","Subterfuge","Em/Pr/Ap","3/6","2/6","3/6","1/3","2/7","2/6","1/5","2/5","2/6","2/6","2/5","3/6","2/7","3/5","2/6","2/6","2/6","2/5","2/6","2/7","2/6","1/3","2/6","3/6","2/6","3/6","2/7","2/5","1/3","1/3","1/3","1/3","2/6","2/6","2/6","2/5","3/6","2/6","2/6","1/2","2/6","1/2","2/5","2/5","2/6","1/3","3/6","2/6","1/3","1/4","2/6","1/3","2/5","2/6","2/5","2/6","2/7","1/5","2/7","2/6","2/6","2/5","1/3","4/10","2/5","1/4","6","3/6","2/7","2/6","3/6","3/6"]
["Begging","Subterfuge","Em/Pr/Ap","2/6","2/6","2/6","2/4","2/5","3/7","1/5","3/7","2/6","2/6","1/4","3/6","2/6","2/6","2/6","4","2/6","1/5","1/4","3/6","2/6","2/6","2/6","2/6","2/6","2/6","2/6","3/7","2/4","1/5","2/4","2/6","2/6","2/6","2/6","2/6","2/6","2/5","2/6","2/4","1/4","2/4","2/6","1/4","2/6","2/4","3/6","2/6","2/4","2/6","2/7","2/4","2/4","2/5","2/6","2/6","2/6","1/5","2/6","2/6","4/12","1/4","1/4","2/6","2/6","2/6","6","2/6","2/6","2/6","2/6","2/6"]
["Bribery","Subterfuge","Pr/Re/Ap","2/6","2/6","2/6","1/4","2/5","3/7","1/5","3/8","2/6","2/6","1/3","3/6","2/6","2/6","2/6","2/4","2/6","1/4","3/6","3/6","2/6","1/4","2/6","2/6","2/6","2/6","2/6","3/8","2/4","1/5","2/4","2/6","2/6","2/6","2/6","2/6","2/6","2/5","2/6","2/4","3/6","2/4","2/6","1/4","2/6","2/4","3/6","2/6","2/4","2/6","1/5","2/4","2/4","2/5","2/6","2/6","2/6","1/5","2/6","2/6","4/10","1/4","1/3","2/6","2/6","1/4","6","2/6","2/6","2/6","2/6","2/6"]
["Camouflage","Subterfuge","Re/In","6","2/5","5","1/3","6","1/4","2/7","3/5","2/5","1/5","3/7","2/5","5","5","2/6","4","1/5","2/6","2/6","2","2/5","3","2/6","2/7","2/5","5","6","3/5","1/3","2/4","1/3","3","2/5","2/5","2/5","6","5","5","2/7","1/3","2/6","2","6","1/3","2/6","1/3","2/5","1/4","1/3","2/5","6","1/3","3/7","6","6","2/5","6","2/7","6","2/5","2/5","1/3","2/5","2/4","2/4","3","6","2/7","6","1/5","5","5"]
["Disarm Traps","Subterfuge","In/Ag","4","3/8","7","2/5","7","2/5","4","3/8","2/6","4","1/3","7","7","7","3/9","6","4","3","5","7","4","8","6","4","3/8","7","8","3/6","2/5","6","2/5","8","3/8","3/8","3","5","7","7","4","2/6","6","7","7","3/7","3/6","1/3","7","4","2/5","4","8","2/6","3/9","7","8","3/8","7","3/6","7","3/8","3/8","1/3","3/6","3/9","3/9","7","6","4","8","4","7","7"]
["Disguise","Subterfuge","Pr/Sd","3/6","2/6","3/6","1/3","2/7","3/7","1/5","1/4","2/6","2/6","1/3","3/6","2/7","3/6","2/6","5","2/6","1/3","2/6","2/7","2/6","1/3","2/6","2/6","2/6","3/6","2/7","1/4","2/5","1/3","2/5","1/3","2/6","2/6","2/6","2/7","3/6","2/6","2/6","1/3","2/6","1/2","2/7","1/3","2/6","1/3","3/6","2/6","2/5","2/6","2/7","2/5","2/7","2/6","2/7","2/6","2/7","1/5","2/7","2/6","6","1/3","1/4","2/5","2/5","2/5","6","2/6","2/7","2/6","3/6","3/6"]
["Falsification","Subterfuge","Sd/Re","1/3","3","3","2/4","3","3","3","6","3","3","1/3","6","3","3","2/6","4","3","1/5","5","3","3","2/4","2/6","3","3","3","3","6","2/4","2/5","2/4","2/4","3","3","3","3","3","3","3","2/4","5","2/4","3","1/3","2/6","2/4","6","3","2/4","3","2/4","2/4","1/3","3","3","3","3","1/5","3","3","3","1/3","1/4","1/4","1/4","2/6","6","3","3","3","3","3"]
["Hide Item","Subterfuge","Re/In","6","2/5","5","1/3","6","2/5","2/7","2/4","2/5","1/5","1/3","3","5","5","2/6","2/6","1/5","1/4","3","3","2/5","3","2/6","3/6","2/5","5","6","2/4","1/3","2/7","1/3","3","2/5","2/5","2/5","6","5","5","2/7","1/3","3","2","6","1/3","2/6","1/3","3","1/5","1/3","2/5","6","1/3","2/6","6","6","2/5","4","2/7","6","2/5","2/5","1/3","1/4","2/4","2/4","2/5","6","3/6","6","1/5","5","5"]
["Jesting","Subterfuge","Pr/Re","2/5","2/6","2/5","2/5","2/6","2/5","1/4","3/6","2/6","2/6","2/6","2/6","2/6","2/5","2/6","2/6","2/6","1/2","2/5","2/6","2/6","1/2","2/6","2/5","2/6","2/5","2/6","3/6","2/5","1/2/2","2/5","2/5","2/6","2/6","2/6","2/6","2/5","2/6","2/6","1/4","2/5","1/3","2/6","2/6","2/6","2/5","2/6","2/6","2/5","2/*","2/6","2/5","2/6","2/4","2/6","2/6","2/6","1/4","2/5","2/6","2/6","2/6","2/5","2/6","2/6","1/3","6","2/5","1/4","2/6","2/5","2/5"]
["Mimery","Subterfuge","Ag/Sd","3/6","2/6","3/6","1/3","2/7","2/6","1/5","2/5","2/6","2/6","2/5","3/6","2/7","3/6","2/6","3/6","2/6","2/5","2/7","2/7","2/6","1/3","2/6","2/6","2/6","3/6","2/7","2/5","1/3","1/5","1/3","1/3","2/6","2/6","2/6","2/7","3/6","2/6","2/6","1/3","2/7","1/2","2/7","2/5","2/6","1/3","3/6","2/6","1/3","2/6","3/6","1/3","2/5","2/6","2/7","2/6","2/7","1/5","2/7","2/6","2/6","2/5","1/4","2/5","2/5","2/5","6","2/6","2/7","2/6","3/6","3/6"]
["Pick Locks","Subterfuge","In/Re/Ag","4","3/9","7","2/5","7","4","4","3/8","2/5","3/6","1/3","7","8","8","3/9","4","4","1/4","6","8","4","8","5","5","3/9","8","8","6","2/6","6","2/6","8","3/9","3/9","3","5","8","8","4","2/6","8","7","7","2/7","3/6","2/6","7","4","2/6","4","8","2/6","3/7","7","8","3/9","8","3/6","7","3/9","3/9","1/3","3/6","3/9","3/9","7","6","5","8","4","8","8"]
["Pick Pockets","Subterfuge","Ag/In","3","3/6","3","1/3","3","2/6","2/4","4","2/6","2/5","1/3","4","3","3","2/6","3","2/5","2/4","2/5","3","3/6","3","2/6","3/5","3/6","3","3","4","1/3","1/5","1/3","1/5","3/6","3/6","3/6","3","3","3","2/5","1/3","2/5","2/5","3","1/3","2/6","1/3","4","2/5","1/3","3/6","3","1/3","2/5","2/5","3","3/6","3","2/4","3","3/6","3/6","1/2","1/3","2/5","2/5","3","6","3/5","3","2/5","3","3"]
["Set Traps","Subterfuge","Re/Ag","4","2/4","7","2/5","7","2/4","4","3/7","2/4","1/3","1/3","7","7","2/5","2/6","6","4","2/6","6","2/4","3/8","8","1/5","4","3/8","7","8","3/7","2/5","4","1/3","8","3/8","3/8","3/8","7","7","7","4","2/5","6","7","7","1/3","2/6","2/5","7","2/4","2/5","3/8","7","2/5","3/6","7","7","3/8","7","4","7","3/8","3/8","1/3","2/5","3/9","3/9","6","6","4","2/5","2/4","7","7"]
["Stalk & Hide","Subterfuge","Ag/Sd","6","2/5","5","1/3","6","1/5","2/7","3/8","1/4","1/4","1/3","5","5","5","3/9","5","1/5","1/4","3","3/7","3/9","3","2/7","3/7","2/5","5","6","1/5","1/3","2/5","1/3","3","2/5","2/5","2/6","2/5","5","5","2/7","2/5","4","2","6","1/5","2/6","1/3","5","1/4","1/3","3/9","5","2/4","3","6","2","2/5","3","2/5","6","2/5","2/5","1/3","2/5","2/4","2/4","3","6","2/7","5","2/5","5","5"]
["Taunting","Subterfuge","In","4","3/8","7","2/5","7","2/5","4","3/8","2/6","4","1/3","7","7","7","3/9","6","4","3","5","7","4","8","6","4","3/8","7","8","3/6","2/5","6","2/5","8","3/8","3/8","3","5","7","7","4","2/6","6","7","7","3/7","3/6","1/3","7","4","2/5","4","8","2/6","3/9","7","8","3/8","7","3/6","7","3/8","3/8","1/3","3/6","3/9","3/9","7","6","4","8","4","7","7"]
["Trapbuilding","Subterfuge","Re/Em","1/5","2/6","3/6","2/4","3/6","2/6","2/6","6","2/6","2/5","2/4","3/6","3/6","3/6","2/4","3/6","2/5","2/6","2/6","2/5","2/6","3/6","2/6","2/6","2/6","3/6","4","6","4","2/6","2/6","2/6","2/6","2/6","2/6","2/5","3/6","3/6","4","1/3","2/6","3/6","3/6","2/6","2/6","4","3/6","4","2/5","2/6","3/6","4","3/6","3/6","3/6","2/6","2/6","2/6","3/6","4","2/6","2/5","4","4","4","3/5","6","2/7","2/6","2/5","3/6","3/6"]
["Trickery","Subterfuge","Pr/Qu","3","2/6","3","1/3","3","2/6","2/4","2/5","2/6","2/5","1/2","3","3","3","2/6","4","2/5","1/4","3","3","2/6","1/4","2/6","3/6","2/6","3","3","2/5","1/3","1/5","1/3","1/4","2/6","2/6","2/6","3","3","3","2/5","1/3","3","1/5","3","1/2","2/6","1/3","3","2/5","1/3","2/6","3","1/3","2/6","1/5","3","2/6","3","2/4","3","2/6","2/6","1/2","1/4","1/4","1/4","2/6","6","3/6","3","2/5","3","3"]
["Caving","Survivial","Sd/Re","3","2/6","3","2/4","3","2/6","2/6","6","2/6","2/6","1/4","2/6","2/7","3","2/6","1/3","2/7","2/6","2/6","2/7","2/6","3","2/6","3/7","2/6","3","2/7","6","2/4","2/6","4/8","3","2/6","2/6","2/6","2/5","3","3","2/6","2/4","2/6","3","2/5","3/6","2/6","4/8","3/6","2/6","2/4","2/6","3","2/4","2/6","1/2","2/5","2/6","2/7","2/6","3","2/6","2/6","1/4","2/6","2/5","2/5","3","6","3/7","2/7","2/6","3","3"]
["Fire Starting","Survivial","Re/Ag","2/5","1/4","2/6","2/5","2/6","1/2","2/6","2/5","1/4","1/3","2/6","2/6","2/5","2/6","1/5","2/6","2/5","2/6","2/4","1/3","2/6","2/6","1/5","2/6","2/6","2/6","2/5","6","1/4","2/6","1/2","2/7","2/6","2/6","2/6","2/6","2/6","2/6","2/6","2/5","2/4","2/6","2/6","2/6","2/6","1/3","2/6","1/3","1/5","2/6","2/6","2/5","2/6","2/5","2/6","2/6","1/5","2/6","2/6","2/6","2/6","1/3","1/5","2/6","2/6","2/6","6","2/6","1/5","1/3","2/6","2/7"]
["Foraging","Survivial","In/Re","2/5","2/6","2/6","2/5","2/6","2/6","2/6","6","1/4","1/3","2/6","2/6","2/5","2/6","2/6","2/6","2/5","2/6","2/4","1/5","2/6","2/6","2/6","2/6","2/6","2/6","2/5","6","2/5","2/6","2/5","2/7","2/6","2/6","2/6","2/6","2/6","2/6","2/6","2/5","2/4","2/6","2/6","2/6","2/6","1/3","2/6","1/3","2/5","2/6","2/6","2/5","2/6","1/4","2/6","2/6","2/5","2/6","2/6","2/6","2/6","2/6","2/5","2/6","2/6","2/6","6","2/6","2/5","1/3","2/6","2/6"]
["Hostile Environment","Survivial","Ag/Sd","3","2/8","3","1/4","3","1/3","3/6","2/3","2/5","2/4","3/6","1/4","3","3","2/6","3","3","2/6","3/5","1/4","1/4","2/7","2/6","2/4","1/4","3","3","2/3","1/4","3/6","1/4","3","1/2","1/4","1/4","3","3","3","3/6","1/4","3/5","2/7","3","3/6","2/6","1/4","2/6","2/4","1/4","1/4","3","1/4","2/7","3","3","1/4","2/4","3/6","2/7","1/4","1/4","2/6","1/4","1/3","2/5","3","6","2/4","2/5","2/4","3","3"]
["Region Lore","Survivial","Re","2/5","2/6","2/6","2/5","2/6","2/6","2/6","2/6","1/3","1/3","2/6","2/6","2/5","2/6","2/6","2/4","2/5","2/6","2/6","1/5","2/6","2/6","1/4","2/6","2/6","2/6","2/5","2/6","2/5","2/6","1/3","2/7","2/6","2/6","2/6","2/6","2/6","2/6","2/6","2/5","2/6","2/6","2/6","2/6","2/6","2/5","2/6","1/3","2/5","2/6","1/2","2/5","1/4","1/4","2/6","2/6","2/5","2/6","2/6","2/6","2/6","2/6","2/5","2/6","2/6","2/5","3","2/6","2/5","1/3","2/6","2/6"]
["Scrounge","Survivial","In/Re","2/5","2/6","2/6","1/3","2/6","2/6","2/6","3/7","2/6","1/5","1/4","2/6","2/5","2/6","2/6","2/4","2/5","1/3","2/6","1/5","2/6","2/6","2/6","2/6","2/6","2/6","2/5","3/7","1/3","2/6","2/6","2/7","2/6","2/6","2/6","2/6","2/6","2/6","2/6","1/3","2/6","2/6","2/6","1/4","2/6","1/3","2/6","2/6","1/3","2/6","1/2","1/3","2/5","1/4","2/6","2/6","2/5","2/6","2/6","2/6","2/6","1/4","1/4","2/5","2/5","2/5","6","2/6","2/5","2/6","2/6","2/6"]
["Streetwise","Survivial","Pr/In","2/7","1/4","3/6","1/3","2/3","3/8","1/4","4","3/6","1/4","1/2","1/4","2/6","2/7","2/4","3/7","2/6","1/3","1/4","3/7","1/4","1/3","2/4","2/5","1/4","3","2/7","4","1/3","1/4","1/3","3/6","1/4","1/4","1/4","2/5","3","2/5","3/7","1/3","1/4","1/3","2/5","1/3","2/4","1/3","4","3/8","1/3","1/4","2/4","1/3","1/4","1/4","2/5","1/4","2/4","1/3","1/4","1/4","1/4","1/2","1/4","2/4","2/4","2/3","6","2/5","1/4","3/8","3","3"]
["Indexnr för att kunna leta upp kolumn",null,null,"4","6","7","10","12","13","14","15","16","17","18","19","21","22","24","26","27","28","30","34","35","37","38","94","39","40","43","44","45","46","47","48","49","50","52","53","54","59","60","61","62","63","64","65","66","68","69","71","72","73","75","76","77","79","80","81","82","83","84","85","87","88","89","90","91","92","93","94","95","96","97","97"]

{"sheet":"2nd","index":10,"n_rows":18,"n_cols":96,"rows_kept":18,"cut":false,"hidden":false,"merged":[]}
["Profession","Alchemist","Animist","Archer","Archmage","Arcist","Arms Master","Assassin","Astral Traveller","Astrologer","Barbarian","Bard","Bashkar","Beastmaster","Bounty Hunter","Burglar","Cavalier","Chaotic Lord","Channeler","Conjuror","Crafter","Craftsman","Creator","Crystal mage","Cultist","Dancer","Delver","Dervish","Doppelgänger","Dream Lord Illusionist","Dream Lord Shaman","Druid","Duelist","Elementalist","Enchanter","Farmer","Feldsher","Fighter","Forcemage","Free Thinker","Gypsy","Healer","High War monk","Horseman","Houri","Hunter","Illusionist","Indurate","Lancer","Lay Healer","Leader","Macabre","Magician","Magus Chan","Magus Chan/Ess","Magus Ess","Maleficant","Mentalist","Monk","Montebanc","Moon Mage","Mystic","Necromancer","Nightblade","No Profession","Noble Warrior","Outrider","Paladin","Ranger (old)","Ranger","Rogue","Romantic","Runemaster","Sage","Sailor","Scholar","Seeker","Seer","Shadow Mage","Shaikan","Shaman","Sleuth","Sorceror","Swordsman","Tarotmage","Templar","Thief","Trader","Trench Fighter","War Monk","Warlock","Warrior","Warrior Mage","Witch","Witch Hunter","Wizard"]
["Academic",34,17,8,34,32,9,12,29,34,8,23,6,10,12,10,16,12,19,34,26,16,25,22,17,9,23,11,13,18,18,15,14,22,22,12,16,14,29,33,10,22,8,10,11,8,23,10,10,22,16,30,30,30,30,30,25,30,18,16,22,30,25,9,20,9,12,16,12,12,10,14,24,38,8,40,32,26,25,12,22,16,30,8,17,18,10,13,11,10,26,6,16,24,14,30]
["Animal",0,9,5,0,0,2,0,0,0,8,0,0,9,4,0,5,0,0,0,0,4,0,0,0,0,3,0,3,0,0,11,2,0,0,12,3,5,0,2,6,2,0,8,1,9,0,0,7,2,5,0,0,0,0,0,5,0,0,2,0,0,0,0,5,2,8,4,7,7,4,1,0,0,0,0,0,0,0,3,7,1,0,5,0,5,4,6,4,5,0,3,2,7,6,0]
["Athletic",0,0,5,0,0,5,9,0,0,10,0,12,7,8,8,8,4,0,0,3,6,0,0,2,15,6,15,0,0,0,1,12,5,7,6,6,10,0,3,6,0,9,8,5,7,0,10,6,0,10,3,0,0,0,0,0,0,6,5,6,0,0,11,5,3,6,4,11,11,8,5,0,0,10,0,0,0,0,7,0,3,0,10,0,6,8,3,12,9,0,8,6,1,5,0]
["Combat",0,0,15,0,0,11,12,0,0,24,9,28,12,14,12,22,6,4,0,0,2,0,0,15,8,3,8,0,0,0,3,21,10,0,8,16,18,0,0,6,0,15,18,7,11,0,25,18,0,14,8,0,0,0,0,0,0,12,10,9,0,0,12,10,11,12,18,12,12,16,16,0,0,16,0,0,0,0,18,0,12,0,20,0,18,13,10,21,13,0,26,14,0,14,0]
["Concentration",1,4,12,4,8,2,8,10,6,14,1,16,2,4,4,7,3,3,5,3,0,7,5,6,8,4,8,7,8,8,4,12,6,8,2,6,8,5,9,4,7,20,2,2,10,5,14,9,8,6,3,5,5,5,5,5,14,10,6,5,10,5,9,5,2,0,6,3,3,6,10,5,7,2,5,5,10,5,15,6,2,5,10,4,8,3,0,11,11,5,12,5,5,6,8]
["Deadly",0,0,4,0,0,0,9,0,0,0,0,0,0,3,4,0,0,0,0,0,0,0,0,2,3,0,5,0,0,0,0,0,0,0,0,3,1,0,0,3,0,2,0,5,0,0,0,0,0,0,0,0,0,0,0,0,0,0,0,0,0,1,5,0,0,2,0,2,2,3,0,0,0,0,0,0,0,1,0,0,0,0,0,0,0,6,0,1,1,0,0,0,0,0,0]
["Evaluation",10,2,3,2,3,2,3,2,2,0,8,3,2,2,8,6,2,4,2,14,8,2,6,2,2,8,0,3,2,2,2,6,8,4,2,2,2,4,4,8,2,0,0,2,2,2,0,2,2,6,2,8,6,6,6,2,2,0,7,3,2,2,3,2,2,2,2,2,2,6,2,2,4,4,5,9,2,2,3,2,6,0,3,6,4,8,13,3,0,2,2,2,2,2,4]
["General",12,8,6,5,5,5,3,3,3,5,12,3,10,6,3,3,2,10,3,15,16,3,6,7,3,14,3,6,3,3,5,6,5,6,18,4,3,5,3,10,6,4,7,7,13,3,3,6,6,3,2,3,3,3,3,3,3,5,2,2,3,6,2,20,2,5,2,9,9,6,9,3,3,12,11,6,3,6,6,6,2,2,6,10,6,3,10,3,4,3,6,2,9,6,3]
["Gymnastic",0,3,4,0,0,3,9,0,0,10,3,8,6,5,10,4,3,0,0,0,2,0,0,6,19,4,15,0,0,0,3,8,3,0,4,3,8,0,0,6,0,18,6,3,3,0,10,6,0,6,0,0,0,0,0,0,0,12,2,3,0,0,12,2,0,3,3,3,3,8,6,0,0,9,0,0,0,0,14,3,3,0,6,0,4,7,0,8,18,0,6,3,0,3,0]
["Linguistic",3,3,5,6,6,3,5,3,6,0,13,0,3,5,3,4,3,6,8,3,3,3,3,3,6,13,3,5,3,3,3,0,3,10,3,3,3,3,6,8,3,3,3,6,3,8,0,3,3,4,3,3,3,3,3,3,5,3,6,5,5,3,4,2,4,7,5,3,3,3,8,5,14,6,14,6,8,3,3,3,3,5,2,3,6,3,7,3,3,3,1,3,6,4,3]
["Magical",26,20,0,36,33,8,0,14,26,0,12,0,12,0,0,0,8,22,36,8,0,14,26,12,0,8,12,18,14,14,20,0,18,20,0,12,0,26,0,1,21,0,0,12,0,22,0,0,21,0,28,30,30,30,30,24,22,12,12,20,22,26,12,0,8,0,12,12,12,0,0,18,20,0,0,18,24,26,0,26,12,32,0,18,0,0,0,0,0,26,0,14,20,12,30]
["Medical",0,10,5,2,2,2,2,2,2,2,0,2,4,2,2,5,2,10,0,2,4,2,8,6,5,3,3,2,2,2,13,2,0,2,6,11,4,0,2,6,23,6,7,4,4,2,5,8,23,5,2,2,2,2,2,8,2,6,2,1,2,11,2,2,3,6,7,4,4,2,0,2,1,2,6,0,0,11,2,7,5,3,5,5,5,1,2,2,6,2,6,2,9,4,2]
["Perception",5,10,8,2,2,2,6,0,8,6,3,4,6,12,8,6,2,10,5,2,8,0,10,6,5,3,3,2,0,0,8,0,8,5,6,4,7,10,0,5,6,3,10,9,12,10,5,8,6,7,0,4,4,4,4,6,6,4,10,5,10,3,8,8,2,12,5,8,8,7,4,5,3,6,3,13,14,3,8,3,10,3,6,0,5,8,7,6,5,11,6,6,5,10,6]
["Social",0,0,2,0,0,2,5,0,0,0,8,0,0,4,3,10,0,7,2,0,4,0,0,6,3,8,7,0,0,0,0,6,0,9,0,2,5,2,3,3,0,0,0,10,0,0,3,0,0,8,4,2,2,2,2,4,6,2,6,3,6,4,3,8,2,8,6,0,0,3,10,0,0,2,1,0,0,4,0,3,8,7,2,0,8,1,6,0,0,12,2,6,1,2,2]
["Subterfuge",2,4,8,0,0,0,8,0,0,0,6,3,6,7,13,0,2,0,0,0,6,0,0,5,4,3,3,5,0,0,3,0,0,0,4,0,0,3,2,12,0,0,6,10,8,13,2,4,0,4,5,3,3,3,3,2,4,2,14,4,3,0,8,8,0,12,0,5,6,9,2,0,0,9,1,1,0,0,6,0,7,0,6,0,0,13,9,0,2,0,0,6,4,6,3]
["Survival",2,5,8,2,2,4,7,3,3,6,3,6,6,7,7,0,4,2,0,3,3,3,6,0,2,6,1,3,3,3,5,3,3,1,7,2,6,3,3,2,2,2,8,1,6,3,5,8,3,4,4,0,3,3,3,7,0,3,4,3,0,4,0,3,3,6,4,6,8,4,3,3,3,6,5,2,3,4,3,6,4,3,3,3,3,6,4,6,4,3,6,3,4,8,0]
["SUMMA",{"$f":"SUM(B2:B17)","v":95},95,98,93,93,60,98,66,90,93,101,91,95,95,95,96,53,97,95,79,82,59,92,95,92,109,97,67,53,53,96,92,{"$f":"SUM(AH2:AH17)","v":91},94,90,{"$f":"SUM(AK2:AK17)","v":93},94,90,70,96,94,90,93,95,96,91,92,95,96,98,94,90,91,91,91,94,94,95,104,91,93,90,100,100,53,{"$f":"SUM(BO2:BO17)","v":101},94,99,102,95,90,67,93,92,91,92,90,90,100,94,94,90,92,66,96,94,90,91,91,93,90,90,97,102,91]