{"text_format":"1","workbook":"xlsx","n_sheets":11,"sheets":["Info","Ny NPC","Secondary","Bonuses","Items","Spells","Rasbonus","Diverse","Levelbonus","AllaSkills","2nd"],"not_rendered":{"charts":0,"images":2,"macros":1,"external_links":0,"defined_names":20,"comments":4,"pivot_tables":0},"unopened":[],"bounds":{"document_bytes":16777216,"sheet_cells":100000,"rows_first":2000,"rows_last":500,"rows_between":2000,"halvings":0,"cell_chars":16384,"cell_head_chars":4096},"cells_cut":0,"cells_raw":0,"read":"whole","date_system":"1900"}

{"sheet":"Info","index":0,"n_rows":24,"n_cols":1,"rows_kept":24,"cut":false,"hidden":false,"merged":[[9,0,11,0],[23,0,24,0],[3,0,5,0]]}
[]
[]
["Character generator, ver 1.0 Middle-Earth edition"]
["Jag tog den av Charlie och förädlade den. Välkommen till 2011, nu kan vi göra rollpersoner i datan. Jag har ändrat och lagt till mycket och glömt bort att skriva versioninfo tyvärr, så ja…  men allt funkar. Tror jag."]
[]
[]
{"$rows_left_out":19}
{"sheet":"Ny NPC","index":1,"n_rows":73,"n_cols":28,"rows_kept":73,"cut":false,"hidden":false,"merged":[[10,17,13,17],[16,17,17,17],[19,35,19,36],[61,10,62,13],[71,15,71,17],[62,15,62,17],[67,15,67,17],[68,15,68,17],[69,15,69,17],[70,15,70,17],[63,15,63,17],[64,15,64,17],[65,15,65,17],[66,15,66,17]]}
[]
[1,"Cost",1,"Hur ofta sätter du ut kryss?","Rank","Cost1","Cost2","Cost",null,"Skill","Stat","Lvl","Ras","Misc","Item","Total",null,"Character Name",null,null,"Temp","Dev","Pot","Stat","Ras","B.O","Spec","Tot"]
["AM Balance",{"$f":"VLOOKUP(A3,AllaSkills!$A$3:$BV$317,$A$2+3,FALSE)","v":"6"},0,{"$f":"INDEX(Diverse!$H$1:$H$5,$C3+1)","v":"Nada"},{"$f":"ROUND(Level*(C3/2),0)+VLOOKUP($A3,Rasbonus!$A$29:$AJ$59,MATCH(Ras,Rasbonus!$A$1:$AJ$1,0),FALSE)","v":0},{"$f":"IF(LEN(B3)=3,LEFT(B3,1),IF(LEN(B3)<3,B3,99))","v":"6"},{"$f":"IF(RIGHT(B3,1)=\"*\",LEFT(B3,1),IF(LEN(B3)=3,RIGHT(B3,1),IF(LEN(B3)<3,B3,RIGHT(B3,2))))","v":"6"},{"$f":"IF(D3=\"Ett varannan level\",F3+F3-F3,IF(D3=\"Ett varje level\",2*F3,IF(D3=\"Tre på två levlar\",F3+G3+F3,IF(D3=\"Nada\",0,F3+G3+F3+G3))))","v":0},{"$f":"HLOOKUP(Yrke,Levelbonus!$B$1:$CR$20,6,0)","v":0},{"$f":"IF(E3<1,-25,IF(E3>30,80+((E3-30)*0.5),IF(E3>20,70+(E3-20),IF(E3>10,50+((E3-10)*2),E3*5))))","v":-25},{"$f":"ROUND((AG+SD)/2,0)","v":5},{"$f":"IF(Level<21,Level*I3,IF(I3>2,60+(Level-20),IF(I3=2,40+((Level-20)*0.5),IF(Level=0,0,IF(I3=0,0,20)))))","v":0},{"$f":"IF(ISNUMBER(VLOOKUP($A3,Rasbonus!$A$61:$AJ$295,MATCH(Ras,Rasbonus!$A$1:$AJ$1,0),FALSE)),VLOOKUP($A3,Rasbonus!$A$61:$AJ$295,MATCH(Ras,Rasbonus!$A$1:$AJ$1,0),FALSE),0)","v":0},{"$f":"IF($AB$58>16,$P$23,IF($AB$58>12,$P$22, IF($AB$58>8,$P$21,IF($AB$58>4,$P$20,\"0\"))))","v":"0"},null,{"$f":"SUM(J3:O3)","v":-20},null,"Yrke",null,"Constitution",75,{"$f":"VLOOKUP(U3,Diverse!$A$2:$C$131,3,0)","v":7},null,{"$f":"VLOOKUP(U3,Diverse!$A$2:$B$131,2,0)","v":5},{"$f":"HLOOKUP(Ras,Rasbonus!$B$1:$AJ$12,2,0)","v":15},null,null,{"$f":"SUM(X3:AA3)","v":20}]
["AM Landing",{"$f":"VLOOKUP(A4,AllaSkills!$A$3:$BV$317,$A$2+3,FALSE)","v":"6"},0,{"$f":"INDEX(Diverse!$H$1:$H$5,$C4+1)","v":"Nada"},{"$f":"ROUND(Level*(C4/2),0)","v":0},{"$f":"IF(LEN(B4)=3,LEFT(B4,1),IF(LEN(B4)<3,B4,99))","v":"6"},"6",{"$f":"IF(D4=\"Ett varannan level\",F4+F4-F4,IF(D4=\"Ett varje level\",2*F4,IF(D4=\"Tre på två levlar\",F4+G4+F4,IF(D4=\"Nada\",0,F4+G4+F4+G4))))","v":0},{"$f":"HLOOKUP(Yrke,Levelbonus!$B$1:$CR$20,6,0)","v":0},{"$f":"IF(E4<1,-25,IF(E4>30,80+((E4-30)*0.5),IF(E4>20,70+(E4-20),IF(E4>10,50+((E4-10)*2),E4*5))))","v":-25},{"$f":"ROUND((AG+SD)/2,0)","v":5},0,{"$f":"IF(ISNUMBER(VLOOKUP($A4,Rasbonus!$A$61:$AJ$295,MATCH(Ras,Rasbonus!$A$1:$AJ$1,0),FALSE)),VLOOKUP($A4,Rasbonus!$A$61:$AJ$295,MATCH(Ras,Rasbonus!$A$1:$AJ$1,0),FALSE),0)","v":0},{"$f":"IF($AB$58>16,$P$23,IF($AB$58>12,$P$22, IF($AB$58>8,$P$21,IF($AB$58>4,$P$20,\"0\"))))","v":"0"},null,{"$f":"SUM(J4:O4)","v":-20},null,null,null,"Agility",75,{"$f":"VLOOKUP(U4,Diverse!$A$2:$C$131,3,0)","v":7},null,{"$f":"VLOOKUP(U4,Diverse!$A$2:$B$131,2,0)","v":5},{"$f":"HLOOKUP(Ras,Rasbonus!$B$1:$AJ$12,3,0)","v":-5},null,null,{"$f":"SUM(X4:AA4)","v":0}]
["AM Leaping",{"$f":"VLOOKUP(A5,AllaSkills!$A$3:$BV$317,$A$2+3,FALSE)","v":"6"},0,{"$f":"INDEX(Diverse!$H$1:$H$5,$C5+1)","v":"Nada"},{"$f":"ROUND(Level*(C5/2),0)","v":0},{"$f":"IF(LEN(B5)=3,LEFT(B5,1),IF(LEN(B5)<3,B5,99))","v":"6"},"6",{"$f":"IF(D5=\"Ett varannan level\",F5+F5-F5,IF(D5=\"Ett varje level\",2*F5,IF(D5=\"Tre på två levlar\",F5+G5+F5,IF(D5=\"Nada\",0,F5+G5+F5+G5))))","v":0},{"$f":"HLOOKUP(Yrke,Levelbonus!$B$1:$CR$20,6,0)","v":0},{"$f":"IF(E5<1,-25,IF(E5>30,80+((E5-30)*0.5),IF(E5>20,70+(E5-20),IF(E5>10,50+((E5-10)*2),E5*5))))","v":-25},{"$f":"ROUND((AG+SD)/2,0)","v":5},0,{"$f":"IF(ISNUMBER(VLOOKUP($A5,Rasbonus!$A$61:$AJ$295,MATCH(Ras,Rasbonus!$A$1:$AJ$1,0),FALSE)),VLOOKUP($A5,Rasbonus!$A$61:$AJ$295,MATCH(Ras,Rasbonus!$A$1:$AJ$1,0),FALSE),0)","v":0},{"$f":"IF($AB$58>16,$P$23,IF($AB$58>12,$P$22, IF($AB$58>8,$P$21,IF($AB$58>4,$P$20,\"0\"))))","v":"0"},null,-20,null,null,null,"Self Discipline",75,{"$f":"VLOOKUP(U5,Diverse!$A$2:$C$131,3,0)","v":7},null,{"$f":"VLOOKUP(U5,Diverse!$A$2:$B$131,2,0)","v":5},{"$f":"HLOOKUP(Ras,Rasbonus!$B$1:$AJ$12,4,0)","v":5},null,null,{"$f":"SUM(X5:AA5)","v":10}]
["AM Speed",{"$f":"VLOOKUP(A6,AllaSkills!$A$3:$BV$317,$A$2+3,FALSE)","v":"6"},0,{"$f":"INDEX(Diverse!$H$1:$H$5,$C6+1)","v":"Nada"},{"$f":"ROUND(Level*(C6/2),0)+VLOOKUP($A6,Rasbonus!$A$29:$AJ$59,MATCH(Ras,Rasbonus!$A$1:$AJ$1,0),FALSE)","v":0},"6","6",0,{"$f":"HLOOKUP(Yrke,Levelbonus!$B$1:$CR$20,6,0)","v":0},-25,{"$f":"ROUND((AG+SD)/2,0)","v":5},0,{"$f":"IF(ISNUMBER(VLOOKUP($A6,Rasbonus!$A$61:$AJ$295,MATCH(Ras,Rasbonus!$A$1:$AJ$1,0),FALSE)),VLOOKUP($A6,Rasbonus!$A$61:$AJ$295,MATCH(Ras,Rasbonus!$A$1:$AJ$1,0),FALSE),0)","v":0},{"$f":"IF($AB$58>16,$P$23,IF($AB$58>12,$P$22, IF($AB$58>8,$P$21,IF($AB$58>4,$P$20,\"0\"))))","v":"0"},null,-20,null,"Ras",null,"Reasoning",75,{"$f":"VLOOKUP(U6,Diverse!$A$2:$C$131,3,0)","v":7},null,{"$f":"VLOOKUP(U6,Diverse!$A$2:$B$131,2,0)","v":5},{"$f":"HLOOKUP(Ras,Rasbonus!$B$1:$AJ$12,5,0)","v":0},null,null,5]
{"$rows_left_out":68}
{"sheet":"Secondary","index":2,"n_rows":229,"n_cols":58,"rows_kept":229,"cut":false,"hidden":false,"merged":[]}
["Secondary Skills","Dev.pts per level","Cost 1","Cost 2","Grupp","Adolescence",null,"Annat","Level 1","Level 2","Level 3","Level 4","Level 5","Level 6","Level 7","Level 8","Level 9","Level 10","Level 11","Level 12","Level 13","Level 14","Level 15","Level 16","Level 17","Level 18","Level 19","Level 20","Total ranks","Skill","Stat","Levelbonus","Level","Racial","Armor mods.","Items","Total","Adolescence","Level 1","Level 2","Level 3","Level 4","Level 5","Level 6","Level 7","Level 8","Level 9","Level 10","Level 11","Level 12","Level 13","Level 14","Level 15","Level 16","Level 17","Level 18","Level 19","Level 20"]
["Academic",{"$f":"HLOOKUP(Diverse!$G$2,'2nd'!$B$1:$CR$18,2,FALSE)","v":34},null,null,null,{"$f":"SUM(AL3:AL38)","v":0},null,null,{"$f":"SUM(AM3:AM38)","v":0},0,0,0,0,0,0,0,0,0,0,0,0,0,0,0,0,0,0,0,"Rank","Skill","Stat",null,"Lvl","Race","Armor","Item","Total"]
["Administration",{"$f":"VLOOKUP(A3,AllaSkills!$A$2:$BV$317,'Ny NPC'!$A$2+3,FALSE)","v":"2/5"},{"$f":"IF(LEN(B3)=3,LEFT(B3,1),IF(LEN(B3)<3,B3,99))","v":"2"},{"$f":"IF(RIGHT(B3,1)=\"*\",LEFT(B3,1),IF(LEN(B3)=3,RIGHT(B3,1),IF(LEN(B3)<3,B3,RIGHT(B3,2))))","v":"5"},"Academic",null,null,null,null,null,null,null,null,null,null,null,null,null,null,null,null,null,null,null,null,null,null,null,{"$f":"SUM(F3:AB3)","v":0},{"$f":"IF(AC3<1,-25,IF(AC3>30,80+((AC3-30)*0.5),IF(AC3>20,70+(AC3-20),IF(AC3>10,50+((AC3-10)*2),AC3*5))))","v":-25},{"$f":"(RE+PR)/2","v":2.5},{"$f":"HLOOKUP(Yrke,Levelbonus!$B$1:$CR$20,2,FALSE)","v":3},{"$f":"AF3*Level","v":9},{"$f":"IF(ISNUMBER(VLOOKUP($A3,Rasbonus!$A$61:$AJ$295,MATCH(Ras,Rasbonus!$A$1:$AJ$1,0),FALSE)),VLOOKUP($A3,Rasbonus!$A$61:$AJ$295,MATCH(Ras,Rasbonus!$A$1:$AJ$1,0),FALSE),\"0\")","v":"0"},null,null,{"$f":"ROUND(AD3+AE3+AG3+AH3+AI3+AJ3,0)","v":-14},{"$f":"IF(F3>2,\"99\",IF(F3<1,0,IF(F3=1,$C3+$C3-$C3,IF(F3=2,$C3+$D3))))","v":0},{"$f":"IF(I3>2,\"99\",IF(I3<1,0,IF(I3=1,$C3+$C3-$C3,IF(I3=2,$C3+$D3))))","v":0},0,0,0,0,0,0,0,0,0,0,0,0,0,0,0,0,0,0,0]
["Alchemy",{"$f":"VLOOKUP(A4,AllaSkills!$A$2:$BV$317,'Ny NPC'!$A$2+3,FALSE)","v":"1/3"},"1",{"$f":"IF(RIGHT(B4,1)=\"*\",LEFT(B4,1),IF(LEN(B4)=3,RIGHT(B4,1),IF(LEN(B4)<3,B4,RIGHT(B4,2))))","v":"3"},"Academic",null,null,null,null,null,null,null,null,null,null,null,null,null,null,null,null,null,null,null,null,null,null,null,{"$f":"SUM(F4:AB4)","v":0},{"$f":"IF(AC4<1,-25,IF(AC4>30,80+((AC4-30)*0.5),IF(AC4>20,70+(AC4-20),IF(AC4>10,50+((AC4-10)*2),AC4*5))))","v":-25},{"$f":"(RE)","v":5},{"$f":"HLOOKUP(Yrke,Levelbonus!$B$1:$CR$20,2,FALSE)","v":3},9,{"$f":"IF(ISNUMBER(VLOOKUP($A4,Rasbonus!$A$61:$AJ$295,MATCH(Ras,Rasbonus!$A$1:$AJ$1,0),FALSE)),VLOOKUP($A4,Rasbonus!$A$61:$AJ$295,MATCH(Ras,Rasbonus!$A$1:$AJ$1,0),FALSE),\"0\")","v":"0"},null,null,{"$f":"ROUND(AD4+AE4+AG4+AH4+AI4+AJ4,0)","v":-11},{"$f":"IF(F4>2,\"99\",IF(F4<1,0,IF(F4=1,$C4+$C4-$C4,IF(F4=2,$C4+$D4))))","v":0},{"$f":"IF(I4>2,\"99\",IF(I4<1,0,IF(I4=1,$C4+$C4-$C4,IF(I4=2,$C4+$D4))))","v":0},{"$f":"IF(J4>2,\"99\",IF(J4<1,0,IF(J4=1,$C4+$C4-$C4,IF(J4=2,$C4+$D4))))","v":0},{"$f":"IF(K4>2,\"99\",IF(K4<1,0,IF(K4=1,$C4+$C4-$C4,IF(K4=2,$C4+$D4))))","v":0},{"$f":"IF(L4>2,\"99\",IF(L4<1,0,IF(L4=1,$C4+$C4-$C4,IF(L4=2,$C4+$D4))))","v":0},{"$f":"IF(M4>2,\"99\",IF(M4<1,0,IF(M4=1,$C4+$C4-$C4,IF(M4=2,$C4+$D4))))","v":0},{"$f":"IF(N4>2,\"99\",IF(N4<1,0,IF(N4=1,$C4+$C4-$C4,IF(N4=2,$C4+$D4))))","v":0},{"$f":"IF(O4>2,\"99\",IF(O4<1,0,IF(O4=1,$C4+$C4-$C4,IF(O4=2,$C4+$D4))))","v":0},{"$f":"IF(P4>2,\"99\",IF(P4<1,0,IF(P4=1,$C4+$C4-$C4,IF(P4=2,$C4+$D4))))","v":0},{"$f":"IF(Q4>2,\"99\",IF(Q4<1,0,IF(Q4=1,$C4+$C4-$C4,IF(Q4=2,$C4+$D4))))","v":0},{"$f":"IF(R4>2,\"99\",IF(R4<1,0,IF(R4=1,$C4+$C4-$C4,IF(R4=2,$C4+$D4))))","v":0},{"$f":"IF(S4>2,\"99\",IF(S4<1,0,IF(S4=1,$C4+$C4-$C4,IF(S4=2,$C4+$D4))))","v":0},{"$f":"IF(T4>2,\"99\",IF(T4<1,0,IF(T4=1,$C4+$C4-$C4,IF(T4=2,$C4+$D4))))","v":0},{"$f":"IF(U4>2,\"99\",IF(U4<1,0,IF(U4=1,$C4+$C4-$C4,IF(U4=2,$C4+$D4))))","v":0},{"$f":"IF(V4>2,\"99\",IF(V4<1,0,IF(V4=1,$C4+$C4-$C4,IF(V4=2,$C4+$D4))))","v":0},{"$f":"IF(W4>2,\"99\",IF(W4<1,0,IF(W4=1,$C4+$C4-$C4,IF(W4=2,$C4+$D4))))","v":0},{"$f":"IF(X4>2,\"99\",IF(X4<1,0,IF(X4=1,$C4+$C4-$C4,IF(X4=2,$C4+$D4))))","v":0},{"$f":"IF(Y4>2,\"99\",IF(Y4<1,0,IF(Y4=1,$C4+$C4-$C4,IF(Y4=2,$C4+$D4))))","v":0},{"$f":"IF(Z4>2,\"99\",IF(Z4<1,0,IF(Z4=1,$C4+$C4-$C4,IF(Z4=2,$C4+$D4))))","v":0},{"$f":"IF(AA4>2,\"99\",IF(AA4<1,0,IF(AA4=1,$C4+$C4-$C4,IF(AA4=2,$C4+$D4))))","v":0},{"$f":"IF(AB4>2,\"99\",IF(AB4<1,0,IF(AB4=1,$C4+$C4-$C4,IF(AB4=2,$C4+$D4))))","v":0}]
["Architecture",{"$f":"VLOOKUP(A5,AllaSkills!$A$2:$BV$317,'Ny NPC'!$A$2+3,FALSE)","v":"2/5"},"2","5","Academic",null,null,null,null,null,null,null,null,null,null,null,null,null,null,null,null,null,null,null,null,null,null,null,0,-25,{"$f":"(RE+EM)/2","v":2.5},{"$f":"HLOOKUP(Yrke,Levelbonus!$B$1:$CR$20,2,FALSE)","v":3},9,{"$f":"IF(ISNUMBER(VLOOKUP($A5,Rasbonus!$A$61:$AJ$295,MATCH(Ras,Rasbonus!$A$1:$AJ$1,0),FALSE)),VLOOKUP($A5,Rasbonus!$A$61:$AJ$295,MATCH(Ras,Rasbonus!$A$1:$AJ$1,0),FALSE),\"0\")","v":"0"},null,null,-14,0,0,0,0,0,0,0,0,0,0,0,0,0,0,0,0,0,0,0,0,0]
["Basic Mathematics",{"$f":"VLOOKUP(A6,AllaSkills!$A$2:$BV$317,'Ny NPC'!$A$2+3,FALSE)","v":"1/4"},"1","4","Academic",null,null,null,null,null,null,null,null,null,null,null,null,null,null,null,null,null,null,null,null,null,null,null,0,-25,{"$f":"(RE)","v":5},{"$f":"HLOOKUP(Yrke,Levelbonus!$B$1:$CR$20,2,FALSE)","v":3},9,{"$f":"IF(ISNUMBER(VLOOKUP($A6,Rasbonus!$A$61:$AJ$295,MATCH(Ras,Rasbonus!$A$1:$AJ$1,0),FALSE)),VLOOKUP($A6,Rasbonus!$A$61:$AJ$295,MATCH(Ras,Rasbonus!$A$1:$AJ$1,0),FALSE),\"0\")","v":"0"},null,null,-11,0,0,0,0,0,0,0,0,0,0,0,0,0,0,0,0,0,0,0,0,0]
{"$rows_left_out":224}
{"sheet":"Bonuses","index":3,"n_rows":31,"n_cols":16,"rows_kept":31,"cut":false,"hidden":false,"merged":[]}
[]
["Combat (Attacks)",null,null,null,"Statistics",null,null,null,"Most used skills",null,null,null,null,"Abilities & Drawbacks"]
["Attack","With what?","OB",null,"Statistic","Total","Current",null,"Skill","Bonus","Skill","Bonus",null,"Cost","Ability","Description"]
["Primary Attack","My magical mace",{"$f":"'Ny NPC'!$P30","v":21.666666666666664},null,"Hit Points",{"$f":"'Ny NPC'!$U43","v":25},null,null,"AM Speed",{"$f":"'Ny NPC'!$P6","v":-20},"General Perception",{"$f":"'Ny NPC'!$P17","v":13}]
["Secondary Attack","My extraordinary warhammer",{"$f":"'Ny NPC'!$P31","v":-16.25},null,"PP (incl. adder/multiplier)",{"$f":"'Ny NPC'!$P42","v":9},null,null,"AM Strength",{"$f":"'Ny NPC'!$P7","v":23}]
["Tert. Attack","My horrible crossbow",{"$f":"'Ny NPC'!$P32","v":12.5},null,"Initiative",{"$f":"'Ny NPC'!$B72","v":0}]
{"$rows_left_out":26}
{"sheet":"Items","index":4,"n_rows":353,"n_cols":15,"rows_kept":353,"cut":false,"hidden":false,"merged":[]}
[]
["#","Item","lbs","#","Item","lbs","#","Item","lbs","#","Item (not carried)",null,"#","Herbs & Potions"]
[0,"Example Dagger",null,1,"Delicious Cookie",null,0,"Example gold coins",null,0,"Horse",null,null,"Hit Point Recovery"]
[2,"Example Waterskin",null,10,"Example Torches",null,null,null,null,null,null,null,null,"Abaas","Leaf/Ingest"]
[null,null,null,null,null,null,null,null,null,null,null,null,null,"Akbutege","Leaf/Ingest"]
[null,null,null,null,null,null,null,null,null,null,null,null,null,"Arkasu","Sap/Apply"]
{"$rows_left_out":348}
{"sheet":"Spells","index":5,"n_rows":19,"n_cols":15,"rows_kept":19,"cut":false,"hidden":false,"merged":[]}
[]
["Known Spell Lists",null,null,null,"Favourite Spells or entire spell lists",null,null,null,null,null,"Favourite Spells"]
["Lvl","Spell list","Book",null,"Lvl","Spell","Book","A","Duration",null,"Lvl","Spell list","Book","A","Duration"]
[20,"Weapon enchantments","Öberg",null,13,"Hammerstrike II, x2 damage","Öberg",null,{"$f":"CONCATENATE(Level*2,\" rnd\")","v":"6 rnd"},null,1,"Sly ears","RMCII","x",{"$f":"CONCATENATE(Level*10*2,\" min\")","v":"60 min"}]
[10,"Earth law","SpLaw",null,16,"Eldritch weapon II","Öberg",null,{"$f":"CONCATENATE(Level,\" rnd\")","v":"3 rnd"},null,2,"Nightvision","RMCII",null,{"$f":"CONCATENATE(Level*10*2,\" min\")","v":"60 min"}]
[10,"Sense enhanchement","RMCII",null,3,"Stoneskin I, AT12","RMCVII",null,{"$f":"CONCATENATE(Level*2,\" rnd\")","v":"6 rnd"},null,3,"Smelling","RMCII","x","60 min"]
{"$rows_left_out":14}
{"sheet":"Rasbonus","index":6,"n_rows":295,"n_cols":36,"rows_kept":295,"cut":false,"hidden":false,"merged":[]}
[null,"Dwarf","Noldo (Academic)","Noldo (Martial)","Sinda","Silvan","Half-elf","Hobbit","Northman","Eothraim","Lesser Dunadan","Common (rural)","Common (city-folk)","Corsair","Dorwinadan","Wose","Woodman","Beorning","Greater Dunadan","Dunlending","Black Numenorean","Easterling","Sagath/Logath","Gathmarim","Variag","Orc","Uruk-Hai","Half-orc","Half-troll","Forest Troll","Stone Troll","Hill Troll","Snow Troll","Mountain Troll","Cave Troll","Olog-Hai"]
["Constitution",15,10,10,5,0,5,15,5,5,5,5,5,5,5,5,5,15,10,10,10,5,5,5,5,10,15,10,15,20,35,25,30,30,40,35]
["Agility",-5,15,15,10,10,5,15,0,0,0,0,0,0,0,0,5,0,0,0,0,5,0,0,0,0,0,0,0,0,-10,-10,-10,-10,-10,-5]
["Self Discipline",5,0,0,0,0,0,0,5,5,5,0,0,0,5,0,0,0,5,0,5,-5,0,-5,-5,-5,0,0,0,-5,-10,-10,-10,-10,-10,-5]
["Reasoning",0,5,5,0,0,0,0,0,0,0,0,0,0,0,0,0,0,0,0,0,0,0,0,0,-5,0,0,-5,-10,-15,-15,-15,-15,-15,-5]
["Eloquence",0,0,0,0,0,0,0,0,0,0,0,0,0,0,0,0,0,0,0,0,0,0,0,0,0,0,0,0,0,-5,0,0,0,-5,0]
{"$rows_left_out":290}
{"sheet":"Diverse","index":7,"n_rows":186,"n_cols":14,"rows_kept":186,"cut":false,"hidden":false,"merged":[]}
["Stat value","Bonus","Dev.pts","Baserate","Alchemist","Dwarf","Valt yrke","Nada",null,"Frågor, din dumma djävulsdyrkande och löjliga rollspelsfåne!","Svar på tal, din jävla tattare… du med så sparsam intellektuell begåvning ska passa dig noga!",1]
[1,-25,1,25,"Archer","Noldo (Academic)",{"$f":"INDEX(Diverse!E1:E84,'Ny NPC'!A2)","v":"Alchemist"},"Ett varannan level",null,"Hur kan man sätta tre kryss på två levlar?","Du sätter ett nu och två nästa level…"]
[2,-23,1.3,30,"Archmage","Noldo (Martial)",null,"Ett varje level",null,"Vad kostar det för varje level att sätta tre kryss varannan level?","Det kostar hälften av vad det gör totalt."]
[3,-21,1.6,35,"Assassin","Sinda","Vald ras","Tre på två levlar",null,"Kan jag redigera en gubbe som jag trodde att jag var klar med?","Nä, är du klar så är du klar. Du kan gå in på bladet Master NPC table och ändra själv om du vill."]
[4,-19,1.8,35,"Astrologer","Silvan",{"$f":"INDEX(Diverse!F1:F94,'Ny NPC'!C2)","v":"Dwarf"},"Två varje level",null,"Jag kan välja att slå högre på hits än vad jag borde kunna med den ras jag valt…","Ja, jag vet… men eftersom du har märkt det så antar jag att du inte vill fuska så mycket. Att du alls är i närheten av max-slaget är orimligt!"]
[5,-17,2,40,"Barbarian","Half-elf",null,null,null,"Kan jag fortfarande göra gubben trots att jag gjort av med mer dev.pts än jag har?","Ja, det finns ingen sån spärr. Du är SL, du får bända på reglerna lite grann."]
{"$rows_left_out":181}
{"sheet":"Levelbonus","index":8,"n_rows":22,"n_cols":96,"rows_kept":22,"cut":false,"hidden":false,"merged":[]}
["Profession","Alchemist","Animist","Archer","Archmage","Arcist","Arms Master","Assassin","Astral Traveller","Astrologer","Barbarian","Bard","Bashkar","Beastmaster","Bounty Hunter","Burglar","Cavalier","Chaotic Lord","Channeler","Conjuror","Crafter","Craftsman","Creator","Crystal mage","Cultist","Dancer","Delver","Dervish","Doppelgänger","Dream Lord Illusionist","Dream Lord Shaman","Druid","Duelist","Elementalist","Enchanter","Farmer","Feldsher","Fighter","Forcemage","Free Thinker","Gypsy","Healer","High War monk","Horseman","Houri","Hunter","Illusionist","Indurate","Lancer","Lay Healer","Leader","Macabre","Magician","Magus Chan","Magus Chan/Ess","Magus Ess","Maleficant","Mentalist","Monk","Montebanc","Moon Mage","Mystic","Necromancer","Nightblade","No Profession","Noble Warrior","Outrider","Paladin","Ranger (old)","Ranger","Rogue","Romantic","Runemaster","Sage","Sailor","Scholar","Seeker","Seer","Shadow Mage","Shaikan","Shaman","Sleuth","Sorceror","Swordsman","Tarotmage","Templar","Thief","Trader","Trench Fighter","War Monk","Warlock","Warrior","Warrior Mage","Witch","Witch Hunter","Wizard"]
["Academic skills",3,1,0,3,3,0,0,3,2,0,2,0,0,0,0,0,0,2,3,3,1,2,2,1,0,2,0,0,1,1,1,0,2,1,0,1,0,3,3,0,2,0,0,0,0,3,0,0,1,1,1,3,2,2,2,2,2,1,0,0,2,2,0,1,0,0,0,0,0,0,0,3,1,0,3,3,2,2,0,1,0,2,0,1,1,0,0,0,0,2,0,0,2,0,2]
["Animal",0,3,0,0,0,1,0,0,1,2,0,0,2,2,0,1,0,0,0,0,1,0,1,0,0,0,0,0,0,3,3,0,0,0,3,0,1,0,0,1,0,0,3,0,2,0,0,1,0,0,0,0,0,0,0,1,0,0,0,0,0,0,0,1,1,2,0,3,2,1,0,0,0,0,0,0,0,0,0,3,0,0,0,0,2,1,1,1,2,0,0,0,1,2,0]
["Athletic",0,0,1,0,0,2,1,0,0,2,0,2,1,1,3,2,1,0,0,0,1,0,0,0,3,0,1,0,0,0,0,2,1,1,0,0,2,0,0,0,0,2,1,0,0,0,2,2,0,2,0,0,0,0,0,0,0,2,0,1,0,0,2,1,2,0,1,1,1,2,1,0,0,2,0,0,0,0,1,0,0,0,2,0,1,2,0,1,2,0,3,1,0,0,0]
["Combat",0,0,3,0,0,3,2,0,0,3,0,3,2,2,1,3,2,1,0,0,1,0,0,2,1,2,2,0,0,0,0,3,2,0,0,2,3,0,0,0,0,3,3,0,2,0,3,3,0,3,1,0,0,0,0,0,0,1,1,1,0,0,2,1,3,2,3,1,2,3,3,0,0,3,0,0,0,0,3,0,1,0,3,1,3,2,1,3,2,0,3,2,0,2,0]
["Concentration",0,1,1,2,2,0,0,2,1,0,1,2,0,0,1,0,0,0,0,0,1,0,1,0,0,0,0,0,2,2,0,2,0,0,0,1,0,0,2,0,2,2,0,0,0,0,1,1,1,0,0,1,0,0,0,0,2,1,0,1,3,0,1,1,0,0,0,0,0,0,0,1,3,0,2,0,2,0,2,1,0,1,1,1,0,0,0,2,2,0,0,0,0,0,1]
{"$rows_left_out":17}
{"sheet":"AllaSkills","index":9,"n_rows":317,"n_cols":75,"rows_kept":317,"cut":false,"hidden":false,"merged":[]}
["Skill","Grupp","Stats","Alchemist","Archer","Archmage","Assassin","Astrologer","Barbarian","Bard","Bashkar","Beastmaster","Bounty Hunter","Burglar","Cavalier","Channeler","Conjuror","Craftsman","Crystal mage","Cultist","Dancer","Dervish","Druid","Duelist","Enchanter","Farmer","Feldsher","Fighter","Forcemage","Healer","High War monk","Horseman","Houri","Hunter","Illusionist","Indurate","Lancer","Leader","Macabre","Magician","Mentalist","Monk","Montebanc","Moon Mage","Mystic","Necromancer","Nightblade","No Profession","Outrider","Paladin","Ranger","Rogue","Romantic","Sage","Sailor","Scholar","Seer","Shadow Mage","Shaikan","Shaman","Sleuth","Sorceror","Swordsman","Templar","Thief","Trader","Trench Fighter","War Monk","Warlock","Warrior","Warrior Mage","Witch","Witch Hunter","Wizard","Wizard"]
["Administration","Academic","Re/Pr","2/5","2/6","2/5","2/6","2/5",7,"1/5","6","7","5","2/6","2/6","2/4","2/5","2/6","2/4","2/4","2/5","2/5","6","2/6","2/5","2/6","1/4","2/6","2/5","2/5","6","2/6","2/5","2/6","2/5","4/9","2/6","1/3","2/5","2/5","2/5","3/7","2/6","2/5","2/5","2/5","2/5","2/6","1/3","2/5","5","2/6","2/6","1/2","2/6","1/3","2/5","2/5","2/6","6","1/5","2/5","2/6","2/6","2/5","1/3","3/7","3/7","2/4","6","2/5","5","5","2/5","2/5"]
["Advanced math","Academic","Re","2/5","4/8","3/7","4/7","2/3",7,"3/6","7","7","3/7","3/7","4/8","3/6","3/7","3/7","3/7","3/6","5","3/7","3/7","4/8","3/6","3/7","3/7","4/8","2/5","3/6","7","4/7","3/6","4/7","3/5","4/8","4/8","4/8","3/7","3/7","3/6","3/6","4/7","3/7","3/6","3/7","3/8","3/7","4/7","3/7","3/7","4/7","4/8","1/3","4/7","1/4","3/6","3/7","4/8","3/7","3/6","3/6","4/8","4/8","3/8","2/4","4/7","4/7","3/7","6","3/7","3/7","3/7","3/7","3/7"]
["Alchemy","Academic","Re","1/3","3/7","2/4","3/5","2/4","3/9","2/4","3/6","3/5","3/7","2/6","3/7","2/4","2/5","2/6","3/5","2/4","3/7","3/7","3/6","3/7","2/4","2/6","3/7","3/7","2/4","3/6","3/6","3/5","2/5","3/5","2/7","3/7","3/7","3/7","2/6","2/4","2/6","2/5","3/5","3/7","2/4","2/6","2/6","2/6","3/5","2/7","3/7","3/5","3/7","1/3","3/5","1/4","2/6","2/6","3/7","3/6","2/4","2/5","3/7","3/7","2/6","2/5","3/9","3/9","2/6","6","3/5","1/4","3/7","2/4","2/4"]
["Anthopology","Academic","In/Em","2/5","3","2/5","3","2/5","7","1/4","3/7","6","2/6","3","3","2/5","2/5","2/6","2/7","2/5","3","3","2/5","3","1/4","2/6","2/6","3","2/5","2/5","3/7","3","2/5","3","2/5","3","3","3","2/5","2/5","2/5","2/6","3","3","2/5","2/5","3/6","2/6","3","2/6","2/6","3","3","1/3","3","1/4","2/5","2/5","3","2/5","1/4","2/5","3","3","3","3","2/6","2/6","1/5","6","2/6","2/5","2/6","2/5","2/5"]
["Architecture","Academic","Re/Em","2/5","3/6","2/5","2/5","2/5","5","2/5","4","5","3/6","2/5","3/6","2/4","2/5","2/6","4","2/4","3","4","3/6","3/6","2/5","2/6","3/5","3/6","2/5","2/5","4","2/5","2/5","2/5","2/5","3/6","3/6","2/5","2/5","2/5","2/5","3/6","2/5","4","2/5","2/5","2/4","2/6","2/5","2/5","3/6","2/5","3/6","1/3","2/5","1/3","2/5","2/5","3/6","3/6","2/5","2/5","3/6","3/6","2/4","2/5","3/6","3/6","4","6","3/5","2/5","3/6","2/5","2/5"]
{"$rows_left_out":312}
{"sheet":"2nd","index":10,"n_rows":18,"n_cols":96,"rows_kept":18,"cut":false,"hidden":false,"merged":[]}
["Profession","Alchemist","Animist","Archer","Archmage","Arcist","Arms Master","Assassin","Astral Traveller","Astrologer","Barbarian","Bard","Bashkar","Beastmaster","Bounty Hunter","Burglar","Cavalier","Chaotic Lord","Channeler","Conjuror","Crafter","Craftsman","Creator","Crystal mage","Cultist","Dancer","Delver","Dervish","Doppelgänger","Dream Lord Illusionist","Dream Lord Shaman","Druid","Duelist","Elementalist","Enchanter","Farmer","Feldsher","Fighter","Forcemage","Free Thinker","Gypsy","Healer","High War monk","Horseman","Houri","Hunter","Illusionist","Indurate","Lancer","Lay Healer","Leader","Macabre","Magician","Magus Chan","Magus Chan/Ess","Magus Ess","Maleficant","Mentalist","Monk","Montebanc","Moon Mage","Mystic","Necromancer","Nightblade","No Profession","Noble Warrior","Outrider","Paladin","Ranger (old)","Ranger","Rogue","Romantic","Runemaster","Sage","Sailor","Scholar","Seeker","Seer","Shadow Mage","Shaikan","Shaman","Sleuth","Sorceror","Swordsman","Tarotmage","Templar","Thief","Trader","Trench Fighter","War Monk","Warlock","Warrior","Warrior Mage","Witch","Witch Hunter","Wizard"]
["Academic",34,17,8,34,32,9,12,29,34,8,23,6,10,12,10,16,12,19,34,26,16,25,22,17,9,23,11,13,18,18,15,14,22,22,12,16,14,29,33,10,22,8,10,11,8,23,10,10,22,16,30,30,30,30,30,25,30,18,16,22,30,25,9,20,9,12,16,12,12,10,14,24,38,8,40,32,26,25,12,22,16,30,8,17,18,10,13,11,10,26,6,16,24,14,30]
["Animal",0,9,5,0,0,2,0,0,0,8,0,0,9,4,0,5,0,0,0,0,4,0,0,0,0,3,0,3,0,0,11,2,0,0,12,3,5,0,2,6,2,0,8,1,9,0,0,7,2,5,0,0,0,0,0,5,0,0,2,0,0,0,0,5,2,8,4,7,7,4,1,0,0,0,0,0,0,0,3,7,1,0,5,0,5,4,6,4,5,0,3,2,7,6,0]
["Athletic",0,0,5,0,0,5,9,0,0,10,0,12,7,8,8,8,4,0,0,3,6,0,0,2,15,6,15,0,0,0,1,12,5,7,6,6,10,0,3,6,0,9,8,5,7,0,10,6,0,10,3,0,0,0,0,0,0,6,5,6,0,0,11,5,3,6,4,11,11,8,5,0,0,10,0,0,0,0,7,0,3,0,10,0,6,8,3,12,9,0,8,6,1,5,0]
["Combat",0,0,15,0,0,11,12,0,0,24,9,28,12,14,12,22,6,4,0,0,2,0,0,15,8,3,8,0,0,0,3,21,10,0,8,16,18,0,0,6,0,15,18,7,11,0,25,18,0,14,8,0,0,0,0,0,0,12,10,9,0,0,12,10,11,12,18,12,12,16,16,0,0,16,0,0,0,0,18,0,12,0,20,0,18,13,10,21,13,0,26,14,0,14,0]
["Concentration",1,4,12,4,8,2,8,10,6,14,1,16,2,4,4,7,3,3,5,3,0,7,5,6,8,4,8,7,8,8,4,12,6,8,2,6,8,5,9,4,7,20,2,2,10,5,14,9,8,6,3,5,5,5,5,5,14,10,6,5,10,5,9,5,2,0,6,3,3,6,10,5,7,2,5,5,10,5,15,6,2,5,10,4,8,3,0,11,11,5,12,5,5,6,8]
{"$rows_left_out":12}